gump-general mailing list archives

Site index · List index
Message view « Date » · « Thread »
Top « Date » · « Thread »
From g...@vmgump.apache.org
Subject BATCH: All dressed up, with nowhere to go...
Date Wed, 10 Sep 2014 02:48:20 GMT
Dear Gumpmeisters,
            
The following 3 notifys should have been sent

*********************************************************** G U M P
[GUMP@vmgump]: Project openssl-make-install (in module openssl) failed
[GUMP@vmgump]: Project tika-parsers (in module tika) failed
[GUMP@vmgump]: Project tika-reactor (in module tika) failed
*********************************************************** G U M P
[GUMP@vmgump]: Project openssl-make-install (in module openssl) failed
To whom it may engage...
        
This is an automated request, but not an unsolicited one. For 
more information please visit http://gump.apache.org/nagged.html, 
and/or contact the folk at general@gump.apache.org.

Project openssl-make-install has an issue affecting its community integration.
This issue affects 8 projects,
 and has been outstanding for 121 runs.
The current state of this project is 'Failed', with reason 'Build Failed'.
For reference only, the following projects are affected by this:
    - openssl-make-install :  OpenSSL Encryption Library
    - tomcat-native-configure :  Tomcat native library using Apache Portable Runtime
    - tomcat-native-make :  Tomcat native library using Apache Portable Runtime
    - tomcat-native-make-install :  Tomcat native library using Apache Portable Runtime
    - tomcat-trunk-test-apr :  Tomcat 8.x, a web server implementing the Java Servlet 3.1,
...
    - tomcat-trunk-test-bio :  Tomcat 8.x, a web server implementing the Java Servlet 3.1,
...
    - tomcat-trunk-test-nio :  Tomcat 8.x, a web server implementing the Java Servlet 3.1,
...
    - tomcat-trunk-test-nio2 :  Tomcat 8.x, a web server implementing the Java Servlet 3.1,
...


Full details are available at:
    http://vmgump.apache.org/gump/public/openssl/openssl-make-install/index.html

That said, some information snippets are provided here.

The following annotations (debug/informational/warning/error messages) were provided:
 -INFO- Failed with reason build failed
 -INFO- Failed to extract fallback artifacts from Gump Repository



The following work was performed:
http://vmgump.apache.org/gump/public/openssl/openssl-make-install/gump_work/build_openssl_openssl-make-install.html
Work Name: build_openssl_openssl-make-install (Type: Build)
Work ended in a state of : Failed
Elapsed: 35 secs
Command Line: make install 
[Working Directory: /srv/gump/public/workspace/openssl]
---------------------------------------------
make[2]: Leaving directory `/srv/gump/public/workspace/openssl/crypto/srp'
making install in crypto/cmac...
make[2]: Entering directory `/srv/gump/public/workspace/openssl/crypto/cmac'
make[2]: Leaving directory `/srv/gump/public/workspace/openssl/crypto/cmac'
make[1]: Leaving directory `/srv/gump/public/workspace/openssl/crypto'
making install in ssl...
make[1]: Entering directory `/srv/gump/public/workspace/openssl/ssl'
make[1]: Leaving directory `/srv/gump/public/workspace/openssl/ssl'
making install in engines...
make[1]: Entering directory `/srv/gump/public/workspace/openssl/engines'
installing 4758cca
installing aep
installing atalla
installing cswift
installing gmp
installing chil
installing nuron
installing sureware
installing ubsec
installing padlock
installing capi
making install in engines/ccgost...
make[2]: Entering directory `/srv/gump/public/workspace/openssl/engines/ccgost'
[ -n "/srv/gump/public/workspace/openssl/dest-20140910" ] # should be set by top Makefile...
if [ -n "libcrypto.so.1.1.0 libssl.so.1.1.0" ]; then \
		set -e; \
		echo installing gost; \
		pfx=lib; \
		if expr "linux-x86_64" : "Cygwin" >/dev/null; then \
			sfx=".so"; \
			cp cyggost.dll /srv/gump/public/workspace/openssl/dest-20140910/lib/engines/${pfx}gost$sfx.new;
\
		else; \
			case "-I../../include -fPIC -DOPENSSL_PIC -DOPENSSL_THREADS -D_REENTRANT -DDSO_DLFCN -DHAVE_DLFCN_H
-Wa,--noexecstack -m64 -DL_ENDIAN -DTERMIO -O3 -Wall -DOPENSSL_IA32_SSE2 -DOPENSSL_BN_ASM_MONT
-DOPENSSL_BN_ASM_MONT5 -DOPENSSL_BN_ASM_GF2m -DSHA1_ASM -DSHA256_ASM -DSHA512_ASM -DMD5_ASM
-DAES_ASM -DVPAES_ASM -DBSAES_ASM -DWHIRLPOOL_ASM -DGHASH_ASM" in \
			*DSO_BEOS*) sfx=".so";; \
			*DSO_DLFCN*) sfx=`expr ".so.1.1.0" : '.*\(\.[a-z][a-z]*\)' \| ".so"`;; \
			*DSO_DL*) sfx=".sl";; \
			*DSO_WIN32*) sfx="eay32.dll"; pfx=;; \
			*) sfx=".bad";; \
			esac; \
			cp ${pfx}gost$sfx /srv/gump/public/workspace/openssl/dest-20140910/lib/engines/${pfx}gost$sfx.new;
\
		fi; \
		chmod 555 /srv/gump/public/workspace/openssl/dest-20140910/lib/engines/${pfx}gost$sfx.new;
\
		mv -f /srv/gump/public/workspace/openssl/dest-20140910/lib/engines/${pfx}gost$sfx.new /srv/gump/public/workspace/openssl/dest-20140910/lib/engines/${pfx}gost$sfx;
\
	fi
/bin/sh: 8: Syntax error: ";" unexpected
make[2]: *** [install] Error 2
make[2]: Leaving directory `/srv/gump/public/workspace/openssl/engines/ccgost'
make[1]: *** [install] Error 1
make[1]: Leaving directory `/srv/gump/public/workspace/openssl/engines'
make: *** [install_sw] Error 1
---------------------------------------------

To subscribe to this information via syndicated feeds:
- RSS: http://vmgump.apache.org/gump/public/openssl/openssl-make-install/rss.xml
- Atom: http://vmgump.apache.org/gump/public/openssl/openssl-make-install/atom.xml

============================== Gump Tracking Only ===
Produced by Apache Gump(TM) version 2.3.
Gump Run 20140910000004, vmgump.apache.org:vmgump:20140910000004
Gump E-mail Identifier (unique within run) #1.

*********************************************************** G U M P
[GUMP@vmgump]: Project tika-parsers (in module tika) failed
To whom it may engage...
        
This is an automated request, but not an unsolicited one. For 
more information please visit http://gump.apache.org/nagged.html, 
and/or contact the folk at general@gump.apache.org.

Project tika-parsers has an issue affecting its community integration.
This issue affects 2 projects,
 and has been outstanding for 466 runs.
The current state of this project is 'Failed', with reason 'Build Failed'.
For reference only, the following projects are affected by this:
    - tika-parsers :  Apache Tika is a toolkit for detecting and extracting metada...
    - tika-parsers-test :  Apache Tika is a toolkit for detecting and extracting metada...


Full details are available at:
    http://vmgump.apache.org/gump/public/tika/tika-parsers/index.html

That said, some information snippets are provided here.

The following annotations (debug/informational/warning/error messages) were provided:
 -DEBUG- Sole jar output [tika-parsers-*[0-9T].jar] identifier set to project name
 -DEBUG- (Apache Gump generated) Apache Maven Settings in: /srv/gump/public/workspace/tika/tika-parsers/gump_mvn_settings.xml
 -INFO- Failed with reason build failed
 -DEBUG- Maven POM in: /srv/gump/public/workspace/tika/tika-parsers/pom.xml
 -INFO- Failed to extract fallback artifacts from Gump Repository



The following work was performed:
http://vmgump.apache.org/gump/public/tika/tika-parsers/gump_work/build_tika_tika-parsers.html
Work Name: build_tika_tika-parsers (Type: Build)
Work ended in a state of : Failed
Elapsed: 45 secs
Command Line: /opt/maven2/bin/mvn --batch-mode -DskipTests=true --settings /srv/gump/public/workspace/tika/tika-parsers/gump_mvn_settings.xml
package 
[Working Directory: /srv/gump/public/workspace/tika/tika-parsers]
M2_HOME: /opt/maven2
---------------------------------------------
[INFO] 4 warnings 
[INFO] -------------------------------------------------------------
[INFO] -------------------------------------------------------------
[ERROR] COMPILATION ERROR : 
[INFO] -------------------------------------------------------------
[ERROR] /srv/gump/public/workspace/tika/tika-parsers/src/main/java/org/apache/tika/parser/font/AdobeFontMetricParser.java:[26,30]
cannot find symbol
  symbol:   class FontMetric
  location: package org.apache.fontbox.afm
[ERROR] /srv/gump/public/workspace/tika/tika-parsers/src/main/java/org/apache/tika/parser/font/AdobeFontMetricParser.java:[70,8]
cannot find symbol
  symbol:   class FontMetric
  location: class org.apache.tika.parser.font.AdobeFontMetricParser
[ERROR] /srv/gump/public/workspace/tika/tika-parsers/src/main/java/org/apache/tika/parser/font/AdobeFontMetricParser.java:[75,28]
cannot find symbol
  symbol:   method getResult()
  location: variable parser of type org.apache.fontbox.afm.AFMParser
[ERROR] /srv/gump/public/workspace/tika/tika-parsers/src/main/java/org/apache/tika/parser/font/TrueTypeParser.java:[67,26]
cannot find symbol
  symbol:   method parseTTF(java.io.File)
  location: variable parser of type org.apache.fontbox.ttf.TTFParser
[ERROR] /srv/gump/public/workspace/tika/tika-parsers/src/main/java/org/apache/tika/parser/font/TrueTypeParser.java:[69,26]
cannot find symbol
  symbol:   method parseTTF(java.io.InputStream)
  location: variable parser of type org.apache.fontbox.ttf.TTFParser
[INFO] 5 errors 
[INFO] -------------------------------------------------------------
[INFO] ------------------------------------------------------------------------
[ERROR] BUILD FAILURE
[INFO] ------------------------------------------------------------------------
[INFO] Compilation failure

/srv/gump/public/workspace/tika/tika-parsers/src/main/java/org/apache/tika/parser/font/AdobeFontMetricParser.java:[26,30]
cannot find symbol
  symbol:   class FontMetric
  location: package org.apache.fontbox.afm
/srv/gump/public/workspace/tika/tika-parsers/src/main/java/org/apache/tika/parser/font/AdobeFontMetricParser.java:[70,8]
cannot find symbol
  symbol:   class FontMetric
  location: class org.apache.tika.parser.font.AdobeFontMetricParser
/srv/gump/public/workspace/tika/tika-parsers/src/main/java/org/apache/tika/parser/font/AdobeFontMetricParser.java:[75,28]
cannot find symbol
  symbol:   method getResult()
  location: variable parser of type org.apache.fontbox.afm.AFMParser
/srv/gump/public/workspace/tika/tika-parsers/src/main/java/org/apache/tika/parser/font/TrueTypeParser.java:[67,26]
cannot find symbol
  symbol:   method parseTTF(java.io.File)
  location: variable parser of type org.apache.fontbox.ttf.TTFParser
/srv/gump/public/workspace/tika/tika-parsers/src/main/java/org/apache/tika/parser/font/TrueTypeParser.java:[69,26]
cannot find symbol
  symbol:   method parseTTF(java.io.InputStream)
  location: variable parser of type org.apache.fontbox.ttf.TTFParser

[INFO] ------------------------------------------------------------------------
[INFO] For more information, run Maven with the -e switch
[INFO] ------------------------------------------------------------------------
[INFO] Total time: 44 seconds
[INFO] Finished at: Wed Sep 10 01:06:14 UTC 2014
[INFO] Final Memory: 36M/110M
[INFO] ------------------------------------------------------------------------
---------------------------------------------

To subscribe to this information via syndicated feeds:
- RSS: http://vmgump.apache.org/gump/public/tika/tika-parsers/rss.xml
- Atom: http://vmgump.apache.org/gump/public/tika/tika-parsers/atom.xml

============================== Gump Tracking Only ===
Produced by Apache Gump(TM) version 2.3.
Gump Run 20140910000004, vmgump.apache.org:vmgump:20140910000004
Gump E-mail Identifier (unique within run) #3.

*********************************************************** G U M P
[GUMP@vmgump]: Project tika-reactor (in module tika) failed
To whom it may engage...
        
This is an automated request, but not an unsolicited one. For 
more information please visit http://gump.apache.org/nagged.html, 
and/or contact the folk at general@gump.apache.org.

Project tika-reactor has an issue affecting its community integration.
This issue affects 1 projects,
 and has been outstanding for 466 runs.
The current state of this project is 'Failed', with reason 'Build Failed'.
For reference only, the following projects are affected by this:
    - tika-reactor :  Apache Tika is a toolkit for detecting and extracting metada...


Full details are available at:
    http://vmgump.apache.org/gump/public/tika/tika-reactor/index.html

That said, some information snippets are provided here.

The following annotations (debug/informational/warning/error messages) were provided:
 -INFO- Optional dependency tika-parsers failed with reason build failed
 -DEBUG- (Apache Gump generated) Apache Maven Settings in: /srv/gump/public/workspace/tika/gump_mvn_settings.xml
 -INFO- Failed with reason build failed
 -DEBUG- Maven POM in: /srv/gump/public/workspace/tika/pom.xml



The following work was performed:
http://vmgump.apache.org/gump/public/tika/tika-reactor/gump_work/build_tika_tika-reactor.html
Work Name: build_tika_tika-reactor (Type: Build)
Work ended in a state of : Failed
Elapsed: 29 secs
Command Line: /opt/maven2/bin/mvn --batch-mode -DskipTests=true --settings /srv/gump/public/workspace/tika/gump_mvn_settings.xml
install 
[Working Directory: /srv/gump/public/workspace/tika]
MAVEN_OPTS: -Xmx512m 
M2_HOME: /opt/maven2
---------------------------------------------
[INFO] 4 warnings 
[INFO] -------------------------------------------------------------
[INFO] -------------------------------------------------------------
[ERROR] COMPILATION ERROR : 
[INFO] -------------------------------------------------------------
[ERROR] /srv/gump/public/workspace/tika/tika-parsers/src/main/java/org/apache/tika/parser/font/AdobeFontMetricParser.java:[26,30]
cannot find symbol
  symbol:   class FontMetric
  location: package org.apache.fontbox.afm
[ERROR] /srv/gump/public/workspace/tika/tika-parsers/src/main/java/org/apache/tika/parser/font/AdobeFontMetricParser.java:[70,8]
cannot find symbol
  symbol:   class FontMetric
  location: class org.apache.tika.parser.font.AdobeFontMetricParser
[ERROR] /srv/gump/public/workspace/tika/tika-parsers/src/main/java/org/apache/tika/parser/font/AdobeFontMetricParser.java:[75,28]
cannot find symbol
  symbol:   method getResult()
  location: variable parser of type org.apache.fontbox.afm.AFMParser
[ERROR] /srv/gump/public/workspace/tika/tika-parsers/src/main/java/org/apache/tika/parser/font/TrueTypeParser.java:[67,26]
cannot find symbol
  symbol:   method parseTTF(java.io.File)
  location: variable parser of type org.apache.fontbox.ttf.TTFParser
[ERROR] /srv/gump/public/workspace/tika/tika-parsers/src/main/java/org/apache/tika/parser/font/TrueTypeParser.java:[69,26]
cannot find symbol
  symbol:   method parseTTF(java.io.InputStream)
  location: variable parser of type org.apache.fontbox.ttf.TTFParser
[INFO] 5 errors 
[INFO] -------------------------------------------------------------
[INFO] ------------------------------------------------------------------------
[ERROR] BUILD FAILURE
[INFO] ------------------------------------------------------------------------
[INFO] Compilation failure

/srv/gump/public/workspace/tika/tika-parsers/src/main/java/org/apache/tika/parser/font/AdobeFontMetricParser.java:[26,30]
cannot find symbol
  symbol:   class FontMetric
  location: package org.apache.fontbox.afm
/srv/gump/public/workspace/tika/tika-parsers/src/main/java/org/apache/tika/parser/font/AdobeFontMetricParser.java:[70,8]
cannot find symbol
  symbol:   class FontMetric
  location: class org.apache.tika.parser.font.AdobeFontMetricParser
/srv/gump/public/workspace/tika/tika-parsers/src/main/java/org/apache/tika/parser/font/AdobeFontMetricParser.java:[75,28]
cannot find symbol
  symbol:   method getResult()
  location: variable parser of type org.apache.fontbox.afm.AFMParser
/srv/gump/public/workspace/tika/tika-parsers/src/main/java/org/apache/tika/parser/font/TrueTypeParser.java:[67,26]
cannot find symbol
  symbol:   method parseTTF(java.io.File)
  location: variable parser of type org.apache.fontbox.ttf.TTFParser
/srv/gump/public/workspace/tika/tika-parsers/src/main/java/org/apache/tika/parser/font/TrueTypeParser.java:[69,26]
cannot find symbol
  symbol:   method parseTTF(java.io.InputStream)
  location: variable parser of type org.apache.fontbox.ttf.TTFParser

[INFO] ------------------------------------------------------------------------
[INFO] For more information, run Maven with the -e switch
[INFO] ------------------------------------------------------------------------
[INFO] Total time: 28 seconds
[INFO] Finished at: Wed Sep 10 01:06:44 UTC 2014
[INFO] Final Memory: 61M/146M
[INFO] ------------------------------------------------------------------------
---------------------------------------------

To subscribe to this information via syndicated feeds:
- RSS: http://vmgump.apache.org/gump/public/tika/tika-reactor/rss.xml
- Atom: http://vmgump.apache.org/gump/public/tika/tika-reactor/atom.xml

============================== Gump Tracking Only ===
Produced by Apache Gump(TM) version 2.3.
Gump Run 20140910000004, vmgump.apache.org:vmgump:20140910000004
Gump E-mail Identifier (unique within run) #4.


--
Apache Gump
http://gump.apache.org/ [Instance: vmgump]

---------------------------------------------------------------------
To unsubscribe, e-mail: general-unsubscribe@gump.apache.org
For additional commands, e-mail: general-help@gump.apache.org


Mime
View raw message