gump-general mailing list archives

Site index · List index
Message view « Date » · « Thread »
Top « Date » · « Thread »
From g...@vmgump.apache.org
Subject BATCH: All dressed up, with nowhere to go...
Date Fri, 22 Aug 2014 04:25:33 GMT
Dear Gumpmeisters,
            
The following 3 notifys should have been sent

*********************************************************** G U M P
[GUMP@vmgump]: Project test-ant (in module ant) failed
[GUMP@vmgump]: Project tika-parsers (in module tika) failed
[GUMP@vmgump]: Project tika-reactor (in module tika) failed
*********************************************************** G U M P
[GUMP@vmgump]: Project test-ant (in module ant) failed
To whom it may engage...
        
This is an automated request, but not an unsolicited one. For 
more information please visit http://gump.apache.org/nagged.html, 
and/or contact the folk at general@gump.apache.org.

Project test-ant has an issue affecting its community integration.
This issue affects 1 projects,
 and has been outstanding for 3 runs.
The current state of this project is 'Failed', with reason 'Build Failed'.
For reference only, the following projects are affected by this:
    - test-ant :  Java based build tool


Full details are available at:
    http://vmgump.apache.org/gump/public/ant/test-ant/index.html

That said, some information snippets are provided here.

The following annotations (debug/informational/warning/error messages) were provided:
 -WARNING- Bad *Optional* Dependency. Project: bsh : unknown to *this* workspace
 -INFO- Failed with reason build failed



The following work was performed:
http://vmgump.apache.org/gump/public/ant/test-ant/gump_work/build_ant_test-ant.html
Work Name: build_ant_test-ant (Type: Build)
Work ended in a state of : Failed
Elapsed: 9 mins 16 secs
Command Line: /usr/lib/jvm/java-7-oracle/bin/java -Djava.awt.headless=true -Dbuild.sysclasspath=only
-Xbootclasspath/p:/srv/gump/public/workspace/xml-xerces2/build/xercesImpl.jar:/srv/gump/public/workspace/xml-commons/java/external/build/xml-apis.jar:/srv/gump/public/workspace/xml-xalan/build/xalan-unbundled.jar:/srv/gump/public/workspace/xml-xalan/build/serializer.jar
org.apache.tools.ant.Main -Dgump.merge=/srv/gump/public/gump/work/merge.xml -Dtest.haltonfailure=false
-Dant.home=/srv/gump/public/workspace/ant/dist run-tests 
[Working Directory: /srv/gump/public/workspace/ant]
CLASSPATH: /usr/lib/jvm/java-7-oracle/lib/tools.jar:/srv/gump/public/workspace/ant/build/testcases:/srv/gump/public/workspace/ant/src/tests/junit:/srv/gump/public/workspace/ant/src/etc/testcases:/srv/gump/public/workspace/ant/src/etc/testcases/taskdefs/optional/out:/srv/gump/public/workspace/ant/src/tests/antunit/filters:/srv/gump/public/workspace/ant/src/tests/antunit/taskdefs/importtests:/srv/gump/public/workspace/ant/src/tests/antunit/filters/foo:/srv/gump/public/workspace/ant/src/tests/antunit/taskdefs/foo:/srv/gump/public/workspace/ant/build/antunit/tmp/testinput/build:/srv/gump/public/workspace/ant/build/antunit/tmp/testoutput:/srv/gump/public/workspace/ant/build/antunit/tmp/test.jar:/srv/gump/public/workspace/ant/build/antunit/tmp/test1.jar:/srv/gump/public/workspace/ant/build/antunit/tmp/test2.jar:/srv/gump/public/workspace/ant/build/antunit/tmp/test3.jar:/srv/gump/public/workspace/ant/build/antunit/tmp/test4.jar:/srv/gump/public/workspace/ant/build/antunit/tmp/test5.jar:/srv
 /gump/public/workspace/ant/build/antunit/tmp/resources:/srv/gump/public/workspace/ant/build/lib/ant.jar:/srv/gump/public/workspace/ant/build/lib/ant-launcher.jar:/srv/gump/public/workspace/ant/build/lib/ant-antlr.jar:/srv/gump/public/workspace/ant/build/lib/ant-apache-bcel.jar:/srv/gump/public/workspace/ant/build/lib/ant-apache-bsf.jar:/srv/gump/public/workspace/ant/build/lib/ant-apache-log4j.jar:/srv/gump/public/workspace/ant/build/lib/ant-apache-oro.jar:/srv/gump/public/workspace/ant/build/lib/ant-apache-regexp.jar:/srv/gump/public/workspace/ant/build/lib/ant-apache-resolver.jar:/srv/gump/public/workspace/ant/build/lib/ant-apache-xalan2.jar:/srv/gump/public/workspace/ant/build/lib/ant-commons-logging.jar:/srv/gump/public/workspace/ant/build/lib/ant-commons-net.jar:/srv/gump/public/workspace/ant/build/lib/ant-jai.jar:/srv/gump/public/workspace/ant/build/lib/ant-javamail.jar:/srv/gump/public/workspace/ant/build/lib/ant-jdepend.jar:/srv/gump/public/workspace/ant/build/lib/ant-jmf.jar
 :/srv/gump/public/workspace/ant/build/lib/ant-jsch.jar:/srv/gump/public/workspace/ant/build/lib/ant-junit.jar:/srv/gump/public/workspace/ant/build/lib/ant-junit4.jar:/srv/gump/public/workspace/ant/build/lib/ant-swing.jar:/srv/gump/packages/antlr/antlr-3.1.3.jar:/srv/gump/public/workspace/apache-commons/bcel/target/bcel-6.0-SNAPSHOT.jar:/srv/gump/public/workspace/apache-commons/logging/target/commons-logging-20140822.jar:/srv/gump/public/workspace/apache-commons/logging/target/commons-logging-api-20140822.jar:/srv/gump/public/workspace/apache-commons/net/target/commons-net-3.4-SNAPSHOT.jar:/srv/gump/public/workspace/apache-commons/net/target/commons-net-ftp-3.4-SNAPSHOT.jar:/srv/gump/packages/jaf-1.1ea/activation.jar:/srv/gump/public/workspace/jakarta-bsf/build/lib/bsf.jar:/srv/gump/packages/apache-attic/jakarta-regexp-1.5.jar:/srv/gump/public/workspace/jakarta-servletapi-5/jsr154/dist/lib/servlet-api.jar:/srv/gump/packages/javamail-1.4/mail.jar:/srv/gump/packages/javamail-1.4/lib/ma
 ilapi.jar:/srv/gump/packages/jdepend-2.6/lib/jdepend.jar:/srv/gump/packages/jsch/jsch-0.1.45.jar:/srv/gump/public/workspace/logging-log4j-12/target/log4j-1.2.18-SNAPSHOT.jar:/srv/gump/packages/apache-attic/oro-2.0.8.jar:/srv/gump/public/workspace/antlibs-antunit/build/ant-antunit-20140822.jar:/srv/gump/public/workspace/hamcrest/hamcrest-java/build/hamcrest-core-20140822.jar:/srv/gump/public/workspace/hamcrest/hamcrest-java/build/hamcrest-generator-20140822.jar:/srv/gump/public/workspace/hamcrest/hamcrest-java/build/hamcrest-library-20140822.jar:/srv/gump/public/workspace/junit/target/junit-4.12-SNAPSHOT.jar:/srv/gump/public/workspace/xml-commons/java/external/build/xml-apis-ext.jar:/srv/gump/public/workspace/commons-codec-1.x/dist/commons-codec-20140822.jar
---------------------------------------------
[au:antunit] Target: testStringTokenizer took 0.001 sec
[au:antunit] Target: testExplicitLines took 0.001 sec
[au:antunit] Build File: /srv/gump/public/workspace/ant/src/tests/antunit/types/selectors/depend-test.xml
[au:antunit] Tests run: 1, Failures: 0, Errors: 0, Time elapsed: 0.008 sec
[au:antunit] Target: testMapperByTypedef took 0.006 sec
[au:antunit] Build File: /srv/gump/public/workspace/ant/src/tests/antunit/types/selectors/different-test.xml
[au:antunit] Tests run: 1, Failures: 0, Errors: 0, Time elapsed: 0.008 sec
[au:antunit] Target: testMapperByTypedef took 0.003 sec
[au:antunit] Build File: /srv/gump/public/workspace/ant/src/tests/antunit/types/selectors/filename-test.xml
[au:antunit] Tests run: 2, Failures: 0, Errors: 0, Time elapsed: 0.018 sec
[au:antunit] Target: testRegex took 0.003 sec
[au:antunit] Target: testPattern took 0.006 sec
[au:antunit] Build File: /srv/gump/public/workspace/ant/src/tests/antunit/types/selectors/modified-test.xml
[au:antunit] Tests run: 1, Failures: 0, Errors: 0, Time elapsed: 0.02 sec
[au:antunit] Target: testUpdate took 0.009 sec
[au:antunit] Build File: /srv/gump/public/workspace/ant/src/tests/antunit/types/selectors/present-test.xml
[au:antunit] Tests run: 1, Failures: 0, Errors: 0, Time elapsed: 0.007 sec
[au:antunit] Target: testMapperByTypedef took 0.006 sec
[au:antunit] Build File: /srv/gump/public/workspace/ant/src/tests/antunit/types/selectors/readwrite-test.xml
[au:antunit] Tests run: 4, Failures: 0, Errors: 0, Time elapsed: 0.018 sec
[au:antunit] Target: testWritable took 0.002 sec
[au:antunit] Target: testAsConditions took 0.003 sec
[au:antunit] Target: testReadable took 0.001 sec
[au:antunit] Target: testUnwritable took 0.002 sec
[au:antunit] Build File: /srv/gump/public/workspace/ant/src/tests/antunit/types/selectors/select-test.xml
[au:antunit] Tests run: 4, Failures: 0, Errors: 0, Time elapsed: 0.035 sec
[au:antunit] Target: testIfFalse took 0.003 sec
[au:antunit] Target: testIfNotSet took 0.002 sec
[au:antunit] Target: testIfTrue took 0.002 sec
[au:antunit] Target: testIfSet took 0.004 sec
[au:antunit] Build File: /srv/gump/public/workspace/ant/src/tests/antunit/types/tarfileset-test.xml
[au:antunit] Tests run: 2, Failures: 0, Errors: 0, Time elapsed: 0.006 sec
[au:antunit] Target: testMissingArchive took 0.001 sec
[au:antunit] Target: testMissingArchiveDoesntMatter took 0 sec
[au:antunit] Build File: /srv/gump/public/workspace/ant/src/tests/antunit/types/zipfileset-test.xml
[au:antunit] Tests run: 5, Failures: 0, Errors: 0, Time elapsed: 0.036 sec
[au:antunit] Target: testMissingArchive took 0.001 sec
[au:antunit] Target: test-refid-check-encoding took 0 sec
[au:antunit] Target: test-refid-modify took 0.021 sec
[au:antunit] Target: test-refid-check-prefix took 0.001 sec
[au:antunit] Target: testMissingArchiveDoesntMatter took 0 sec

check-failed:

run-tests:

BUILD FAILED
/srv/gump/public/workspace/ant/build.xml:1610: Unit tests failed

Total time: 9 minutes 16 seconds
---------------------------------------------

To subscribe to this information via syndicated feeds:
- RSS: http://vmgump.apache.org/gump/public/ant/test-ant/rss.xml
- Atom: http://vmgump.apache.org/gump/public/ant/test-ant/atom.xml

============================== Gump Tracking Only ===
Produced by Apache Gump(TM) version 2.3.
Gump Run 20140822000004, vmgump.apache.org:vmgump:20140822000004
Gump E-mail Identifier (unique within run) #2.

*********************************************************** G U M P
[GUMP@vmgump]: Project tika-parsers (in module tika) failed
To whom it may engage...
        
This is an automated request, but not an unsolicited one. For 
more information please visit http://gump.apache.org/nagged.html, 
and/or contact the folk at general@gump.apache.org.

Project tika-parsers has an issue affecting its community integration.
This issue affects 2 projects,
 and has been outstanding for 400 runs.
The current state of this project is 'Failed', with reason 'Build Failed'.
For reference only, the following projects are affected by this:
    - tika-parsers :  Apache Tika is a toolkit for detecting and extracting metada...
    - tika-parsers-test :  Apache Tika is a toolkit for detecting and extracting metada...


Full details are available at:
    http://vmgump.apache.org/gump/public/tika/tika-parsers/index.html

That said, some information snippets are provided here.

The following annotations (debug/informational/warning/error messages) were provided:
 -DEBUG- Sole jar output [tika-parsers-*[0-9T].jar] identifier set to project name
 -DEBUG- (Apache Gump generated) Apache Maven Settings in: /srv/gump/public/workspace/tika/tika-parsers/gump_mvn_settings.xml
 -INFO- Failed with reason build failed
 -DEBUG- Maven POM in: /srv/gump/public/workspace/tika/tika-parsers/pom.xml
 -INFO- Failed to extract fallback artifacts from Gump Repository



The following work was performed:
http://vmgump.apache.org/gump/public/tika/tika-parsers/gump_work/build_tika_tika-parsers.html
Work Name: build_tika_tika-parsers (Type: Build)
Work ended in a state of : Failed
Elapsed: 49 secs
Command Line: /opt/maven2/bin/mvn --batch-mode -DskipTests=true --settings /srv/gump/public/workspace/tika/tika-parsers/gump_mvn_settings.xml
package 
[Working Directory: /srv/gump/public/workspace/tika/tika-parsers]
M2_HOME: /opt/maven2
---------------------------------------------
Downloading: http://jbig2-imageio.googlecode.com/svn/maven-repository//org/apache/pdfbox/jempbox/1.8.6/jempbox-1.8.6.jar
[INFO] Unable to find resource 'org.apache.pdfbox:jempbox:jar:1.8.6' in repository jbig2.googlecode
(http://jbig2-imageio.googlecode.com/svn/maven-repository/)
Downloading: http://www.mygrid.org.uk/maven/repository/org/apache/pdfbox/jempbox/1.8.6/jempbox-1.8.6.jar
[INFO] Unable to find resource 'edu.ucar:unidataCommon:jar:4.2.20' in repository geotoolkit
(http://maven.geotoolkit.org/)
Downloading: http://localhost:8192/maven2/edu/ucar/unidataCommon/4.2.20/unidataCommon-4.2.20.jar
205K downloaded  (unidataCommon-4.2.20.jar)
[INFO] Unable to find resource 'org.apache.pdfbox:jempbox:jar:1.8.6' in repository mygrid-repository
(http://www.mygrid.org.uk/maven/repository)
Downloading: http://localhost:8192/maven2/org/apache/pdfbox/jempbox/1.8.6/jempbox-1.8.6.jar
49K downloaded  (jempbox-1.8.6.jar)
5040K downloaded  (poi-ooxml-schemas-3.11-beta2.jar)
[debug] execute contextualize
[INFO] [resources:resources {execution: default-resources}]
[INFO] Using 'UTF-8' encoding to copy filtered resources.
[INFO] Copying 5 resources
[INFO] Copying 3 resources
[INFO] [compiler:compile {execution: default-compile}]
[INFO] Changes detected - recompiling the module!
[INFO] Compiling 142 source files to /srv/gump/public/workspace/tika/tika-parsers/target/classes
[INFO] -------------------------------------------------------------
[WARNING] COMPILATION WARNING : 
[INFO] -------------------------------------------------------------
[WARNING] /srv/gump/public/workspace/tika/tika-parsers/src/main/java/org/apache/tika/parser/odf/OpenDocumentMetaParser.java:
Some input files use or override a deprecated API.
[WARNING] /srv/gump/public/workspace/tika/tika-parsers/src/main/java/org/apache/tika/parser/odf/OpenDocumentMetaParser.java:
Recompile with -Xlint:deprecation for details.
[WARNING] /srv/gump/public/workspace/tika/tika-parsers/src/main/java/org/apache/tika/parser/video/FLVParser.java:
/srv/gump/public/workspace/tika/tika-parsers/src/main/java/org/apache/tika/parser/video/FLVParser.java
uses unchecked or unsafe operations.
[WARNING] /srv/gump/public/workspace/tika/tika-parsers/src/main/java/org/apache/tika/parser/video/FLVParser.java:
Recompile with -Xlint:unchecked for details.
[INFO] 4 warnings 
[INFO] -------------------------------------------------------------
[INFO] -------------------------------------------------------------
[ERROR] COMPILATION ERROR : 
[INFO] -------------------------------------------------------------
[ERROR] /srv/gump/public/workspace/tika/tika-parsers/src/main/java/org/apache/tika/parser/font/AdobeFontMetricParser.java:[75,28]
cannot find symbol
  symbol:   method getResult()
  location: variable parser of type org.apache.fontbox.afm.AFMParser
[INFO] 1 error
[INFO] -------------------------------------------------------------
[INFO] ------------------------------------------------------------------------
[ERROR] BUILD FAILURE
[INFO] ------------------------------------------------------------------------
[INFO] Compilation failure
/srv/gump/public/workspace/tika/tika-parsers/src/main/java/org/apache/tika/parser/font/AdobeFontMetricParser.java:[75,28]
cannot find symbol
  symbol:   method getResult()
  location: variable parser of type org.apache.fontbox.afm.AFMParser

[INFO] ------------------------------------------------------------------------
[INFO] For more information, run Maven with the -e switch
[INFO] ------------------------------------------------------------------------
[INFO] Total time: 48 seconds
[INFO] Finished at: Fri Aug 22 01:07:05 UTC 2014
[INFO] Final Memory: 36M/109M
[INFO] ------------------------------------------------------------------------
---------------------------------------------

To subscribe to this information via syndicated feeds:
- RSS: http://vmgump.apache.org/gump/public/tika/tika-parsers/rss.xml
- Atom: http://vmgump.apache.org/gump/public/tika/tika-parsers/atom.xml

============================== Gump Tracking Only ===
Produced by Apache Gump(TM) version 2.3.
Gump Run 20140822000004, vmgump.apache.org:vmgump:20140822000004
Gump E-mail Identifier (unique within run) #3.

*********************************************************** G U M P
[GUMP@vmgump]: Project tika-reactor (in module tika) failed
To whom it may engage...
        
This is an automated request, but not an unsolicited one. For 
more information please visit http://gump.apache.org/nagged.html, 
and/or contact the folk at general@gump.apache.org.

Project tika-reactor has an issue affecting its community integration.
This issue affects 1 projects,
 and has been outstanding for 400 runs.
The current state of this project is 'Failed', with reason 'Build Failed'.
For reference only, the following projects are affected by this:
    - tika-reactor :  Apache Tika is a toolkit for detecting and extracting metada...


Full details are available at:
    http://vmgump.apache.org/gump/public/tika/tika-reactor/index.html

That said, some information snippets are provided here.

The following annotations (debug/informational/warning/error messages) were provided:
 -INFO- Optional dependency tika-parsers failed with reason build failed
 -DEBUG- (Apache Gump generated) Apache Maven Settings in: /srv/gump/public/workspace/tika/gump_mvn_settings.xml
 -INFO- Failed with reason build failed
 -DEBUG- Maven POM in: /srv/gump/public/workspace/tika/pom.xml



The following work was performed:
http://vmgump.apache.org/gump/public/tika/tika-reactor/gump_work/build_tika_tika-reactor.html
Work Name: build_tika_tika-reactor (Type: Build)
Work ended in a state of : Failed
Elapsed: 31 secs
Command Line: /opt/maven2/bin/mvn --batch-mode -DskipTests=true --settings /srv/gump/public/workspace/tika/gump_mvn_settings.xml
install 
[Working Directory: /srv/gump/public/workspace/tika]
MAVEN_OPTS: -Xmx512m 
M2_HOME: /opt/maven2
---------------------------------------------
[INFO] Installing /srv/gump/public/workspace/tika/tika-core/target/tika-core-1.7-SNAPSHOT.jar
to /srv/gump/public/workspace/mvnlocalrepo/shared/org/apache/tika/tika-core/1.7-SNAPSHOT/tika-core-1.7-SNAPSHOT.jar
[INFO] Installing /srv/gump/public/workspace/tika/tika-core/target/tika-core-1.7-SNAPSHOT-tests.jar
to /srv/gump/public/workspace/mvnlocalrepo/shared/org/apache/tika/tika-core/1.7-SNAPSHOT/tika-core-1.7-SNAPSHOT-tests.jar
[INFO] [bundle:install {execution: default-install}]
[INFO] Installing org/apache/tika/tika-core/1.7-SNAPSHOT/tika-core-1.7-SNAPSHOT.jar
[INFO] Writing OBR metadata
[INFO] ------------------------------------------------------------------------
[INFO] Building Apache Tika parsers
[INFO]    task-segment: [install]
[INFO] ------------------------------------------------------------------------
[INFO] [remote-resources:process {execution: default}]
[debug] execute contextualize
[INFO] [resources:resources {execution: default-resources}]
[INFO] Using 'UTF-8' encoding to copy filtered resources.
[INFO] Copying 5 resources
[INFO] Copying 3 resources
[INFO] [compiler:compile {execution: default-compile}]
[INFO] Changes detected - recompiling the module!
[INFO] Compiling 142 source files to /srv/gump/public/workspace/tika/tika-parsers/target/classes
[INFO] -------------------------------------------------------------
[WARNING] COMPILATION WARNING : 
[INFO] -------------------------------------------------------------
[WARNING] /srv/gump/public/workspace/tika/tika-parsers/src/main/java/org/apache/tika/parser/odf/OpenDocumentMetaParser.java:
Some input files use or override a deprecated API.
[WARNING] /srv/gump/public/workspace/tika/tika-parsers/src/main/java/org/apache/tika/parser/odf/OpenDocumentMetaParser.java:
Recompile with -Xlint:deprecation for details.
[WARNING] /srv/gump/public/workspace/tika/tika-parsers/src/main/java/org/apache/tika/parser/video/FLVParser.java:
/srv/gump/public/workspace/tika/tika-parsers/src/main/java/org/apache/tika/parser/video/FLVParser.java
uses unchecked or unsafe operations.
[WARNING] /srv/gump/public/workspace/tika/tika-parsers/src/main/java/org/apache/tika/parser/video/FLVParser.java:
Recompile with -Xlint:unchecked for details.
[INFO] 4 warnings 
[INFO] -------------------------------------------------------------
[INFO] -------------------------------------------------------------
[ERROR] COMPILATION ERROR : 
[INFO] -------------------------------------------------------------
[ERROR] /srv/gump/public/workspace/tika/tika-parsers/src/main/java/org/apache/tika/parser/font/AdobeFontMetricParser.java:[75,28]
cannot find symbol
  symbol:   method getResult()
  location: variable parser of type org.apache.fontbox.afm.AFMParser
[INFO] 1 error
[INFO] -------------------------------------------------------------
[INFO] ------------------------------------------------------------------------
[ERROR] BUILD FAILURE
[INFO] ------------------------------------------------------------------------
[INFO] Compilation failure
/srv/gump/public/workspace/tika/tika-parsers/src/main/java/org/apache/tika/parser/font/AdobeFontMetricParser.java:[75,28]
cannot find symbol
  symbol:   method getResult()
  location: variable parser of type org.apache.fontbox.afm.AFMParser

[INFO] ------------------------------------------------------------------------
[INFO] For more information, run Maven with the -e switch
[INFO] ------------------------------------------------------------------------
[INFO] Total time: 30 seconds
[INFO] Finished at: Fri Aug 22 01:07:37 UTC 2014
[INFO] Final Memory: 63M/170M
[INFO] ------------------------------------------------------------------------
---------------------------------------------

To subscribe to this information via syndicated feeds:
- RSS: http://vmgump.apache.org/gump/public/tika/tika-reactor/rss.xml
- Atom: http://vmgump.apache.org/gump/public/tika/tika-reactor/atom.xml

============================== Gump Tracking Only ===
Produced by Apache Gump(TM) version 2.3.
Gump Run 20140822000004, vmgump.apache.org:vmgump:20140822000004
Gump E-mail Identifier (unique within run) #4.


--
Apache Gump
http://gump.apache.org/ [Instance: vmgump]

---------------------------------------------------------------------
To unsubscribe, e-mail: general-unsubscribe@gump.apache.org
For additional commands, e-mail: general-help@gump.apache.org


Mime
View raw message