gump-general mailing list archives

Site index · List index
Message view « Date » · « Thread »
Top « Date » · « Thread »
From g...@vmgump.apache.org
Subject BATCH: All dressed up, with nowhere to go...
Date Wed, 06 Aug 2014 02:48:42 GMT
Dear Gumpmeisters,
            
The following 3 notifys should have been sent

*********************************************************** G U M P
[GUMP@vmgump]: Project poi-ooxml-deps (in module poi) failed
[GUMP@vmgump]: Project tika-parsers (in module tika) failed
[GUMP@vmgump]: Project tika-reactor (in module tika) failed
*********************************************************** G U M P
[GUMP@vmgump]: Project poi-ooxml-deps (in module poi) failed
To whom it may engage...
        
This is an automated request, but not an unsolicited one. For 
more information please visit http://gump.apache.org/nagged.html, 
and/or contact the folk at general@gump.apache.org.

Project poi-ooxml-deps has an issue affecting its community integration.
This issue affects 7 projects,
 and has been outstanding for 4 runs.
The current state of this project is 'Failed', with reason 'Missing Build Outputs'.
For reference only, the following projects are affected by this:
    - ooxml-encryption-schemas :  POI
    - ooxml-schemas :  POI
    - org.apache.poi :  POI
    - poi :  POI
    - poi-ooxml-deps :  POI
    - poi-ooxml-schemas :  POI
    - poi-test :  POI


Full details are available at:
    http://vmgump.apache.org/gump/public/poi/poi-ooxml-deps/index.html

That said, some information snippets are provided here.

The following annotations (debug/informational/warning/error messages) were provided:
 -INFO- Failed with reason missing build outputs
 -ERROR- /srv/gump/public/workspace/poi/ooxml-lib/xmlbeans-*[0-9T].jar matched 2 files.
 -ERROR- Missing Output: /srv/gump/public/workspace/poi/ooxml-lib/xmlbeans-*[0-9T].jar
 -ERROR- See Directory Listing Work for Missing Outputs
 -DEBUG- Extracted fallback artifacts from Gump Repository



The following work was performed:
http://vmgump.apache.org/gump/public/poi/poi-ooxml-deps/gump_work/build_poi_poi-ooxml-deps.html
Work Name: build_poi_poi-ooxml-deps (Type: Build)
Work ended in a state of : Success
Elapsed: 2 secs
Command Line: /usr/lib/jvm/java-7-oracle/bin/java -Djava.awt.headless=true -Dbuild.sysclasspath=only
org.apache.tools.ant.Main -Dgump.merge=/srv/gump/public/gump/work/merge.xml fetch-ooxml-jars

[Working Directory: /srv/gump/public/workspace/poi]
CLASSPATH: /usr/lib/jvm/java-7-oracle/lib/tools.jar:/srv/gump/public/workspace/ant/dist/lib/ant.jar:/srv/gump/public/workspace/ant/dist/lib/ant-launcher.jar:/srv/gump/public/workspace/ant/dist/lib/ant-jmf.jar:/srv/gump/public/workspace/ant/dist/lib/ant-junit.jar:/srv/gump/public/workspace/ant/dist/lib/ant-junit4.jar:/srv/gump/public/workspace/ant/dist/lib/ant-swing.jar:/srv/gump/public/workspace/ant/dist/lib/ant-apache-resolver.jar:/srv/gump/public/workspace/ant/dist/lib/ant-apache-xalan2.jar:/srv/gump/public/workspace/xml-commons/java/build/resolver.jar
---------------------------------------------
Buildfile: /srv/gump/public/workspace/poi/build.xml

check-ooxml-jars:

fetch-ooxml-jars:

testexist:

downloadfile:
      [get] Getting: http://repo1.maven.org/maven2/dom4j/dom4j/1.6.1/dom4j-1.6.1.jar
      [get] To: /srv/gump/public/workspace/poi/ooxml-lib/dom4j-1.6.1.jar

testexist:

downloadfile:
      [get] Getting: http://repo1.maven.org/maven2/org/apache/xmlbeans/xmlbeans/2.3.0/xmlbeans-2.3.0.jar
      [get] To: /srv/gump/public/workspace/poi/ooxml-lib/xmlbeans-2.3.0.jar

testexist:

downloadfile:
      [get] Getting: http://repo1.maven.org/maven2/org/apache/xmlbeans/xmlbeans/2.6.0/xmlbeans-2.6.0.jar
      [get] To: /srv/gump/public/workspace/poi/ooxml-lib/xmlbeans-2.6.0.jar

BUILD SUCCESSFUL
Total time: 2 seconds
---------------------------------------------

To subscribe to this information via syndicated feeds:
- RSS: http://vmgump.apache.org/gump/public/poi/poi-ooxml-deps/rss.xml
- Atom: http://vmgump.apache.org/gump/public/poi/poi-ooxml-deps/atom.xml

============================== Gump Tracking Only ===
Produced by Apache Gump(TM) version 2.3.
Gump Run 20140806000005, vmgump.apache.org:vmgump:20140806000005
Gump E-mail Identifier (unique within run) #1.

*********************************************************** G U M P
[GUMP@vmgump]: Project tika-parsers (in module tika) failed
To whom it may engage...
        
This is an automated request, but not an unsolicited one. For 
more information please visit http://gump.apache.org/nagged.html, 
and/or contact the folk at general@gump.apache.org.

Project tika-parsers has an issue affecting its community integration.
This issue affects 2 projects,
 and has been outstanding for 336 runs.
The current state of this project is 'Failed', with reason 'Build Failed'.
For reference only, the following projects are affected by this:
    - tika-parsers :  Apache Tika is a toolkit for detecting and extracting metada...
    - tika-parsers-test :  Apache Tika is a toolkit for detecting and extracting metada...


Full details are available at:
    http://vmgump.apache.org/gump/public/tika/tika-parsers/index.html

That said, some information snippets are provided here.

The following annotations (debug/informational/warning/error messages) were provided:
 -DEBUG- Sole jar output [tika-parsers-*[0-9T].jar] identifier set to project name
 -INFO- Optional dependency org.apache.poi prerequisite failed with reason missing build outputs
 -DEBUG- (Apache Gump generated) Apache Maven Settings in: /srv/gump/public/workspace/tika/tika-parsers/gump_mvn_settings.xml
 -INFO- Failed with reason build failed
 -DEBUG- Maven POM in: /srv/gump/public/workspace/tika/tika-parsers/pom.xml
 -INFO- Failed to extract fallback artifacts from Gump Repository



The following work was performed:
http://vmgump.apache.org/gump/public/tika/tika-parsers/gump_work/build_tika_tika-parsers.html
Work Name: build_tika_tika-parsers (Type: Build)
Work ended in a state of : Failed
Elapsed: 53 secs
Command Line: /opt/maven2/bin/mvn --batch-mode -DskipTests=true --settings /srv/gump/public/workspace/tika/tika-parsers/gump_mvn_settings.xml
package 
[Working Directory: /srv/gump/public/workspace/tika/tika-parsers]
M2_HOME: /opt/maven2
---------------------------------------------
Downloading: http://localhost:8192/maven2/org/apache/poi/poi-ooxml-schemas/3.11-beta1/poi-ooxml-schemas-3.11-beta1.jar
[INFO] Unable to find resource 'net.jcip:jcip-annotations:jar:1.0' in repository geotoolkit
(http://maven.geotoolkit.org/)
Downloading: http://localhost:8192/maven2/net/jcip/jcip-annotations/1.0/jcip-annotations-1.0.jar
[INFO] Unable to find resource 'org.slf4j:slf4j-api:jar:1.6.1' in repository geotoolkit (http://maven.geotoolkit.org/)
2K downloaded  (jcip-annotations-1.0.jar)
Downloading: http://localhost:8192/maven2/org/slf4j/slf4j-api/1.6.1/slf4j-api-1.6.1.jar
24K downloaded  (slf4j-api-1.6.1.jar)
Downloading: http://localhost:8192/maven2/org/slf4j/slf4j-log4j12/1.6.1/slf4j-log4j12-1.6.1.jar
9K downloaded  (slf4j-log4j12-1.6.1.jar)
[INFO] Unable to find resource 'edu.ucar:unidataCommon:jar:4.2.20' in repository Oracle (http://download.oracle.com/maven)
Downloading: http://maven.geotoolkit.org//edu/ucar/unidataCommon/4.2.20/unidataCommon-4.2.20.jar
5040K downloaded  (poi-ooxml-schemas-3.11-beta1.jar)
[INFO] Unable to find resource 'edu.ucar:unidataCommon:jar:4.2.20' in repository geotoolkit
(http://maven.geotoolkit.org/)
Downloading: http://localhost:8192/maven2/edu/ucar/unidataCommon/4.2.20/unidataCommon-4.2.20.jar
205K downloaded  (unidataCommon-4.2.20.jar)
[INFO] Unable to find resource 'org.apache.pdfbox:fontbox:jar:1.8.6' in repository mygrid-repository
(http://www.mygrid.org.uk/maven/repository)
Downloading: http://localhost:8192/maven2/org/apache/pdfbox/fontbox/1.8.6/fontbox-1.8.6.jar
241K downloaded  (fontbox-1.8.6.jar)
Downloading: http://jbig2-imageio.googlecode.com/svn/maven-repository//org/apache/pdfbox/jempbox/1.8.6/jempbox-1.8.6.jar
[INFO] Unable to find resource 'org.apache.pdfbox:jempbox:jar:1.8.6' in repository jbig2.googlecode
(http://jbig2-imageio.googlecode.com/svn/maven-repository/)
Downloading: http://www.mygrid.org.uk/maven/repository/org/apache/pdfbox/jempbox/1.8.6/jempbox-1.8.6.jar
[INFO] Unable to find resource 'org.apache.pdfbox:jempbox:jar:1.8.6' in repository mygrid-repository
(http://www.mygrid.org.uk/maven/repository)
Downloading: http://localhost:8192/maven2/org/apache/pdfbox/jempbox/1.8.6/jempbox-1.8.6.jar
49K downloaded  (jempbox-1.8.6.jar)
[debug] execute contextualize
[INFO] [resources:resources {execution: default-resources}]
[INFO] Using 'UTF-8' encoding to copy filtered resources.
[INFO] Copying 5 resources
[INFO] Copying 3 resources
[INFO] [compiler:compile {execution: default-compile}]
[INFO] Compiling 142 source files to /srv/gump/public/workspace/tika/tika-parsers/target/classes
[INFO] -------------------------------------------------------------
[ERROR] COMPILATION ERROR : 
[INFO] -------------------------------------------------------------
[ERROR] /srv/gump/public/workspace/tika/tika-parsers/src/main/java/org/apache/tika/parser/font/AdobeFontMetricParser.java:[75,27]
error: cannot find symbol
[INFO] 1 error
[INFO] -------------------------------------------------------------
[INFO] ------------------------------------------------------------------------
[ERROR] BUILD FAILURE
[INFO] ------------------------------------------------------------------------
[INFO] Compilation failure
/srv/gump/public/workspace/tika/tika-parsers/src/main/java/org/apache/tika/parser/font/AdobeFontMetricParser.java:[75,27]
error: cannot find symbol

[INFO] ------------------------------------------------------------------------
[INFO] For more information, run Maven with the -e switch
[INFO] ------------------------------------------------------------------------
[INFO] Total time: 52 seconds
[INFO] Finished at: Wed Aug 06 00:52:03 UTC 2014
[INFO] Final Memory: 31M/91M
[INFO] ------------------------------------------------------------------------
---------------------------------------------

To subscribe to this information via syndicated feeds:
- RSS: http://vmgump.apache.org/gump/public/tika/tika-parsers/rss.xml
- Atom: http://vmgump.apache.org/gump/public/tika/tika-parsers/atom.xml

============================== Gump Tracking Only ===
Produced by Apache Gump(TM) version 2.3.
Gump Run 20140806000005, vmgump.apache.org:vmgump:20140806000005
Gump E-mail Identifier (unique within run) #3.

*********************************************************** G U M P
[GUMP@vmgump]: Project tika-reactor (in module tika) failed
To whom it may engage...
        
This is an automated request, but not an unsolicited one. For 
more information please visit http://gump.apache.org/nagged.html, 
and/or contact the folk at general@gump.apache.org.

Project tika-reactor has an issue affecting its community integration.
This issue affects 1 projects,
 and has been outstanding for 336 runs.
The current state of this project is 'Failed', with reason 'Build Failed'.
For reference only, the following projects are affected by this:
    - tika-reactor :  Apache Tika is a toolkit for detecting and extracting metada...


Full details are available at:
    http://vmgump.apache.org/gump/public/tika/tika-reactor/index.html

That said, some information snippets are provided here.

The following annotations (debug/informational/warning/error messages) were provided:
 -INFO- Optional dependency tika-parsers failed with reason build failed
 -DEBUG- (Apache Gump generated) Apache Maven Settings in: /srv/gump/public/workspace/tika/gump_mvn_settings.xml
 -INFO- Failed with reason build failed
 -DEBUG- Maven POM in: /srv/gump/public/workspace/tika/pom.xml



The following work was performed:
http://vmgump.apache.org/gump/public/tika/tika-reactor/gump_work/build_tika_tika-reactor.html
Work Name: build_tika_tika-reactor (Type: Build)
Work ended in a state of : Failed
Elapsed: 25 secs
Command Line: /opt/maven2/bin/mvn --batch-mode -DskipTests=true --settings /srv/gump/public/workspace/tika/gump_mvn_settings.xml
install 
[Working Directory: /srv/gump/public/workspace/tika]
MAVEN_OPTS: -Xmx512m 
M2_HOME: /opt/maven2
---------------------------------------------
4K downloaded  (tika-core-1.0.pom)
Downloading: http://localhost:8192/maven2/org/apache/tika/tika-parent/1.0/tika-parent-1.0.pom
9K downloaded  (tika-parent-1.0.pom)
[WARNING] POM for 'biz.aQute:bndlib:pom:1.43.0:provided' is invalid.

Its dependencies (if any) will NOT be available to the current build.
Downloading: http://localhost:8192/maven2/junit/junit/4.10/junit-4.10.jar
Downloading: http://localhost:8192/maven2/org/hamcrest/hamcrest-core/1.1/hamcrest-core-1.1.jar
64K downloaded  (hamcrest-core-1.1.jar)
283K downloaded  (junit-4.10.jar)
[INFO] Succeeded with 0 errors; 0 warnings; and 0 other changes.
[INFO] [failsafe:verify {execution: default}]
[INFO] Tests are skipped.
[INFO] [install:install {execution: default-install}]
[INFO] Installing /srv/gump/public/workspace/tika/tika-core/target/tika-core-1.7-SNAPSHOT.jar
to /srv/gump/public/workspace/mvnlocalrepo/shared/org/apache/tika/tika-core/1.7-SNAPSHOT/tika-core-1.7-SNAPSHOT.jar
[INFO] Installing /srv/gump/public/workspace/tika/tika-core/target/tika-core-1.7-SNAPSHOT-tests.jar
to /srv/gump/public/workspace/mvnlocalrepo/shared/org/apache/tika/tika-core/1.7-SNAPSHOT/tika-core-1.7-SNAPSHOT-tests.jar
[INFO] [bundle:install {execution: default-install}]
[INFO] Installing org/apache/tika/tika-core/1.7-SNAPSHOT/tika-core-1.7-SNAPSHOT.jar
[INFO] Writing OBR metadata
[INFO] ------------------------------------------------------------------------
[INFO] Building Apache Tika parsers
[INFO]    task-segment: [install]
[INFO] ------------------------------------------------------------------------
[INFO] [remote-resources:process {execution: default}]
[debug] execute contextualize
[INFO] [resources:resources {execution: default-resources}]
[INFO] Using 'UTF-8' encoding to copy filtered resources.
[INFO] Copying 5 resources
[INFO] Copying 3 resources
[INFO] [compiler:compile {execution: default-compile}]
[INFO] Compiling 50 source files to /srv/gump/public/workspace/tika/tika-parsers/target/classes
[INFO] -------------------------------------------------------------
[ERROR] COMPILATION ERROR : 
[INFO] -------------------------------------------------------------
[ERROR] /srv/gump/public/workspace/tika/tika-parsers/src/main/java/org/apache/tika/parser/font/AdobeFontMetricParser.java:[75,27]
error: cannot find symbol
[INFO] 1 error
[INFO] -------------------------------------------------------------
[INFO] ------------------------------------------------------------------------
[ERROR] BUILD FAILURE
[INFO] ------------------------------------------------------------------------
[INFO] Compilation failure
/srv/gump/public/workspace/tika/tika-parsers/src/main/java/org/apache/tika/parser/font/AdobeFontMetricParser.java:[75,27]
error: cannot find symbol

[INFO] ------------------------------------------------------------------------
[INFO] For more information, run Maven with the -e switch
[INFO] ------------------------------------------------------------------------
[INFO] Total time: 24 seconds
[INFO] Finished at: Wed Aug 06 00:52:29 UTC 2014
[INFO] Final Memory: 57M/147M
[INFO] ------------------------------------------------------------------------
---------------------------------------------

To subscribe to this information via syndicated feeds:
- RSS: http://vmgump.apache.org/gump/public/tika/tika-reactor/rss.xml
- Atom: http://vmgump.apache.org/gump/public/tika/tika-reactor/atom.xml

============================== Gump Tracking Only ===
Produced by Apache Gump(TM) version 2.3.
Gump Run 20140806000005, vmgump.apache.org:vmgump:20140806000005
Gump E-mail Identifier (unique within run) #4.


--
Apache Gump
http://gump.apache.org/ [Instance: vmgump]

---------------------------------------------------------------------
To unsubscribe, e-mail: general-unsubscribe@gump.apache.org
For additional commands, e-mail: general-help@gump.apache.org


Mime
View raw message