gump-general mailing list archives

Site index · List index
Message view « Date » · « Thread »
Top « Date » · « Thread »
From g...@vmgump.apache.org
Subject BATCH: All dressed up, with nowhere to go...
Date Thu, 24 Jul 2014 02:49:33 GMT
Dear Gumpmeisters,
            
The following 4 notifys should have been sent

*********************************************************** G U M P
[GUMP@vmgump]: Project apache-httpd-configure (in module apache-httpd) failed
[GUMP@vmgump]: Project commons-exec (in module apache-commons) failed
[GUMP@vmgump]: Project tika-parsers (in module tika) failed
[GUMP@vmgump]: Project tika-reactor (in module tika) failed
*********************************************************** G U M P
[GUMP@vmgump]: Project apache-httpd-configure (in module apache-httpd) failed
To whom it may engage...
        
This is an automated request, but not an unsolicited one. For 
more information please visit http://gump.apache.org/nagged.html, 
and/or contact the folk at general@gump.apache.org.

Project apache-httpd-configure has an issue affecting its community integration.
This issue affects 6 projects,
 and has been outstanding for 427 runs.
The current state of this project is 'Failed', with reason 'Build Failed'.
For reference only, the following projects are affected by this:
    - apache-httpd-configure :  Apache HTTP Server
    - apache-httpd-make :  Apache HTTP Server
    - apache-httpd-make-install :  Apache HTTP Server
    - tomcat-jk-native :  Connectors to various web servers
    - tomcat-jk-native-buildconf :  Connectors to various web servers
    - tomcat-jk-native-configure :  Connectors to various web servers


Full details are available at:
    http://vmgump.apache.org/gump/public/apache-httpd/apache-httpd-configure/index.html

That said, some information snippets are provided here.

The following annotations (debug/informational/warning/error messages) were provided:
 -INFO- Failed with reason build failed



The following work was performed:
http://vmgump.apache.org/gump/public/apache-httpd/apache-httpd-configure/gump_work/buildscript_apache-httpd_apache-httpd-configure.html
Work Name: buildscript_apache-httpd_apache-httpd-configure (Type: Build)
Work ended in a state of : Failed
Elapsed: 
Command Line: /srv/gump/public/workspace/apache-httpd/configure --with-pcre=/srv/gump/public/workspace/pcre/dest-20140724
--with-apr=/srv/gump/public/workspace/apr/dest-20140724 --prefix=/srv/gump/public/workspace/apache-httpd/dest-20140724

[Working Directory: /srv/gump/public/workspace/apache-httpd]
---------------------------------------------
checking for chosen layout... Apache
checking for working mkdir -p... yes
checking for grep that handles long lines and -e... /bin/grep
checking for egrep... /bin/grep -E
checking build system type... x86_64-unknown-linux-gnu
checking host system type... x86_64-unknown-linux-gnu
checking target system type... x86_64-unknown-linux-gnu
configure: 
configure: Configuring Apache Portable Runtime library...
configure: 
checking for APR... yes
  setting CC to "gcc"
  setting CPP to "gcc -E"
  setting CFLAGS to " -g -O2 -pthread"
  setting CPPFLAGS to " -DLINUX -D_REENTRANT -D_GNU_SOURCE"
  setting LDFLAGS to " "
configure: 
configure: Configuring Apache Portable Runtime Utility library...
configure: 
configure: APR-util obsoleted, woohoo
checking for gcc... gcc
checking whether the C compiler works... yes
checking for C compiler default output file name... a.out
checking for suffix of executables... 
checking whether we are cross compiling... no
checking for suffix of object files... o
checking whether we are using the GNU C compiler... yes
checking whether gcc accepts -g... yes
checking for gcc option to accept ISO C89... none needed
checking how to run the C preprocessor... gcc -E
checking for gcc option to accept ISO C99... -std=gnu99
checking for pcre-config... false
/srv/gump/public/workspace/apache-httpd/configure: line 6002: syntax error near unexpected
token `)'
/srv/gump/public/workspace/apache-httpd/configure: line 6002: `  6.[0-6]*)'
---------------------------------------------

To subscribe to this information via syndicated feeds:
- RSS: http://vmgump.apache.org/gump/public/apache-httpd/apache-httpd-configure/rss.xml
- Atom: http://vmgump.apache.org/gump/public/apache-httpd/apache-httpd-configure/atom.xml

============================== Gump Tracking Only ===
Produced by Apache Gump(TM) version 2.3.
Gump Run 20140724000008, vmgump.apache.org:vmgump:20140724000008
Gump E-mail Identifier (unique within run) #1.

*********************************************************** G U M P
[GUMP@vmgump]: Project commons-exec (in module apache-commons) failed
To whom it may engage...
        
This is an automated request, but not an unsolicited one. For 
more information please visit http://gump.apache.org/nagged.html, 
and/or contact the folk at general@gump.apache.org.

Project commons-exec has an issue affecting its community integration.
This issue affects 5 projects,
 and has been outstanding for 281 runs.
The current state of this project is 'Failed', with reason 'Build Failed'.
For reference only, the following projects are affected by this:
    - commons-exec :  Commons Exec Package
    - tomcat-tc7.0.x-validate :  Tomcat 7.x, a web server implementing Java Servlet 3.0,
    ...
    - tomcat-trunk-validate :  Tomcat 8.x, a web server implementing the Java Servlet 3.1,
...
    - xml-fop-test :  XSL-FO (Formatting Objects) processor
    - xmlgraphics-commons-test :  Apache XML Graphics Commons - Common Components for Batik
an...


Full details are available at:
    http://vmgump.apache.org/gump/public/apache-commons/commons-exec/index.html

That said, some information snippets are provided here.

The following annotations (debug/informational/warning/error messages) were provided:
 -DEBUG- Sole jar output [commons-exec-*[0-9T].jar] identifier set to project name
 -DEBUG- (Apache Gump generated) Apache Maven Settings in: /srv/gump/public/workspace/apache-commons/exec/gump_mvn_settings.xml
 -INFO- Failed with reason build failed
 -DEBUG- Maven POM in: /srv/gump/public/workspace/apache-commons/exec/pom.xml
 -INFO- Failed to extract fallback artifacts from Gump Repository



The following work was performed:
http://vmgump.apache.org/gump/public/apache-commons/commons-exec/gump_work/build_apache-commons_commons-exec.html
Work Name: build_apache-commons_commons-exec (Type: Build)
Work ended in a state of : Failed
Elapsed: 5 secs
Command Line: /opt/maven2/bin/mvn --batch-mode -DskipTests=true --settings /srv/gump/public/workspace/apache-commons/exec/gump_mvn_settings.xml
package 
[Working Directory: /srv/gump/public/workspace/apache-commons/exec]
M2_HOME: /opt/maven2
---------------------------------------------
[INFO] Scanning for projects...
[INFO] ------------------------------------------------------------------------
[INFO] Building Apache Commons Exec
[INFO]    task-segment: [package]
[INFO] ------------------------------------------------------------------------
Downloading: http://localhost:8192/maven2/org/apache/maven/plugins/maven-release-plugin/2.0/maven-release-plugin-2.0.pom
7K downloaded  (maven-release-plugin-2.0.pom)
Downloading: http://localhost:8192/maven2/org/apache/maven/release/maven-release/2.0/maven-release-2.0.pom
6K downloaded  (maven-release-2.0.pom)
Downloading: http://localhost:8192/maven2/org/apache/maven/plugins/maven-release-plugin/2.0/maven-release-plugin-2.0.jar
37K downloaded  (maven-release-plugin-2.0.jar)
Downloading: http://localhost:8192/maven2/org/apache/maven/plugins/maven-scm-publish-plugin/1.0/maven-scm-publish-plugin-1.0.pom
7K downloaded  (maven-scm-publish-plugin-1.0.pom)
[INFO] ------------------------------------------------------------------------
[ERROR] BUILD ERROR
[INFO] ------------------------------------------------------------------------
[INFO] Error resolving version for 'org.apache.maven.plugins:maven-scm-publish-plugin': Plugin
requires Maven version 3.0
[INFO] ------------------------------------------------------------------------
[INFO] For more information, run Maven with the -e switch
[INFO] ------------------------------------------------------------------------
[INFO] Total time: 4 seconds
[INFO] Finished at: Thu Jul 24 00:33:12 UTC 2014
[INFO] Final Memory: 11M/28M
[INFO] ------------------------------------------------------------------------
---------------------------------------------

To subscribe to this information via syndicated feeds:
- RSS: http://vmgump.apache.org/gump/public/apache-commons/commons-exec/rss.xml
- Atom: http://vmgump.apache.org/gump/public/apache-commons/commons-exec/atom.xml

============================== Gump Tracking Only ===
Produced by Apache Gump(TM) version 2.3.
Gump Run 20140724000008, vmgump.apache.org:vmgump:20140724000008
Gump E-mail Identifier (unique within run) #3.

*********************************************************** G U M P
[GUMP@vmgump]: Project tika-parsers (in module tika) failed
To whom it may engage...
        
This is an automated request, but not an unsolicited one. For 
more information please visit http://gump.apache.org/nagged.html, 
and/or contact the folk at general@gump.apache.org.

Project tika-parsers has an issue affecting its community integration.
This issue affects 2 projects,
 and has been outstanding for 281 runs.
The current state of this project is 'Failed', with reason 'Build Failed'.
For reference only, the following projects are affected by this:
    - tika-parsers :  Apache Tika is a toolkit for detecting and extracting metada...
    - tika-parsers-test :  Apache Tika is a toolkit for detecting and extracting metada...


Full details are available at:
    http://vmgump.apache.org/gump/public/tika/tika-parsers/index.html

That said, some information snippets are provided here.

The following annotations (debug/informational/warning/error messages) were provided:
 -DEBUG- Sole jar output [tika-parsers-*[0-9T].jar] identifier set to project name
 -DEBUG- (Apache Gump generated) Apache Maven Settings in: /srv/gump/public/workspace/tika/tika-parsers/gump_mvn_settings.xml
 -INFO- Failed with reason build failed
 -DEBUG- Maven POM in: /srv/gump/public/workspace/tika/tika-parsers/pom.xml
 -INFO- Failed to extract fallback artifacts from Gump Repository



The following work was performed:
http://vmgump.apache.org/gump/public/tika/tika-parsers/gump_work/build_tika_tika-parsers.html
Work Name: build_tika_tika-parsers (Type: Build)
Work ended in a state of : Failed
Elapsed: 53 secs
Command Line: /opt/maven2/bin/mvn --batch-mode -DskipTests=true --settings /srv/gump/public/workspace/tika/tika-parsers/gump_mvn_settings.xml
package 
[Working Directory: /srv/gump/public/workspace/tika/tika-parsers]
M2_HOME: /opt/maven2
---------------------------------------------
[INFO] Unable to find resource 'org.slf4j:slf4j-api:jar:1.6.1' in repository geotoolkit (http://maven.geotoolkit.org/)
Downloading: http://localhost:8192/maven2/org/slf4j/slf4j-api/1.6.1/slf4j-api-1.6.1.jar
4830K downloaded  (poi-ooxml-schemas-3.10-FINAL.jar)
[INFO] Unable to find resource 'net.jcip:jcip-annotations:jar:1.0' in repository Oracle (http://download.oracle.com/maven)
24K downloaded  (slf4j-api-1.6.1.jar)
Downloading: http://maven.geotoolkit.org//net/jcip/jcip-annotations/1.0/jcip-annotations-1.0.jar
Downloading: http://localhost:8192/maven2/org/slf4j/slf4j-log4j12/1.6.1/slf4j-log4j12-1.6.1.jar
9K downloaded  (slf4j-log4j12-1.6.1.jar)
[INFO] Unable to find resource 'net.jcip:jcip-annotations:jar:1.0' in repository geotoolkit
(http://maven.geotoolkit.org/)
Downloading: http://localhost:8192/maven2/net/jcip/jcip-annotations/1.0/jcip-annotations-1.0.jar
2K downloaded  (jcip-annotations-1.0.jar)
[INFO] Unable to find resource 'edu.ucar:unidataCommon:jar:4.2.20' in repository Oracle (http://download.oracle.com/maven)
Downloading: http://maven.geotoolkit.org//edu/ucar/unidataCommon/4.2.20/unidataCommon-4.2.20.jar
[INFO] Unable to find resource 'org.apache.pdfbox:jempbox:jar:1.8.6' in repository mygrid-repository
(http://www.mygrid.org.uk/maven/repository)
Downloading: http://localhost:8192/maven2/org/apache/pdfbox/jempbox/1.8.6/jempbox-1.8.6.jar
49K downloaded  (jempbox-1.8.6.jar)
[INFO] Unable to find resource 'edu.ucar:unidataCommon:jar:4.2.20' in repository geotoolkit
(http://maven.geotoolkit.org/)
Downloading: http://localhost:8192/maven2/edu/ucar/unidataCommon/4.2.20/unidataCommon-4.2.20.jar
205K downloaded  (unidataCommon-4.2.20.jar)
[debug] execute contextualize
[INFO] [resources:resources {execution: default-resources}]
[INFO] Using 'UTF-8' encoding to copy filtered resources.
[INFO] Copying 5 resources
[INFO] Copying 3 resources
[INFO] [compiler:compile {execution: default-compile}]
[INFO] Compiling 141 source files to /srv/gump/public/workspace/tika/tika-parsers/target/classes
[INFO] -------------------------------------------------------------
[ERROR] COMPILATION ERROR : 
[INFO] -------------------------------------------------------------
[ERROR] /srv/gump/public/workspace/tika/tika-parsers/src/main/java/org/apache/tika/parser/microsoft/ooxml/XWPFWordExtractorDecorator.java:[114,50]
error: incompatible types
[ERROR]     ISDTContent
/srv/gump/public/workspace/tika/tika-parsers/src/main/java/org/apache/tika/parser/font/AdobeFontMetricParser.java:[75,27]
error: cannot find symbol
[INFO] 2 errors 
[INFO] -------------------------------------------------------------
[INFO] ------------------------------------------------------------------------
[ERROR] BUILD FAILURE
[INFO] ------------------------------------------------------------------------
[INFO] Compilation failure

/srv/gump/public/workspace/tika/tika-parsers/src/main/java/org/apache/tika/parser/microsoft/ooxml/XWPFWordExtractorDecorator.java:[114,50]
error: incompatible types
    ISDTContent
/srv/gump/public/workspace/tika/tika-parsers/src/main/java/org/apache/tika/parser/font/AdobeFontMetricParser.java:[75,27]
error: cannot find symbol

[INFO] ------------------------------------------------------------------------
[INFO] For more information, run Maven with the -e switch
[INFO] ------------------------------------------------------------------------
[INFO] Total time: 52 seconds
[INFO] Finished at: Thu Jul 24 01:02:00 UTC 2014
[INFO] Final Memory: 31M/90M
[INFO] ------------------------------------------------------------------------
---------------------------------------------

To subscribe to this information via syndicated feeds:
- RSS: http://vmgump.apache.org/gump/public/tika/tika-parsers/rss.xml
- Atom: http://vmgump.apache.org/gump/public/tika/tika-parsers/atom.xml

============================== Gump Tracking Only ===
Produced by Apache Gump(TM) version 2.3.
Gump Run 20140724000008, vmgump.apache.org:vmgump:20140724000008
Gump E-mail Identifier (unique within run) #4.

*********************************************************** G U M P
[GUMP@vmgump]: Project tika-reactor (in module tika) failed
To whom it may engage...
        
This is an automated request, but not an unsolicited one. For 
more information please visit http://gump.apache.org/nagged.html, 
and/or contact the folk at general@gump.apache.org.

Project tika-reactor has an issue affecting its community integration.
This issue affects 1 projects,
 and has been outstanding for 281 runs.
The current state of this project is 'Failed', with reason 'Build Failed'.
For reference only, the following projects are affected by this:
    - tika-reactor :  Apache Tika is a toolkit for detecting and extracting metada...


Full details are available at:
    http://vmgump.apache.org/gump/public/tika/tika-reactor/index.html

That said, some information snippets are provided here.

The following annotations (debug/informational/warning/error messages) were provided:
 -INFO- Optional dependency tika-parsers failed with reason build failed
 -DEBUG- (Apache Gump generated) Apache Maven Settings in: /srv/gump/public/workspace/tika/gump_mvn_settings.xml
 -INFO- Failed with reason build failed
 -DEBUG- Maven POM in: /srv/gump/public/workspace/tika/pom.xml



The following work was performed:
http://vmgump.apache.org/gump/public/tika/tika-reactor/gump_work/build_tika_tika-reactor.html
Work Name: build_tika_tika-reactor (Type: Build)
Work ended in a state of : Failed
Elapsed: 25 secs
Command Line: /opt/maven2/bin/mvn --batch-mode -DskipTests=true --settings /srv/gump/public/workspace/tika/gump_mvn_settings.xml
install 
[Working Directory: /srv/gump/public/workspace/tika]
MAVEN_OPTS: -Xmx512m 
M2_HOME: /opt/maven2
---------------------------------------------
Downloading: http://localhost:8192/maven2/org/apache/tika/tika-parent/1.0/tika-parent-1.0.pom
9K downloaded  (tika-parent-1.0.pom)
[WARNING] POM for 'biz.aQute:bndlib:pom:1.43.0:provided' is invalid.

Its dependencies (if any) will NOT be available to the current build.
[INFO] Succeeded with 0 errors; 0 warnings; and 0 other changes.
[INFO] [failsafe:verify {execution: default}]
[INFO] Tests are skipped.
[INFO] [install:install {execution: default-install}]
[INFO] Installing /srv/gump/public/workspace/tika/tika-core/target/tika-core-1.6-SNAPSHOT.jar
to /srv/gump/public/workspace/mvnlocalrepo/shared/org/apache/tika/tika-core/1.6-SNAPSHOT/tika-core-1.6-SNAPSHOT.jar
[INFO] Installing /srv/gump/public/workspace/tika/tika-core/target/tika-core-1.6-SNAPSHOT-tests.jar
to /srv/gump/public/workspace/mvnlocalrepo/shared/org/apache/tika/tika-core/1.6-SNAPSHOT/tika-core-1.6-SNAPSHOT-tests.jar
[INFO] [bundle:install {execution: default-install}]
[INFO] Installing org/apache/tika/tika-core/1.6-SNAPSHOT/tika-core-1.6-SNAPSHOT.jar
[INFO] Writing OBR metadata
[INFO] ------------------------------------------------------------------------
[INFO] Building Apache Tika parsers
[INFO]    task-segment: [install]
[INFO] ------------------------------------------------------------------------
[INFO] [remote-resources:process {execution: default}]
[debug] execute contextualize
[INFO] [resources:resources {execution: default-resources}]
[INFO] Using 'UTF-8' encoding to copy filtered resources.
[INFO] Copying 5 resources
[INFO] Copying 3 resources
[INFO] [compiler:compile {execution: default-compile}]
[INFO] Compiling 111 source files to /srv/gump/public/workspace/tika/tika-parsers/target/classes
[INFO] -------------------------------------------------------------
[ERROR] COMPILATION ERROR : 
[INFO] -------------------------------------------------------------
[ERROR] /srv/gump/public/workspace/tika/tika-parsers/src/main/java/org/apache/tika/parser/microsoft/ooxml/XWPFWordExtractorDecorator.java:[114,50]
error: incompatible types
[ERROR]     ISDTContent
/srv/gump/public/workspace/tika/tika-parsers/src/main/java/org/apache/tika/parser/font/AdobeFontMetricParser.java:[75,27]
error: cannot find symbol
[INFO] 2 errors 
[INFO] -------------------------------------------------------------
[INFO] ------------------------------------------------------------------------
[ERROR] BUILD FAILURE
[INFO] ------------------------------------------------------------------------
[INFO] Compilation failure

/srv/gump/public/workspace/tika/tika-parsers/src/main/java/org/apache/tika/parser/microsoft/ooxml/XWPFWordExtractorDecorator.java:[114,50]
error: incompatible types
    ISDTContent
/srv/gump/public/workspace/tika/tika-parsers/src/main/java/org/apache/tika/parser/font/AdobeFontMetricParser.java:[75,27]
error: cannot find symbol

[INFO] ------------------------------------------------------------------------
[INFO] For more information, run Maven with the -e switch
[INFO] ------------------------------------------------------------------------
[INFO] Total time: 25 seconds
[INFO] Finished at: Thu Jul 24 01:02:26 UTC 2014
[INFO] Final Memory: 59M/146M
[INFO] ------------------------------------------------------------------------
---------------------------------------------

To subscribe to this information via syndicated feeds:
- RSS: http://vmgump.apache.org/gump/public/tika/tika-reactor/rss.xml
- Atom: http://vmgump.apache.org/gump/public/tika/tika-reactor/atom.xml

============================== Gump Tracking Only ===
Produced by Apache Gump(TM) version 2.3.
Gump Run 20140724000008, vmgump.apache.org:vmgump:20140724000008
Gump E-mail Identifier (unique within run) #5.


--
Apache Gump
http://gump.apache.org/ [Instance: vmgump]

---------------------------------------------------------------------
To unsubscribe, e-mail: general-unsubscribe@gump.apache.org
For additional commands, e-mail: general-help@gump.apache.org


Mime
View raw message