gump-general mailing list archives

Site index · List index
Message view « Date » · « Thread »
Top « Date » · « Thread »
From g...@vmgump.apache.org
Subject BATCH: All dressed up, with nowhere to go...
Date Fri, 16 May 2014 20:51:29 GMT
Dear Gumpmeisters,
            
The following 1 notifys should have been sent

*********************************************************** G U M P
[GUMP@vmgump]: Project antunit-test (in module ant-antlibs) failed
*********************************************************** G U M P
[GUMP@vmgump]: Project antunit-test (in module ant-antlibs) failed
To whom it may engage...
        
This is an automated request, but not an unsolicited one. For 
more information please visit http://gump.apache.org/nagged.html, 
and/or contact the folk at general@gump.apache.org.

Project antunit-test has an issue affecting its community integration.
This issue affects 1 projects.
The current state of this project is 'Failed', with reason 'Build Failed'.
For reference only, the following projects are affected by this:
    - antunit-test :  Task and Type Libraries for Apache Ant


Full details are available at:
    http://vmgump.apache.org/gump/public/ant-antlibs/antunit-test/index.html

That said, some information snippets are provided here.

The following annotations (debug/informational/warning/error messages) were provided:
 -DEBUG- Dependency on ant-testutil exists, no need to add for property ant-testutil.jar.
 -INFO- Failed with reason build failed



The following work was performed:
http://vmgump.apache.org/gump/public/ant-antlibs/antunit-test/gump_work/build_ant-antlibs_antunit-test.html
Work Name: build_ant-antlibs_antunit-test (Type: Build)
Work ended in a state of : Failed
Elapsed: 22 secs
Command Line: /usr/lib/jvm/java-7-oracle/bin/java -Djava.awt.headless=true -Dbuild.sysclasspath=only
-Xbootclasspath/p:/srv/gump/public/workspace/xml-xerces2/build/xercesImpl.jar:/srv/gump/public/workspace/xml-commons/java/external/build/xml-apis.jar
org.apache.tools.ant.Main -Dgump.merge=/srv/gump/public/gump/work/merge.xml -Dant-testutil.jar=/srv/gump/public/workspace/ant/build/lib/ant-testutil.jar
test 
[Working Directory: /srv/gump/public/workspace/ant-antlibs/antunit]
CLASSPATH: /usr/lib/jvm/java-7-oracle/lib/tools.jar:/srv/gump/public/workspace/ant-antlibs/antunit/build/test-classes:/srv/gump/public/workspace/ant/dist/lib/ant.jar:/srv/gump/public/workspace/ant/dist/lib/ant-launcher.jar:/srv/gump/public/workspace/ant/dist/lib/ant-jmf.jar:/srv/gump/public/workspace/ant/dist/lib/ant-junit.jar:/srv/gump/public/workspace/ant/dist/lib/ant-junit4.jar:/srv/gump/public/workspace/ant/dist/lib/ant-swing.jar:/srv/gump/public/workspace/ant/dist/lib/ant-apache-resolver.jar:/srv/gump/public/workspace/ant/dist/lib/ant-apache-xalan2.jar:/srv/gump/public/workspace/ant/build/lib/ant-testutil.jar:/srv/gump/public/workspace/ant-antlibs/antunit/build/ant-antunit-20140516.jar:/srv/gump/public/workspace/junit/target/junit-4.12-SNAPSHOT.jar:/srv/gump/public/workspace/xml-commons/java/external/build/xml-apis-ext.jar
---------------------------------------------
setup-for-antunit-tests:

ready-to-test-with-antunit:

antunit-test:
[au:antunit] Build File: /srv/gump/public/workspace/ant-antlibs/antunit/src/tests/antunit/assertLogContains-test.xml
[au:antunit] Tests run: 3, Failures: 0, Errors: 0, Time elapsed: 0.019 sec
[au:antunit] Target: testWithExplicitMerge took 0.002 sec
[au:antunit] Target: testWithoutMerge took 0.002 sec
[au:antunit] Target: testWithImplicitMerge took 0.002 sec
[au:antunit] Build File: /srv/gump/public/workspace/ant-antlibs/antunit/src/tests/antunit/assertResourceContains-test.xml
[au:antunit] Tests run: 2, Failures: 1, Errors: 0, Time elapsed: 1.762 sec
[au:antunit] Target: testURLUsingRef  FAILED
[au:antunit] 	at line 256, column 53
[au:antunit] 	Message: Expected resource 'antsite' to exist
[au:antunit] 	took 0.868 sec
[au:antunit] Target: testURLUsingRef-no took 0.876 sec
[au:antunit] Build File: /srv/gump/public/workspace/ant-antlibs/antunit/src/tests/antunit/assertResourceExists-test.xml
[au:antunit] Tests run: 4, Failures: 2, Errors: 0, Time elapsed: 3.369 sec
[au:antunit] Target: testURLUsingRef-no took 0.875 sec
[au:antunit] Target: testURL  FAILED
[au:antunit] 	at line 24, column 36
[au:antunit] 	Message: Expected resource to exist
[au:antunit] 	took 0.838 sec
[au:antunit] Target: testURL-no took 0.839 sec
[au:antunit] Target: testURLUsingRef  FAILED
[au:antunit] 	at line 32, column 50
[au:antunit] 	Message: Expected resource 'antsite' to exist
[au:antunit] 	took 0.784 sec
[au:antunit] Build File: /srv/gump/public/workspace/ant-antlibs/antunit/src/tests/antunit/resourceexists-test.xml
[au:antunit] Tests run: 6, Failures: 2, Errors: 0, Time elapsed: 1.687 sec
[au:antunit] Target: test-refid-file took 0.002 sec
[au:antunit] Target: testURL  FAILED
[au:antunit] 	at line 53, column 20
[au:antunit] 	Message: Assertion failed
[au:antunit] 	took 0.811 sec
[au:antunit] Target: test-no took 0.001 sec
[au:antunit] Target: test-yes took 0 sec
[au:antunit] Target: test-refid-fileset took 0.002 sec
[au:antunit] Target: testURLAttributeUsingRef  FAILED
[au:antunit] 	at line 62, column 20
[au:antunit] 	Message: Assertion failed
[au:antunit] 	took 0.838 sec

test:

BUILD FAILED
/srv/gump/public/workspace/ant-antlibs/antunit/common/build.xml:227: At least one AntUnit
test has failed.

Total time: 20 seconds
---------------------------------------------

To subscribe to this information via syndicated feeds:
- RSS: http://vmgump.apache.org/gump/public/ant-antlibs/antunit-test/rss.xml
- Atom: http://vmgump.apache.org/gump/public/ant-antlibs/antunit-test/atom.xml

============================== Gump Tracking Only ===
Produced by Apache Gump(TM) version 2.3.
Gump Run 20140516180006, vmgump.apache.org:vmgump:20140516180006
Gump E-mail Identifier (unique within run) #1.


--
Apache Gump
http://gump.apache.org/ [Instance: vmgump]

---------------------------------------------------------------------
To unsubscribe, e-mail: general-unsubscribe@gump.apache.org
For additional commands, e-mail: general-help@gump.apache.org


Mime
View raw message