gump-general mailing list archives

Site index · List index
Message view « Date » · « Thread »
Top « Date » · « Thread »
From g...@vmgump.apache.org
Subject BATCH: All dressed up, with nowhere to go...
Date Tue, 13 May 2014 06:34:15 GMT
Dear Gumpmeisters,
            
The following 15 notifys should have been sent

*********************************************************** G U M P
[GUMP@vmgump]: Project bcel (in module apache-commons) failed
[GUMP@vmgump]: Project logging-log4j-12 (in module logging-log4j-12) failed
[GUMP@vmgump]: Project commons-lang (in module commons-lang-2.x) failed
[GUMP@vmgump]: Project commons-io (in module apache-commons) failed
[GUMP@vmgump]: Project objenesis-parent (in module objenesis) failed
[GUMP@vmgump]: Project commons-fileupload (in module apache-commons) failed
[GUMP@vmgump]: Project commons-net (in module apache-commons) failed
[GUMP@vmgump]: Project commons-compress (in module apache-commons) failed
[GUMP@vmgump]: Project commons-collections (in module commons-collections-3.x) failed
[GUMP@vmgump]: Project commons-exec (in module apache-commons) failed
[GUMP@vmgump]: Project pdfbox-parent (in module pdfbox) failed
[GUMP@vmgump]: Project tika-parent (in module tika) failed
[GUMP@vmgump]: Project rat (in module rat) failed
[GUMP@vmgump]: Project commons-cli (in module apache-commons) failed
[GUMP@vmgump]: Project commons-jxpath (in module apache-commons) failed
*********************************************************** G U M P
[GUMP@vmgump]: Project bcel (in module apache-commons) failed
To whom it may engage...
        
This is an automated request, but not an unsolicited one. For 
more information please visit http://gump.apache.org/nagged.html, 
and/or contact the folk at general@gump.apache.org.

Project bcel has an issue affecting its community integration.
This issue affects 20 projects.
The current state of this project is 'Failed', with reason 'Build Failed'.
For reference only, the following projects are affected by this:
    - ant-contrib :  Useful little Ant tasks
    - bcel :  Byte Code Engineering Library
    - dist-xalan2 :  Release 2.x of the Xalan-Java XSLT processor
    - forrest-core :  Apache Forrest software is a publishing framework that trans...
    - forrest-rat :  Apache Forrest software is a publishing framework that trans...
    - forrest-test :  Apache Forrest software is a publishing framework that trans...
    - forrest-test-basic :  Apache Forrest software is a publishing framework that trans...
    - forrest-test-deploy-plugins :  Apache Forrest software is a publishing framework that trans...
    - net.sf.xmlunit :  JUnit extension for XML unit tests.
    - org.apache.poi :  POI
    - poi :  POI
    - poi-test :  POI
    - xalan :  Release 2.x of the Xalan-Java XSLT processor
    - xalan-bundled :  Release 2.x of the Xalan-Java XSLT processor
    - xml-batik :  Scalable Vector Graphics
    - xml-fop :  XSL-FO (Formatting Objects) processor
    - xml-fop-test :  XSL-FO (Formatting Objects) processor
    - xml-stylebook2 :  Style book
    - xmlunit :  JUnit extension for XML unit tests.
    - xmlunit-test :  JUnit extension for XML unit tests.


Full details are available at:
    http://vmgump.apache.org/gump/public/apache-commons/bcel/index.html

That said, some information snippets are provided here.

The following annotations (debug/informational/warning/error messages) were provided:
 -DEBUG- Sole jar output [bcel-[0-9]*[0-9T].jar] identifier set to project name
 -DEBUG- (Apache Gump generated) Apache Maven Settings in: /srv/gump/public/workspace/apache-commons/bcel/gump_mvn_settings.xml
 -INFO- Failed with reason build failed
 -DEBUG- Maven POM in: /srv/gump/public/workspace/apache-commons/bcel/pom.xml
 -DEBUG- Extracted fallback artifacts from Gump Repository



The following work was performed:
http://vmgump.apache.org/gump/public/apache-commons/bcel/gump_work/build_apache-commons_bcel.html
Work Name: build_apache-commons_bcel (Type: Build)
Work ended in a state of : Failed
Elapsed: 8 secs
Command Line: /opt/maven2/bin/mvn --batch-mode --settings /srv/gump/public/workspace/apache-commons/bcel/gump_mvn_settings.xml package 
[Working Directory: /srv/gump/public/workspace/apache-commons/bcel]
M2_HOME: /opt/maven2
---------------------------------------------
Downloading: http://localhost:8192/maven2/org/apache/commons/commons-build-plugin/1.4/commons-build-plugin-1.4.jar
24K downloaded  (commons-build-plugin-1.4.jar)
Downloading: http://localhost:8192/maven2/org/apache/felix/maven-bundle-plugin/2.4.0/maven-bundle-plugin-2.4.0.pom
3K downloaded  (maven-bundle-plugin-2.4.0.pom)
Downloading: http://localhost:8192/maven2/org/apache/felix/felix-parent/2.1/felix-parent-2.1.pom
9K downloaded  (felix-parent-2.1.pom)
Downloading: http://localhost:8192/maven2/org/apache/felix/maven-bundle-plugin/2.4.0/maven-bundle-plugin-2.4.0.jar
123K downloaded  (maven-bundle-plugin-2.4.0.jar)
Downloading: http://localhost:8192/maven2/org/apache/rat/apache-rat-plugin/0.10/apache-rat-plugin-0.10.pom
9K downloaded  (apache-rat-plugin-0.10.pom)
Downloading: http://localhost:8192/maven2/org/apache/rat/apache-rat-project/0.10/apache-rat-project-0.10.pom
17K downloaded  (apache-rat-project-0.10.pom)
Downloading: http://localhost:8192/maven2/org/apache/rat/apache-rat-plugin/0.10/apache-rat-plugin-0.10.jar
41K downloaded  (apache-rat-plugin-0.10.jar)
Downloading: http://localhost:8192/maven2/org/apache/maven/plugins/maven-javadoc-plugin/2.9.1/maven-javadoc-plugin-2.9.1.pom
15K downloaded  (maven-javadoc-plugin-2.9.1.pom)
Downloading: http://localhost:8192/maven2/org/apache/maven/plugins/maven-javadoc-plugin/2.9.1/maven-javadoc-plugin-2.9.1.jar
359K downloaded  (maven-javadoc-plugin-2.9.1.jar)
Downloading: http://localhost:8192/maven2/org/apache/maven/plugins/maven-scm-publish-plugin/1.0-beta-2/maven-scm-publish-plugin-1.0-beta-2.pom
6K downloaded  (maven-scm-publish-plugin-1.0-beta-2.pom)
Downloading: http://localhost:8192/maven2/org/apache/maven/plugins/maven-scm-publish-plugin/1.0-beta-2/maven-scm-publish-plugin-1.0-beta-2.jar
34K downloaded  (maven-scm-publish-plugin-1.0-beta-2.jar)
Downloading: http://localhost:8192/maven2/org/codehaus/mojo/buildnumber-maven-plugin/1.2/buildnumber-maven-plugin-1.2.pom
12K downloaded  (buildnumber-maven-plugin-1.2.pom)
Downloading: http://localhost:8192/maven2/org/codehaus/mojo/mojo-parent/30/mojo-parent-30.pom
26K downloaded  (mojo-parent-30.pom)
Downloading: http://localhost:8192/maven2/org/codehaus/codehaus-parent/4/codehaus-parent-4.pom
4K downloaded  (codehaus-parent-4.pom)
Downloading: http://localhost:8192/maven2/org/codehaus/mojo/buildnumber-maven-plugin/1.2/buildnumber-maven-plugin-1.2.jar
25K downloaded  (buildnumber-maven-plugin-1.2.jar)
Downloading: http://localhost:8192/maven2/junit/junit/4.11/junit-4.11.pom
22K downloaded  (junit-4.11.pom)
[INFO] ------------------------------------------------------------------------
[ERROR] BUILD ERROR
[INFO] ------------------------------------------------------------------------
[INFO] Error building POM (may not be this project's POM).


Project ID: junit:junit

Reason: Invalid JDK version in profile 'restrict-doclint': Unbounded range: [1.8, for project junit:junit


[INFO] ------------------------------------------------------------------------
[INFO] For more information, run Maven with the -e switch
[INFO] ------------------------------------------------------------------------
[INFO] Total time: 7 seconds
[INFO] Finished at: Tue May 13 06:03:26 UTC 2014
[INFO] Final Memory: 15M/36M
[INFO] ------------------------------------------------------------------------
---------------------------------------------

To subscribe to this information via syndicated feeds:
- RSS: http://vmgump.apache.org/gump/public/apache-commons/bcel/rss.xml
- Atom: http://vmgump.apache.org/gump/public/apache-commons/bcel/atom.xml

============================== Gump Tracking Only ===
Produced by Apache Gump(TM) version 2.3.
Gump Run 20140513060006, vmgump.apache.org:vmgump:20140513060006
Gump E-mail Identifier (unique within run) #1.

*********************************************************** G U M P
[GUMP@vmgump]: Project logging-log4j-12 (in module logging-log4j-12) failed
To whom it may engage...
        
This is an automated request, but not an unsolicited one. For 
more information please visit http://gump.apache.org/nagged.html, 
and/or contact the folk at general@gump.apache.org.

Project logging-log4j-12 has an issue affecting its community integration.
This issue affects 16 projects.
The current state of this project is 'Failed', with reason 'Build Failed'.
For reference only, the following projects are affected by this:
    - commons-beanutils :  Bean Utilities
    - commons-dbcp2 :  Database Connection Pool
    - commons-digester :  XML to Java Object Configuration
    - commons-el :  Expression Language
    - commons-logging :  Logging Library Package
    - commons-logging-step-1 :  Logging Library Package
    - commons-modeler :  Modeler MBeans
    - commons-validator :  Validation Framework
    - jakarta-bsf :  Bean Scripting Framework
    - logging-log4j-12 :  Fast and flexible logging package for Java
    - logging-log4j-12-tests :  Fast and flexible logging package for Java
    - tomcat-tc6 :  Java Servlet 2.5 & Server Pages JSP 2.1 implementation (for ...
    - tomcat-tc7.0.x-validate :  Tomcat 7.x, a web server implementing Java Servlet 3.0,
    ...
    - tomcat-trunk-validate :  Tomcat 8.x, a web server implementing the Java Servlet 3.1,
...
    - xmlgraphics-commons :  Apache XML Graphics Commons - Common Components for Batik an...
    - xmlgraphics-commons-test :  Apache XML Graphics Commons - Common Components for Batik an...


Full details are available at:
    http://vmgump.apache.org/gump/public/logging-log4j-12/logging-log4j-12/index.html

That said, some information snippets are provided here.

The following annotations (debug/informational/warning/error messages) were provided:
 -DEBUG- (Apache Gump generated) Apache Maven Settings in: /srv/gump/public/workspace/logging-log4j-12/gump_mvn_settings.xml
 -INFO- Failed with reason build failed
 -DEBUG- Maven POM in: /srv/gump/public/workspace/logging-log4j-12/pom.xml
 -DEBUG- Extracted fallback artifacts from Gump Repository



The following work was performed:
http://vmgump.apache.org/gump/public/logging-log4j-12/logging-log4j-12/gump_work/build_logging-log4j-12_logging-log4j-12.html
Work Name: build_logging-log4j-12_logging-log4j-12 (Type: Build)
Work ended in a state of : Failed
Elapsed: 9 secs
Command Line: /opt/maven2/bin/mvn --batch-mode -DskipTests=true --settings /srv/gump/public/workspace/logging-log4j-12/gump_mvn_settings.xml package 
[Working Directory: /srv/gump/public/workspace/logging-log4j-12]
M2_HOME: /opt/maven2
---------------------------------------------
Downloading: http://localhost:8192/maven2/org/apache/apache/3/apache-3.pom
3K downloaded  (apache-3.pom)
Downloading: http://localhost:8192/maven/2/org/apache/maven/maven-settings/2.0.7/maven-settings-2.0.7.pom
[INFO] Unable to find resource 'org.apache.maven:maven-settings:pom:2.0.7' in repository maven2-repository.dev.java.net (http://download.java.net/maven/2/)
Downloading: http://localhost:8192/maven2/org/apache/maven/maven-settings/2.0.7/maven-settings-2.0.7.pom
1K downloaded  (maven-settings-2.0.7.pom)
Downloading: http://localhost:8192/maven/2/org/apache/maven/maven-model/2.0.7/maven-model-2.0.7.pom
[INFO] Unable to find resource 'org.apache.maven:maven-model:pom:2.0.7' in repository maven2-repository.dev.java.net (http://download.java.net/maven/2/)
Downloading: http://localhost:8192/maven2/org/apache/maven/maven-model/2.0.7/maven-model-2.0.7.pom
2K downloaded  (maven-model-2.0.7.pom)
Downloading: http://localhost:8192/maven/2/org/codehaus/plexus/plexus-utils/1.4.1/plexus-utils-1.4.1.pom
[INFO] Unable to find resource 'org.codehaus.plexus:plexus-utils:pom:1.4.1' in repository maven2-repository.dev.java.net (http://download.java.net/maven/2/)
Downloading: http://localhost:8192/maven2/org/codehaus/plexus/plexus-utils/1.4.1/plexus-utils-1.4.1.pom
1K downloaded  (plexus-utils-1.4.1.pom)
Downloading: http://localhost:8192/maven/2/org/codehaus/plexus/plexus/1.0.11/plexus-1.0.11.pom
[INFO] Unable to find resource 'org.codehaus.plexus:plexus:pom:1.0.11' in repository maven2-repository.dev.java.net (http://download.java.net/maven/2/)
Downloading: http://localhost:8192/maven2/org/codehaus/plexus/plexus/1.0.11/plexus-1.0.11.pom
8K downloaded  (plexus-1.0.11.pom)
Downloading: http://localhost:8192/maven/2/org/codehaus/plexus/plexus-container-default/1.0-alpha-9-stable-1/plexus-container-default-1.0-alpha-9-stable-1.pom
[INFO] Unable to find resource 'org.codehaus.plexus:plexus-container-default:pom:1.0-alpha-9-stable-1' in repository maven2-repository.dev.java.net (http://download.java.net/maven/2/)
Downloading: http://localhost:8192/maven2/org/codehaus/plexus/plexus-container-default/1.0-alpha-9-stable-1/plexus-container-default-1.0-alpha-9-stable-1.pom
3K downloaded  (plexus-container-default-1.0-alpha-9-stable-1.pom)
Downloading: http://localhost:8192/maven/2/org/codehaus/plexus/plexus-containers/1.0.3/plexus-containers-1.0.3.pom
[INFO] Unable to find resource 'org.codehaus.plexus:plexus-containers:pom:1.0.3' in repository maven2-repository.dev.java.net (http://download.java.net/maven/2/)
Downloading: http://localhost:8192/maven2/org/codehaus/plexus/plexus-containers/1.0.3/plexus-containers-1.0.3.pom
492b downloaded  (plexus-containers-1.0.3.pom)
Downloading: http://localhost:8192/maven/2/org/codehaus/plexus/plexus/1.0.4/plexus-1.0.4.pom
[INFO] Unable to find resource 'org.codehaus.plexus:plexus:pom:1.0.4' in repository maven2-repository.dev.java.net (http://download.java.net/maven/2/)
Downloading: http://localhost:8192/maven2/org/codehaus/plexus/plexus/1.0.4/plexus-1.0.4.pom
5K downloaded  (plexus-1.0.4.pom)
Downloading: http://localhost:8192/maven/2/junit/junit/3.8.1/junit-3.8.1.pom
22K downloaded  (junit-3.8.1.pom)
[INFO] ------------------------------------------------------------------------
[ERROR] BUILD ERROR
[INFO] ------------------------------------------------------------------------
[INFO] Error building POM (may not be this project's POM).


Project ID: junit:junit

Reason: Invalid JDK version in profile 'restrict-doclint': Unbounded range: [1.8, for project junit:junit


[INFO] ------------------------------------------------------------------------
[INFO] For more information, run Maven with the -e switch
[INFO] ------------------------------------------------------------------------
[INFO] Total time: 9 seconds
[INFO] Finished at: Tue May 13 06:03:55 UTC 2014
[INFO] Final Memory: 5M/15M
[INFO] ------------------------------------------------------------------------
---------------------------------------------

To subscribe to this information via syndicated feeds:
- RSS: http://vmgump.apache.org/gump/public/logging-log4j-12/logging-log4j-12/rss.xml
- Atom: http://vmgump.apache.org/gump/public/logging-log4j-12/logging-log4j-12/atom.xml

============================== Gump Tracking Only ===
Produced by Apache Gump(TM) version 2.3.
Gump Run 20140513060006, vmgump.apache.org:vmgump:20140513060006
Gump E-mail Identifier (unique within run) #2.

*********************************************************** G U M P
[GUMP@vmgump]: Project commons-lang (in module commons-lang-2.x) failed
To whom it may engage...
        
This is an automated request, but not an unsolicited one. For 
more information please visit http://gump.apache.org/nagged.html, 
and/or contact the folk at general@gump.apache.org.

Project commons-lang has an issue affecting its community integration.
This issue affects 1 projects.
The current state of this project is 'Failed', with reason 'Build Failed'.
For reference only, the following projects are affected by this:
    - commons-lang :  utilities for the classes that are in java.lang's hierarchy


Full details are available at:
    http://vmgump.apache.org/gump/public/commons-lang-2.x/commons-lang/index.html

That said, some information snippets are provided here.

The following annotations (debug/informational/warning/error messages) were provided:
 -DEBUG- (Apache Gump generated) Apache Maven Settings in: /srv/gump/public/workspace/commons-lang-2.x/gump_mvn_settings.xml
 -INFO- Failed with reason build failed
 -DEBUG- Maven POM in: /srv/gump/public/workspace/commons-lang-2.x/pom.xml
 -DEBUG- Extracted fallback artifacts from Gump Repository



The following work was performed:
http://vmgump.apache.org/gump/public/commons-lang-2.x/commons-lang/gump_work/build_commons-lang-2.x_commons-lang.html
Work Name: build_commons-lang-2.x_commons-lang (Type: Build)
Work ended in a state of : Failed
Elapsed: 5 secs
Command Line: /opt/maven2/bin/mvn --batch-mode -DskipTests=true --settings /srv/gump/public/workspace/commons-lang-2.x/gump_mvn_settings.xml package 
[Working Directory: /srv/gump/public/workspace/commons-lang-2.x]
M2_HOME: /opt/maven2
---------------------------------------------
48K downloaded  (maven-remote-resources-plugin-1.0.jar)
Downloading: http://localhost:8192/maven2/org/apache/felix/maven-bundle-plugin/1.4.3/maven-bundle-plugin-1.4.3.pom
4K downloaded  (maven-bundle-plugin-1.4.3.pom)
Downloading: http://localhost:8192/maven2/org/apache/felix/felix/1.0.2/felix-1.0.2.pom
13K downloaded  (felix-1.0.2.pom)
Downloading: http://localhost:8192/maven2/org/apache/felix/maven-bundle-plugin/1.4.3/maven-bundle-plugin-1.4.3.jar
157K downloaded  (maven-bundle-plugin-1.4.3.jar)
[INFO] artifact org.apache.maven.plugins:maven-idea-plugin: checking for updates from central
Downloading: http://localhost:8192/maven2/org/apache/maven/plugins/maven-idea-plugin/2.2.1/maven-idea-plugin-2.2.1.pom
6K downloaded  (maven-idea-plugin-2.2.1.pom)
Downloading: http://localhost:8192/maven2/org/apache/maven/plugins/maven-idea-plugin/2.2.1/maven-idea-plugin-2.2.1.jar
52K downloaded  (maven-idea-plugin-2.2.1.jar)
Downloading: http://localhost:8192/maven2/org/apache/maven/plugins/maven-antrun-plugin/1.3/maven-antrun-plugin-1.3.pom
4K downloaded  (maven-antrun-plugin-1.3.pom)
Downloading: http://localhost:8192/maven2/org/apache/maven/plugins/maven-plugins/12/maven-plugins-12.pom
11K downloaded  (maven-plugins-12.pom)
Downloading: http://localhost:8192/maven2/org/apache/maven/maven-parent/9/maven-parent-9.pom
32K downloaded  (maven-parent-9.pom)
Downloading: http://localhost:8192/maven2/org/apache/maven/plugins/maven-antrun-plugin/1.3/maven-antrun-plugin-1.3.jar
23K downloaded  (maven-antrun-plugin-1.3.jar)
Downloading: http://localhost:8192/maven2/org/apache/commons/commons-build-plugin/1.3/commons-build-plugin-1.3.pom
7K downloaded  (commons-build-plugin-1.3.pom)
Downloading: http://localhost:8192/maven2/org/apache/commons/commons-parent/12/commons-parent-12.pom
26K downloaded  (commons-parent-12.pom)
Downloading: http://localhost:8192/maven2/org/apache/commons/commons-build-plugin/1.3/commons-build-plugin-1.3.jar
22K downloaded  (commons-build-plugin-1.3.jar)
Downloading: http://localhost:8192/maven2/org/apache/maven/plugins/maven-assembly-plugin/2.2-beta-5/maven-assembly-plugin-2.2-beta-5.pom
14K downloaded  (maven-assembly-plugin-2.2-beta-5.pom)
Downloading: http://localhost:8192/maven2/org/apache/maven/plugins/maven-assembly-plugin/2.2-beta-5/maven-assembly-plugin-2.2-beta-5.jar
203K downloaded  (maven-assembly-plugin-2.2-beta-5.jar)
Downloading: http://localhost:8192/maven2/junit/junit/3.8.1/junit-3.8.1.pom
22K downloaded  (junit-3.8.1.pom)
[INFO] ------------------------------------------------------------------------
[ERROR] BUILD ERROR
[INFO] ------------------------------------------------------------------------
[INFO] Error building POM (may not be this project's POM).


Project ID: junit:junit

Reason: Invalid JDK version in profile 'restrict-doclint': Unbounded range: [1.8, for project junit:junit


[INFO] ------------------------------------------------------------------------
[INFO] For more information, run Maven with the -e switch
[INFO] ------------------------------------------------------------------------
[INFO] Total time: 4 seconds
[INFO] Finished at: Tue May 13 06:04:01 UTC 2014
[INFO] Final Memory: 8M/20M
[INFO] ------------------------------------------------------------------------
---------------------------------------------

To subscribe to this information via syndicated feeds:
- RSS: http://vmgump.apache.org/gump/public/commons-lang-2.x/commons-lang/rss.xml
- Atom: http://vmgump.apache.org/gump/public/commons-lang-2.x/commons-lang/atom.xml

============================== Gump Tracking Only ===
Produced by Apache Gump(TM) version 2.3.
Gump Run 20140513060006, vmgump.apache.org:vmgump:20140513060006
Gump E-mail Identifier (unique within run) #3.

*********************************************************** G U M P
[GUMP@vmgump]: Project commons-io (in module apache-commons) failed
To whom it may engage...
        
This is an automated request, but not an unsolicited one. For 
more information please visit http://gump.apache.org/nagged.html, 
and/or contact the folk at general@gump.apache.org.

Project commons-io has an issue affecting its community integration.
This issue affects 1 projects.
The current state of this project is 'Failed', with reason 'Build Failed'.
For reference only, the following projects are affected by this:
    - commons-io :  Commons I/O Utility Package


Full details are available at:
    http://vmgump.apache.org/gump/public/apache-commons/commons-io/index.html

That said, some information snippets are provided here.

The following annotations (debug/informational/warning/error messages) were provided:
 -DEBUG- Sole jar output [commons-io-*[0-9T].jar] identifier set to project name
 -INFO- Optional dependency commons-lang failed with reason build failed
 -DEBUG- (Apache Gump generated) Apache Maven Settings in: /srv/gump/public/workspace/apache-commons/io/gump_mvn_settings.xml
 -INFO- Failed with reason build failed
 -DEBUG- Maven POM in: /srv/gump/public/workspace/apache-commons/io/pom.xml
 -DEBUG- Extracted fallback artifacts from Gump Repository



The following work was performed:
http://vmgump.apache.org/gump/public/apache-commons/commons-io/gump_work/build_apache-commons_commons-io.html
Work Name: build_apache-commons_commons-io (Type: Build)
Work ended in a state of : Failed
Elapsed: 3 secs
Command Line: /opt/maven2/bin/mvn --batch-mode -DskipTests=true --settings /srv/gump/public/workspace/apache-commons/io/gump_mvn_settings.xml package 
[Working Directory: /srv/gump/public/workspace/apache-commons/io]
M2_HOME: /opt/maven2
---------------------------------------------
[INFO] Scanning for projects...
[INFO] ------------------------------------------------------------------------
[INFO] Building Apache Commons IO
[INFO]    task-segment: [package]
[INFO] ------------------------------------------------------------------------
[INFO] ------------------------------------------------------------------------
[ERROR] BUILD ERROR
[INFO] ------------------------------------------------------------------------
[INFO] Error building POM (may not be this project's POM).


Project ID: junit:junit

Reason: Invalid JDK version in profile 'restrict-doclint': Unbounded range: [1.8, for project junit:junit


[INFO] ------------------------------------------------------------------------
[INFO] For more information, run Maven with the -e switch
[INFO] ------------------------------------------------------------------------
[INFO] Total time: 2 seconds
[INFO] Finished at: Tue May 13 06:04:05 UTC 2014
[INFO] Final Memory: 10M/25M
[INFO] ------------------------------------------------------------------------
---------------------------------------------

To subscribe to this information via syndicated feeds:
- RSS: http://vmgump.apache.org/gump/public/apache-commons/commons-io/rss.xml
- Atom: http://vmgump.apache.org/gump/public/apache-commons/commons-io/atom.xml

============================== Gump Tracking Only ===
Produced by Apache Gump(TM) version 2.3.
Gump Run 20140513060006, vmgump.apache.org:vmgump:20140513060006
Gump E-mail Identifier (unique within run) #4.

*********************************************************** G U M P
[GUMP@vmgump]: Project objenesis-parent (in module objenesis) failed
To whom it may engage...
        
This is an automated request, but not an unsolicited one. For 
more information please visit http://gump.apache.org/nagged.html, 
and/or contact the folk at general@gump.apache.org.

Project objenesis-parent has an issue affecting its community integration.
This issue affects 5 projects.
The current state of this project is 'Failed', with reason 'Build Failed'.
For reference only, the following projects are affected by this:
    - objenesis :  Objenesis is a small Java library that serves one purpose: T...
    - objenesis-parent :  Objenesis is a small Java library that serves one purpose: T...
    - tomcat-trunk-test-bio :  Tomcat 8.x, a web server implementing the Java Servlet 3.1,
...
    - tomcat-trunk-test-nio :  Tomcat 8.x, a web server implementing the Java Servlet 3.1,
...
    - tomcat-trunk-test-nio2 :  Tomcat 8.x, a web server implementing the Java Servlet 3.1,
...


Full details are available at:
    http://vmgump.apache.org/gump/public/objenesis/objenesis-parent/index.html

That said, some information snippets are provided here.

The following annotations (debug/informational/warning/error messages) were provided:
 -DEBUG- (Apache Gump generated) Apache Maven Settings in: /srv/gump/public/workspace/objenesis/gump_mvn_settings.xml
 -INFO- Failed with reason build failed
 -DEBUG- Maven POM in: /srv/gump/public/workspace/objenesis/pom.xml
 -DEBUG- Extracted fallback artifacts from Gump Repository



The following work was performed:
http://vmgump.apache.org/gump/public/objenesis/objenesis-parent/gump_work/build_objenesis_objenesis-parent.html
Work Name: build_objenesis_objenesis-parent (Type: Build)
Work ended in a state of : Failed
Elapsed: 6 secs
Command Line: /opt/maven2/bin/mvn --batch-mode -Dpackaging=pom -DgroupId=org.objenesis -Dfile=pom.xml -DartifactId=objenesis-parent -Dversion=2.2-SNAPSHOT --settings /srv/gump/public/workspace/objenesis/gump_mvn_settings.xml install:install-file 
[Working Directory: /srv/gump/public/workspace/objenesis]
M2_HOME: /opt/maven2
---------------------------------------------
7K downloaded  (plexus-1.0.9.pom)
Downloading: http://localhost:8192/maven2/org/apache/maven/wagon/wagon-provider-api/1.0-beta-5/wagon-provider-api-1.0-beta-5.pom
1K downloaded  (wagon-provider-api-1.0-beta-5.pom)
Downloading: http://localhost:8192/maven2/org/apache/maven/wagon/wagon-ssh-external/1.0-beta-5/wagon-ssh-external-1.0-beta-5.jar
14K downloaded  (wagon-ssh-external-1.0-beta-5.jar)
Downloading: http://localhost:8192/maven2/org/apache/maven/wagon/wagon-ssh-common/1.0-beta-5/wagon-ssh-common-1.0-beta-5.jar
25K downloaded  (wagon-ssh-common-1.0-beta-5.jar)
Downloading: http://localhost:8192/maven2/org/apache/felix/maven-bundle-plugin/2.3.5/maven-bundle-plugin-2.3.5.pom
3K downloaded  (maven-bundle-plugin-2.3.5.pom)
Downloading: http://localhost:8192/maven2/org/apache/felix/felix-parent/2.1/felix-parent-2.1.pom
9K downloaded  (felix-parent-2.1.pom)
Downloading: http://localhost:8192/maven2/org/apache/felix/maven-bundle-plugin/2.3.5/maven-bundle-plugin-2.3.5.jar
119K downloaded  (maven-bundle-plugin-2.3.5.jar)
Downloading: http://localhost:8192/maven2/biz/aQute/bndlib/1.43.0/bndlib-1.43.0.pom
1K downloaded  (bndlib-1.43.0.pom)
[WARNING] POM for 'biz.aQute:bndlib:pom:1.43.0:runtime' is invalid.

Its dependencies (if any) will NOT be available to the current build.
Downloading: http://localhost:8192/maven2/org/apache/felix/org.apache.felix.bundlerepository/1.6.6/org.apache.felix.bundlerepository-1.6.6.pom
5K downloaded  (org.apache.felix.bundlerepository-1.6.6.pom)
Downloading: http://localhost:8192/maven2/org/osgi/org.osgi.core/4.1.0/org.osgi.core-4.1.0.pom
193b downloaded  (org.osgi.core-4.1.0.pom)
Downloading: http://localhost:8192/maven2/org/easymock/easymock/2.4/easymock-2.4.pom
5K downloaded  (easymock-2.4.pom)
Downloading: http://localhost:8192/maven2/org/apache/maven/maven-core/2.0.7/maven-core-2.0.7.pom
6K downloaded  (maven-core-2.0.7.pom)
Downloading: http://localhost:8192/maven2/org/apache/maven/maven/2.0.7/maven-2.0.7.pom
10K downloaded  (maven-2.0.7.pom)
Downloading: http://localhost:8192/maven2/org/apache/maven/maven-settings/2.0.7/maven-settings-2.0.7.pom
1K downloaded  (maven-settings-2.0.7.pom)
Downloading: http://localhost:8192/maven2/org/apache/maven/maven-model/2.0.7/maven-model-2.0.7.pom
2K downloaded  (maven-model-2.0.7.pom)
[INFO] ------------------------------------------------------------------------
[ERROR] BUILD ERROR
[INFO] ------------------------------------------------------------------------
[INFO] Error building POM (may not be this project's POM).


Project ID: junit:junit

Reason: Invalid JDK version in profile 'restrict-doclint': Unbounded range: [1.8, for project junit:junit


[INFO] ------------------------------------------------------------------------
[INFO] For more information, run Maven with the -e switch
[INFO] ------------------------------------------------------------------------
[INFO] Total time: 5 seconds
[INFO] Finished at: Tue May 13 06:04:24 UTC 2014
[INFO] Final Memory: 10M/25M
[INFO] ------------------------------------------------------------------------
---------------------------------------------

To subscribe to this information via syndicated feeds:
- RSS: http://vmgump.apache.org/gump/public/objenesis/objenesis-parent/rss.xml
- Atom: http://vmgump.apache.org/gump/public/objenesis/objenesis-parent/atom.xml

============================== Gump Tracking Only ===
Produced by Apache Gump(TM) version 2.3.
Gump Run 20140513060006, vmgump.apache.org:vmgump:20140513060006
Gump E-mail Identifier (unique within run) #5.

*********************************************************** G U M P
[GUMP@vmgump]: Project commons-fileupload (in module apache-commons) failed
To whom it may engage...
        
This is an automated request, but not an unsolicited one. For 
more information please visit http://gump.apache.org/nagged.html, 
and/or contact the folk at general@gump.apache.org.

Project commons-fileupload has an issue affecting its community integration.
This issue affects 1 projects.
The current state of this project is 'Failed', with reason 'Build Failed'.
For reference only, the following projects are affected by this:
    - commons-fileupload :  Commons File Upload Package


Full details are available at:
    http://vmgump.apache.org/gump/public/apache-commons/commons-fileupload/index.html

That said, some information snippets are provided here.

The following annotations (debug/informational/warning/error messages) were provided:
 -DEBUG- Sole jar output [commons-fileupload-*[0-9T].jar] identifier set to project name
 -INFO- Optional dependency commons-io failed with reason build failed
 -DEBUG- (Apache Gump generated) Apache Maven Settings in: /srv/gump/public/workspace/apache-commons/fileupload/gump_mvn_settings.xml
 -INFO- Failed with reason build failed
 -DEBUG- Maven POM in: /srv/gump/public/workspace/apache-commons/fileupload/pom.xml
 -DEBUG- Extracted fallback artifacts from Gump Repository



The following work was performed:
http://vmgump.apache.org/gump/public/apache-commons/commons-fileupload/gump_work/build_apache-commons_commons-fileupload.html
Work Name: build_apache-commons_commons-fileupload (Type: Build)
Work ended in a state of : Failed
Elapsed: 6 secs
Command Line: /opt/maven2/bin/mvn --batch-mode -DskipTests=true --settings /srv/gump/public/workspace/apache-commons/fileupload/gump_mvn_settings.xml package 
[Working Directory: /srv/gump/public/workspace/apache-commons/fileupload]
M2_HOME: /opt/maven2
---------------------------------------------
Downloading: http://localhost:8192/maven2/org/apache/commons/commons-parent/23/commons-parent-23.pom
43K downloaded  (commons-parent-23.pom)
Downloading: http://localhost:8192/maven2/org/apache/commons/commons-build-plugin/1.4/commons-build-plugin-1.4.jar
24K downloaded  (commons-build-plugin-1.4.jar)
Downloading: http://localhost:8192/maven2/org/apache/felix/maven-bundle-plugin/2.4.0/maven-bundle-plugin-2.4.0.pom
3K downloaded  (maven-bundle-plugin-2.4.0.pom)
Downloading: http://localhost:8192/maven2/org/apache/felix/maven-bundle-plugin/2.4.0/maven-bundle-plugin-2.4.0.jar
123K downloaded  (maven-bundle-plugin-2.4.0.jar)
Downloading: http://localhost:8192/maven2/org/apache/rat/apache-rat-plugin/0.10/apache-rat-plugin-0.10.pom
9K downloaded  (apache-rat-plugin-0.10.pom)
Downloading: http://localhost:8192/maven2/org/apache/rat/apache-rat-project/0.10/apache-rat-project-0.10.pom
17K downloaded  (apache-rat-project-0.10.pom)
Downloading: http://localhost:8192/maven2/org/apache/rat/apache-rat-plugin/0.10/apache-rat-plugin-0.10.jar
41K downloaded  (apache-rat-plugin-0.10.jar)
Downloading: http://localhost:8192/maven2/org/apache/maven/plugins/maven-scm-publish-plugin/1.0-beta-2/maven-scm-publish-plugin-1.0-beta-2.pom
6K downloaded  (maven-scm-publish-plugin-1.0-beta-2.pom)
Downloading: http://localhost:8192/maven2/org/apache/maven/plugins/maven-scm-publish-plugin/1.0-beta-2/maven-scm-publish-plugin-1.0-beta-2.jar
34K downloaded  (maven-scm-publish-plugin-1.0-beta-2.jar)
Downloading: http://localhost:8192/maven2/org/codehaus/mojo/buildnumber-maven-plugin/1.2/buildnumber-maven-plugin-1.2.pom
12K downloaded  (buildnumber-maven-plugin-1.2.pom)
Downloading: http://localhost:8192/maven2/org/codehaus/mojo/mojo-parent/30/mojo-parent-30.pom
26K downloaded  (mojo-parent-30.pom)
Downloading: http://localhost:8192/maven2/org/codehaus/mojo/buildnumber-maven-plugin/1.2/buildnumber-maven-plugin-1.2.jar
25K downloaded  (buildnumber-maven-plugin-1.2.jar)
Downloading: http://localhost:8192/maven2/org/apache/maven/plugins/maven-release-plugin/2.4.2/maven-release-plugin-2.4.2.pom
11K downloaded  (maven-release-plugin-2.4.2.pom)
Downloading: http://localhost:8192/maven2/org/apache/maven/release/maven-release/2.4.2/maven-release-2.4.2.pom
4K downloaded  (maven-release-2.4.2.pom)
Downloading: http://localhost:8192/maven2/org/apache/maven/plugins/maven-release-plugin/2.4.2/maven-release-plugin-2.4.2.jar
49K downloaded  (maven-release-plugin-2.4.2.jar)
Downloading: http://localhost:8192/maven2/junit/junit/4.11/junit-4.11.pom
22K downloaded  (junit-4.11.pom)
[INFO] ------------------------------------------------------------------------
[ERROR] BUILD ERROR
[INFO] ------------------------------------------------------------------------
[INFO] Error building POM (may not be this project's POM).


Project ID: junit:junit

Reason: Invalid JDK version in profile 'restrict-doclint': Unbounded range: [1.8, for project junit:junit


[INFO] ------------------------------------------------------------------------
[INFO] For more information, run Maven with the -e switch
[INFO] ------------------------------------------------------------------------
[INFO] Total time: 5 seconds
[INFO] Finished at: Tue May 13 06:06:32 UTC 2014
[INFO] Final Memory: 12M/29M
[INFO] ------------------------------------------------------------------------
---------------------------------------------

To subscribe to this information via syndicated feeds:
- RSS: http://vmgump.apache.org/gump/public/apache-commons/commons-fileupload/rss.xml
- Atom: http://vmgump.apache.org/gump/public/apache-commons/commons-fileupload/atom.xml

============================== Gump Tracking Only ===
Produced by Apache Gump(TM) version 2.3.
Gump Run 20140513060006, vmgump.apache.org:vmgump:20140513060006
Gump E-mail Identifier (unique within run) #6.

*********************************************************** G U M P
[GUMP@vmgump]: Project commons-net (in module apache-commons) failed
To whom it may engage...
        
This is an automated request, but not an unsolicited one. For 
more information please visit http://gump.apache.org/nagged.html, 
and/or contact the folk at general@gump.apache.org.

Project commons-net has an issue affecting its community integration.
This issue affects 1 projects.
The current state of this project is 'Failed', with reason 'Build Failed'.
For reference only, the following projects are affected by this:
    - commons-net :  Commons Net


Full details are available at:
    http://vmgump.apache.org/gump/public/apache-commons/commons-net/index.html

That said, some information snippets are provided here.

The following annotations (debug/informational/warning/error messages) were provided:
 -DEBUG- (Apache Gump generated) Apache Maven Settings in: /srv/gump/public/workspace/apache-commons/net/gump_mvn_settings.xml
 -INFO- Failed with reason build failed
 -DEBUG- Maven POM in: /srv/gump/public/workspace/apache-commons/net/pom.xml
 -DEBUG- Extracted fallback artifacts from Gump Repository



The following work was performed:
http://vmgump.apache.org/gump/public/apache-commons/commons-net/gump_work/build_apache-commons_commons-net.html
Work Name: build_apache-commons_commons-net (Type: Build)
Work ended in a state of : Failed
Elapsed: 5 secs
Command Line: /opt/maven2/bin/mvn --batch-mode -DskipTests=true --settings /srv/gump/public/workspace/apache-commons/net/gump_mvn_settings.xml package 
[Working Directory: /srv/gump/public/workspace/apache-commons/net]
M2_HOME: /opt/maven2
---------------------------------------------
[INFO] Scanning for projects...
[INFO] ------------------------------------------------------------------------
[INFO] Building Apache Commons Net
[INFO]    task-segment: [package]
[INFO] ------------------------------------------------------------------------
Downloading: http://localhost:8192/maven2/org/apache/maven/plugins/maven-source-plugin/2.2.1/maven-source-plugin-2.2.1.pom
6K downloaded  (maven-source-plugin-2.2.1.pom)
Downloading: http://localhost:8192/maven2/org/apache/maven/plugins/maven-source-plugin/2.2.1/maven-source-plugin-2.2.1.jar
29K downloaded  (maven-source-plugin-2.2.1.jar)
Downloading: http://localhost:8192/maven2/org/codehaus/mojo/build-helper-maven-plugin/1.8/build-helper-maven-plugin-1.8.pom
6K downloaded  (build-helper-maven-plugin-1.8.pom)
Downloading: http://localhost:8192/maven2/org/codehaus/mojo/build-helper-maven-plugin/1.8/build-helper-maven-plugin-1.8.jar
41K downloaded  (build-helper-maven-plugin-1.8.jar)
Downloading: http://localhost:8192/maven2/org/apache/maven/plugins/maven-javadoc-plugin/2.9.1/maven-javadoc-plugin-2.9.1.pom
15K downloaded  (maven-javadoc-plugin-2.9.1.pom)
Downloading: http://localhost:8192/maven2/org/apache/maven/plugins/maven-javadoc-plugin/2.9.1/maven-javadoc-plugin-2.9.1.jar
359K downloaded  (maven-javadoc-plugin-2.9.1.jar)
[INFO] ------------------------------------------------------------------------
[ERROR] BUILD ERROR
[INFO] ------------------------------------------------------------------------
[INFO] Error building POM (may not be this project's POM).


Project ID: junit:junit

Reason: Invalid JDK version in profile 'restrict-doclint': Unbounded range: [1.8, for project junit:junit


[INFO] ------------------------------------------------------------------------
[INFO] For more information, run Maven with the -e switch
[INFO] ------------------------------------------------------------------------
[INFO] Total time: 4 seconds
[INFO] Finished at: Tue May 13 06:06:37 UTC 2014
[INFO] Final Memory: 17M/41M
[INFO] ------------------------------------------------------------------------
---------------------------------------------

To subscribe to this information via syndicated feeds:
- RSS: http://vmgump.apache.org/gump/public/apache-commons/commons-net/rss.xml
- Atom: http://vmgump.apache.org/gump/public/apache-commons/commons-net/atom.xml

============================== Gump Tracking Only ===
Produced by Apache Gump(TM) version 2.3.
Gump Run 20140513060006, vmgump.apache.org:vmgump:20140513060006
Gump E-mail Identifier (unique within run) #7.

*********************************************************** G U M P
[GUMP@vmgump]: Project commons-compress (in module apache-commons) failed
To whom it may engage...
        
This is an automated request, but not an unsolicited one. For 
more information please visit http://gump.apache.org/nagged.html, 
and/or contact the folk at general@gump.apache.org.

Project commons-compress has an issue affecting its community integration.
This issue affects 4 projects.
The current state of this project is 'Failed', with reason 'Build Failed'.
For reference only, the following projects are affected by this:
    - commons-compress :  Commons Compression Package
    - commons-compress-test :  Apache Commons
    - compress-antlib :  Task and Type Libraries for Apache Ant
    - compress-antlib-test :  Task and Type Libraries for Apache Ant


Full details are available at:
    http://vmgump.apache.org/gump/public/apache-commons/commons-compress/index.html

That said, some information snippets are provided here.

The following annotations (debug/informational/warning/error messages) were provided:
 -DEBUG- Sole jar output [commons-compress-*[0-9T].jar] identifier set to project name
 -DEBUG- (Apache Gump generated) Apache Maven Settings in: /srv/gump/public/workspace/apache-commons/compress/gump_mvn_settings.xml
 -INFO- Failed with reason build failed
 -DEBUG- Maven POM in: /srv/gump/public/workspace/apache-commons/compress/pom.xml
 -INFO- Failed to extract fallback artifacts from Gump Repository



The following work was performed:
http://vmgump.apache.org/gump/public/apache-commons/commons-compress/gump_work/build_apache-commons_commons-compress.html
Work Name: build_apache-commons_commons-compress (Type: Build)
Work ended in a state of : Failed
Elapsed: 4 secs
Command Line: /opt/maven2/bin/mvn --batch-mode -DskipTests=true --settings /srv/gump/public/workspace/apache-commons/compress/gump_mvn_settings.xml package 
[Working Directory: /srv/gump/public/workspace/apache-commons/compress]
M2_HOME: /opt/maven2
---------------------------------------------
[INFO] Scanning for projects...
[INFO] ------------------------------------------------------------------------
[INFO] Building Apache Commons Compress
[INFO]    task-segment: [package]
[INFO] ------------------------------------------------------------------------
[INFO] ------------------------------------------------------------------------
[ERROR] BUILD ERROR
[INFO] ------------------------------------------------------------------------
[INFO] Error building POM (may not be this project's POM).


Project ID: junit:junit

Reason: Invalid JDK version in profile 'restrict-doclint': Unbounded range: [1.8, for project junit:junit


[INFO] ------------------------------------------------------------------------
[INFO] For more information, run Maven with the -e switch
[INFO] ------------------------------------------------------------------------
[INFO] Total time: 2 seconds
[INFO] Finished at: Tue May 13 06:14:18 UTC 2014
[INFO] Final Memory: 10M/25M
[INFO] ------------------------------------------------------------------------
---------------------------------------------

To subscribe to this information via syndicated feeds:
- RSS: http://vmgump.apache.org/gump/public/apache-commons/commons-compress/rss.xml
- Atom: http://vmgump.apache.org/gump/public/apache-commons/commons-compress/atom.xml

============================== Gump Tracking Only ===
Produced by Apache Gump(TM) version 2.3.
Gump Run 20140513060006, vmgump.apache.org:vmgump:20140513060006
Gump E-mail Identifier (unique within run) #8.

*********************************************************** G U M P
[GUMP@vmgump]: Project commons-collections (in module commons-collections-3.x) failed
To whom it may engage...
        
This is an automated request, but not an unsolicited one. For 
more information please visit http://gump.apache.org/nagged.html, 
and/or contact the folk at general@gump.apache.org.

Project commons-collections has an issue affecting its community integration.
This issue affects 9 projects.
The current state of this project is 'Failed', with reason 'Build Failed'.
For reference only, the following projects are affected by this:
    - commons-collections :  Collections
    - commons-collections-test :  Collections
    - commons-collections-testframework :  Apache Commons Collections 3.x
    - commons-dbcp :  Object Pooling
    - commons-pool :  Object Pooling
    - tomcat-tc7.0.x :  Tomcat 7.x, a web server implementing Java Servlet 3.0,
    ...
    - tomcat-tc7.0.x-dbcp :  Tomcat 7.x, a web server implementing Java Servlet 3.0,
    ...
    - tomcat-tc7.0.x-test-bio :  Tomcat 7.x, a web server implementing Java Servlet 3.0,
    ...
    - tomcat-tc7.0.x-test-nio :  Tomcat 7.x, a web server implementing Java Servlet 3.0,
    ...


Full details are available at:
    http://vmgump.apache.org/gump/public/commons-collections-3.x/commons-collections/index.html

That said, some information snippets are provided here.

The following annotations (debug/informational/warning/error messages) were provided:
 -INFO- Optional dependency commons-lang failed with reason build failed
 -DEBUG- (Apache Gump generated) Apache Maven Settings in: /srv/gump/public/workspace/commons-collections-3.x/gump_mvn_settings.xml
 -INFO- Failed with reason build failed
 -DEBUG- Maven POM in: /srv/gump/public/workspace/commons-collections-3.x/pom.xml
 -DEBUG- Extracted fallback artifacts from Gump Repository



The following work was performed:
http://vmgump.apache.org/gump/public/commons-collections-3.x/commons-collections/gump_work/build_commons-collections-3.x_commons-collections.html
Work Name: build_commons-collections-3.x_commons-collections (Type: Build)
Work ended in a state of : Failed
Elapsed: 8 secs
Command Line: /opt/maven2/bin/mvn --batch-mode -DskipTests=true --settings /srv/gump/public/workspace/commons-collections-3.x/gump_mvn_settings.xml package 
[Working Directory: /srv/gump/public/workspace/commons-collections-3.x]
M2_HOME: /opt/maven2
---------------------------------------------
26K downloaded  (maven-jar-plugin-2.2.jar)
Downloading: http://localhost:8192/maven2/org/apache/felix/maven-bundle-plugin/1.4.0/maven-bundle-plugin-1.4.0.pom
4K downloaded  (maven-bundle-plugin-1.4.0.pom)
Downloading: http://localhost:8192/maven2/org/apache/felix/felix/1.0.2/felix-1.0.2.pom
13K downloaded  (felix-1.0.2.pom)
Downloading: http://localhost:8192/maven2/org/apache/felix/maven-bundle-plugin/1.4.0/maven-bundle-plugin-1.4.0.jar
134K downloaded  (maven-bundle-plugin-1.4.0.jar)
[INFO] artifact org.apache.maven.plugins:maven-idea-plugin: checking for updates from central
Downloading: http://localhost:8192/maven2/org/apache/maven/plugins/maven-idea-plugin/2.2.1/maven-idea-plugin-2.2.1.pom
6K downloaded  (maven-idea-plugin-2.2.1.pom)
Downloading: http://localhost:8192/maven2/org/apache/maven/plugins/maven-idea-plugin/2.2.1/maven-idea-plugin-2.2.1.jar
52K downloaded  (maven-idea-plugin-2.2.1.jar)
Downloading: http://localhost:8192/maven2/org/apache/maven/plugins/maven-antrun-plugin/1.1/maven-antrun-plugin-1.1.pom
1K downloaded  (maven-antrun-plugin-1.1.pom)
Downloading: http://localhost:8192/maven2/org/apache/maven/plugins/maven-plugin-parent/2.0.1/maven-plugin-parent-2.0.1.pom
7K downloaded  (maven-plugin-parent-2.0.1.pom)
Downloading: http://localhost:8192/maven2/org/apache/maven/plugins/maven-antrun-plugin/1.1/maven-antrun-plugin-1.1.jar
11K downloaded  (maven-antrun-plugin-1.1.jar)
Downloading: http://localhost:8192/maven2/org/apache/commons/commons-build-plugin/1.1/commons-build-plugin-1.1.pom
7K downloaded  (commons-build-plugin-1.1.pom)
Downloading: http://localhost:8192/maven2/org/apache/commons/commons-parent/10/commons-parent-10.pom
22K downloaded  (commons-parent-10.pom)
Downloading: http://localhost:8192/maven2/org/apache/commons/commons-build-plugin/1.1/commons-build-plugin-1.1.jar
19K downloaded  (commons-build-plugin-1.1.jar)
Downloading: http://localhost:8192/maven2/org/apache/maven/plugins/maven-assembly-plugin/2.2-beta-1/maven-assembly-plugin-2.2-beta-1.pom
12K downloaded  (maven-assembly-plugin-2.2-beta-1.pom)
Downloading: http://localhost:8192/maven2/org/apache/maven/plugins/maven-assembly-plugin/2.2-beta-1/maven-assembly-plugin-2.2-beta-1.jar
150K downloaded  (maven-assembly-plugin-2.2-beta-1.jar)
Downloading: http://localhost:8192/maven2/org/apache/maven/plugins/maven-source-plugin/2.0.4/maven-source-plugin-2.0.4.pom
3K downloaded  (maven-source-plugin-2.0.4.pom)
Downloading: http://localhost:8192/maven2/org/apache/maven/plugins/maven-source-plugin/2.0.4/maven-source-plugin-2.0.4.jar
14K downloaded  (maven-source-plugin-2.0.4.jar)
[INFO] ------------------------------------------------------------------------
[ERROR] BUILD ERROR
[INFO] ------------------------------------------------------------------------
[INFO] Error building POM (may not be this project's POM).


Project ID: junit:junit

Reason: Invalid JDK version in profile 'restrict-doclint': Unbounded range: [1.8, for project junit:junit


[INFO] ------------------------------------------------------------------------
[INFO] For more information, run Maven with the -e switch
[INFO] ------------------------------------------------------------------------
[INFO] Total time: 6 seconds
[INFO] Finished at: Tue May 13 06:18:26 UTC 2014
[INFO] Final Memory: 7M/19M
[INFO] ------------------------------------------------------------------------
---------------------------------------------

To subscribe to this information via syndicated feeds:
- RSS: http://vmgump.apache.org/gump/public/commons-collections-3.x/commons-collections/rss.xml
- Atom: http://vmgump.apache.org/gump/public/commons-collections-3.x/commons-collections/atom.xml

============================== Gump Tracking Only ===
Produced by Apache Gump(TM) version 2.3.
Gump Run 20140513060006, vmgump.apache.org:vmgump:20140513060006
Gump E-mail Identifier (unique within run) #9.

*********************************************************** G U M P
[GUMP@vmgump]: Project commons-exec (in module apache-commons) failed
To whom it may engage...
        
This is an automated request, but not an unsolicited one. For 
more information please visit http://gump.apache.org/nagged.html, 
and/or contact the folk at general@gump.apache.org.

Project commons-exec has an issue affecting its community integration.
This issue affects 1 projects.
The current state of this project is 'Failed', with reason 'Build Failed'.
For reference only, the following projects are affected by this:
    - commons-exec :  Commons Exec Package


Full details are available at:
    http://vmgump.apache.org/gump/public/apache-commons/commons-exec/index.html

That said, some information snippets are provided here.

The following annotations (debug/informational/warning/error messages) were provided:
 -DEBUG- Sole jar output [commons-exec-*[0-9T].jar] identifier set to project name
 -INFO- Optional dependency commons-lang failed with reason build failed
 -INFO- Optional dependency commons-collections failed with reason build failed
 -DEBUG- (Apache Gump generated) Apache Maven Settings in: /srv/gump/public/workspace/apache-commons/exec/gump_mvn_settings.xml
 -INFO- Failed with reason build failed
 -DEBUG- Maven POM in: /srv/gump/public/workspace/apache-commons/exec/pom.xml
 -INFO- Failed to extract fallback artifacts from Gump Repository



The following work was performed:
http://vmgump.apache.org/gump/public/apache-commons/commons-exec/gump_work/build_apache-commons_commons-exec.html
Work Name: build_apache-commons_commons-exec (Type: Build)
Work ended in a state of : Failed
Elapsed: 6 secs
Command Line: /opt/maven2/bin/mvn --batch-mode -DskipTests=true --settings /srv/gump/public/workspace/apache-commons/exec/gump_mvn_settings.xml package 
[Working Directory: /srv/gump/public/workspace/apache-commons/exec]
M2_HOME: /opt/maven2
---------------------------------------------
Downloading: http://localhost:8192/maven2/org/apache/commons/commons-parent/32/commons-parent-32.pom
51K downloaded  (commons-parent-32.pom)
[INFO] ------------------------------------------------------------------------
[INFO] Building Apache Commons Exec
[INFO]    task-segment: [package]
[INFO] ------------------------------------------------------------------------
Downloading: http://localhost:8192/maven2/org/apache/maven/plugins/maven-surefire-plugin/2.15/maven-surefire-plugin-2.15.pom
5K downloaded  (maven-surefire-plugin-2.15.pom)
Downloading: http://localhost:8192/maven2/org/apache/maven/surefire/surefire/2.15/surefire-2.15.pom
18K downloaded  (surefire-2.15.pom)
Downloading: http://localhost:8192/maven2/org/apache/maven/plugins/maven-surefire-plugin/2.15/maven-surefire-plugin-2.15.jar
31K downloaded  (maven-surefire-plugin-2.15.jar)
Downloading: http://localhost:8192/maven2/org/apache/maven/plugins/maven-remote-resources-plugin/1.4/maven-remote-resources-plugin-1.4.pom
13K downloaded  (maven-remote-resources-plugin-1.4.pom)
Downloading: http://localhost:8192/maven2/org/apache/maven/plugins/maven-remote-resources-plugin/1.4/maven-remote-resources-plugin-1.4.jar
65K downloaded  (maven-remote-resources-plugin-1.4.jar)
Downloading: http://localhost:8192/maven2/org/apache/maven/plugins/maven-release-plugin/2.0/maven-release-plugin-2.0.pom
7K downloaded  (maven-release-plugin-2.0.pom)
Downloading: http://localhost:8192/maven2/org/apache/maven/release/maven-release/2.0/maven-release-2.0.pom
6K downloaded  (maven-release-2.0.pom)
Downloading: http://localhost:8192/maven2/org/apache/maven/maven-parent/16/maven-parent-16.pom
22K downloaded  (maven-parent-16.pom)
Downloading: http://localhost:8192/maven2/org/apache/apache/7/apache-7.pom
14K downloaded  (apache-7.pom)
Downloading: http://localhost:8192/maven2/org/apache/maven/plugins/maven-release-plugin/2.0/maven-release-plugin-2.0.jar
37K downloaded  (maven-release-plugin-2.0.jar)
Downloading: http://localhost:8192/maven2/org/apache/rat/apache-rat-plugin/0.9/apache-rat-plugin-0.9.pom
9K downloaded  (apache-rat-plugin-0.9.pom)
Downloading: http://localhost:8192/maven2/org/apache/rat/apache-rat-project/0.9/apache-rat-project-0.9.pom
16K downloaded  (apache-rat-project-0.9.pom)
Downloading: http://localhost:8192/maven2/org/apache/rat/apache-rat-plugin/0.9/apache-rat-plugin-0.9.jar
41K downloaded  (apache-rat-plugin-0.9.jar)
[INFO] ------------------------------------------------------------------------
[ERROR] BUILD ERROR
[INFO] ------------------------------------------------------------------------
[INFO] Error building POM (may not be this project's POM).


Project ID: junit:junit

Reason: Invalid JDK version in profile 'restrict-doclint': Unbounded range: [1.8, for project junit:junit


[INFO] ------------------------------------------------------------------------
[INFO] For more information, run Maven with the -e switch
[INFO] ------------------------------------------------------------------------
[INFO] Total time: 5 seconds
[INFO] Finished at: Tue May 13 06:18:32 UTC 2014
[INFO] Final Memory: 12M/28M
[INFO] ------------------------------------------------------------------------
---------------------------------------------

To subscribe to this information via syndicated feeds:
- RSS: http://vmgump.apache.org/gump/public/apache-commons/commons-exec/rss.xml
- Atom: http://vmgump.apache.org/gump/public/apache-commons/commons-exec/atom.xml

============================== Gump Tracking Only ===
Produced by Apache Gump(TM) version 2.3.
Gump Run 20140513060006, vmgump.apache.org:vmgump:20140513060006
Gump E-mail Identifier (unique within run) #10.

*********************************************************** G U M P
[GUMP@vmgump]: Project pdfbox-parent (in module pdfbox) failed
To whom it may engage...
        
This is an automated request, but not an unsolicited one. For 
more information please visit http://gump.apache.org/nagged.html, 
and/or contact the folk at general@gump.apache.org.

Project pdfbox-parent has an issue affecting its community integration.
This issue affects 2 projects.
The current state of this project is 'Failed', with reason 'Build Failed'.
For reference only, the following projects are affected by this:
    - fontbox :  Apache PDFBox is an open source Java PDF library for working...
    - pdfbox-parent :  Apache PDFBox is an open source Java PDF library for working...


Full details are available at:
    http://vmgump.apache.org/gump/public/pdfbox/pdfbox-parent/index.html

That said, some information snippets are provided here.

The following annotations (debug/informational/warning/error messages) were provided:
 -INFO- Optional dependency commons-collections failed with reason build failed
 -DEBUG- (Apache Gump generated) Apache Maven Settings in: /srv/gump/public/workspace/pdfbox/parent/gump_mvn_settings.xml
 -INFO- Failed with reason build failed
 -DEBUG- Maven POM in: /srv/gump/public/workspace/pdfbox/parent/pom.xml



The following work was performed:
http://vmgump.apache.org/gump/public/pdfbox/pdfbox-parent/gump_work/build_pdfbox_pdfbox-parent.html
Work Name: build_pdfbox_pdfbox-parent (Type: Build)
Work ended in a state of : Failed
Elapsed: 5 secs
Command Line: /opt/maven2/bin/mvn --batch-mode -Dpackaging=pom -DgroupId=org.apache.pdfbox -Dfile=pom.xml -DartifactId=pdfbox-parent -Dversion=2.0.0-SNAPSHOT --settings /srv/gump/public/workspace/pdfbox/parent/gump_mvn_settings.xml install:install-file 
[Working Directory: /srv/gump/public/workspace/pdfbox/parent]
M2_HOME: /opt/maven2
---------------------------------------------
[INFO] Scanning for projects...
Downloading: http://jbig2-imageio.googlecode.com/svn/maven-repository//org/apache/apache/14/apache-14.pom
[INFO] Unable to find resource 'org.apache:apache:pom:14' in repository jbig2.googlecode (http://jbig2-imageio.googlecode.com/svn/maven-repository/)
Downloading: http://www.mygrid.org.uk/maven/repository/org/apache/apache/14/apache-14.pom
[INFO] Unable to find resource 'org.apache:apache:pom:14' in repository mygrid-repository (http://www.mygrid.org.uk/maven/repository)
Downloading: http://localhost:8192/maven2/org/apache/apache/14/apache-14.pom
14K downloaded  (apache-14.pom)
[INFO] Searching repository for plugin with prefix: 'install'.
[INFO] ------------------------------------------------------------------------
[INFO] Building PDFBox parent
[INFO]    task-segment: [install:install-file] (aggregator-style)
[INFO] ------------------------------------------------------------------------
[INFO] ------------------------------------------------------------------------
[ERROR] BUILD ERROR
[INFO] ------------------------------------------------------------------------
[INFO] Error building POM (may not be this project's POM).


Project ID: junit:junit

Reason: Invalid JDK version in profile 'restrict-doclint': Unbounded range: [1.8, for project junit:junit


[INFO] ------------------------------------------------------------------------
[INFO] For more information, run Maven with the -e switch
[INFO] ------------------------------------------------------------------------
[INFO] Total time: 5 seconds
[INFO] Finished at: Tue May 13 06:20:43 UTC 2014
[INFO] Final Memory: 10M/25M
[INFO] ------------------------------------------------------------------------
---------------------------------------------

To subscribe to this information via syndicated feeds:
- RSS: http://vmgump.apache.org/gump/public/pdfbox/pdfbox-parent/rss.xml
- Atom: http://vmgump.apache.org/gump/public/pdfbox/pdfbox-parent/atom.xml

============================== Gump Tracking Only ===
Produced by Apache Gump(TM) version 2.3.
Gump Run 20140513060006, vmgump.apache.org:vmgump:20140513060006
Gump E-mail Identifier (unique within run) #11.

*********************************************************** G U M P
[GUMP@vmgump]: Project tika-parent (in module tika) failed
To whom it may engage...
        
This is an automated request, but not an unsolicited one. For 
more information please visit http://gump.apache.org/nagged.html, 
and/or contact the folk at general@gump.apache.org.

Project tika-parent has an issue affecting its community integration.
This issue affects 5 projects.
The current state of this project is 'Failed', with reason 'Build Failed'.
For reference only, the following projects are affected by this:
    - tika-core :  Apache Tika is a toolkit for detecting and extracting metada...
    - tika-parent :  Apache Tika is a toolkit for detecting and extracting metada...
    - tika-parsers :  Apache Tika is a toolkit for detecting and extracting metada...
    - tika-parsers-test :  Apache Tika is a toolkit for detecting and extracting metada...
    - tika-reactor :  Apache Tika is a toolkit for detecting and extracting metada...


Full details are available at:
    http://vmgump.apache.org/gump/public/tika/tika-parent/index.html

That said, some information snippets are provided here.

The following annotations (debug/informational/warning/error messages) were provided:
 -INFO- Optional dependency commons-collections failed with reason build failed
 -DEBUG- (Apache Gump generated) Apache Maven Settings in: /srv/gump/public/workspace/tika/tika-parent/gump_mvn_settings.xml
 -INFO- Failed with reason build failed
 -DEBUG- Maven POM in: /srv/gump/public/workspace/tika/tika-parent/pom.xml



The following work was performed:
http://vmgump.apache.org/gump/public/tika/tika-parent/gump_work/build_tika_tika-parent.html
Work Name: build_tika_tika-parent (Type: Build)
Work ended in a state of : Failed
Elapsed: 3 secs
Command Line: /opt/maven2/bin/mvn --batch-mode -Dpackaging=pom -DgroupId=org.apache.tika -Dfile=pom.xml -DartifactId=tika-parent -Dversion=1.6-SNAPSHOT --settings /srv/gump/public/workspace/tika/tika-parent/gump_mvn_settings.xml install:install-file 
[Working Directory: /srv/gump/public/workspace/tika/tika-parent]
M2_HOME: /opt/maven2
---------------------------------------------
[INFO] Scanning for projects...
Downloading: http://localhost:8192/maven2/org/apache/maven/plugins/maven-remote-resources-plugin/1.2.1/maven-remote-resources-plugin-1.2.1.pom
12K downloaded  (maven-remote-resources-plugin-1.2.1.pom)
Downloading: http://localhost:8192/maven2/org/apache/maven/plugins/maven-plugins/19/maven-plugins-19.pom
10K downloaded  (maven-plugins-19.pom)
Downloading: http://localhost:8192/maven2/org/apache/maven/maven-parent/19/maven-parent-19.pom
24K downloaded  (maven-parent-19.pom)
Downloading: http://localhost:8192/maven2/org/apache/maven/plugins/maven-remote-resources-plugin/1.2.1/maven-remote-resources-plugin-1.2.1.jar
62K downloaded  (maven-remote-resources-plugin-1.2.1.jar)
Downloading: http://localhost:8192/maven2/org/apache/maven/plugins/maven-compiler-plugin/2.3.2/maven-compiler-plugin-2.3.2.pom
7K downloaded  (maven-compiler-plugin-2.3.2.pom)
Downloading: http://localhost:8192/maven2/org/apache/maven/plugins/maven-compiler-plugin/2.3.2/maven-compiler-plugin-2.3.2.jar
28K downloaded  (maven-compiler-plugin-2.3.2.jar)
[INFO] Searching repository for plugin with prefix: 'install'.
[INFO] ------------------------------------------------------------------------
[INFO] Building Apache Tika parent
[INFO]    task-segment: [install:install-file] (aggregator-style)
[INFO] ------------------------------------------------------------------------
[INFO] ------------------------------------------------------------------------
[ERROR] BUILD ERROR
[INFO] ------------------------------------------------------------------------
[INFO] Error building POM (may not be this project's POM).


Project ID: junit:junit

Reason: Invalid JDK version in profile 'restrict-doclint': Unbounded range: [1.8, for project junit:junit


[INFO] ------------------------------------------------------------------------
[INFO] For more information, run Maven with the -e switch
[INFO] ------------------------------------------------------------------------
[INFO] Total time: 2 seconds
[INFO] Finished at: Tue May 13 06:30:44 UTC 2014
[INFO] Final Memory: 5M/15M
[INFO] ------------------------------------------------------------------------
---------------------------------------------

To subscribe to this information via syndicated feeds:
- RSS: http://vmgump.apache.org/gump/public/tika/tika-parent/rss.xml
- Atom: http://vmgump.apache.org/gump/public/tika/tika-parent/atom.xml

============================== Gump Tracking Only ===
Produced by Apache Gump(TM) version 2.3.
Gump Run 20140513060006, vmgump.apache.org:vmgump:20140513060006
Gump E-mail Identifier (unique within run) #13.

*********************************************************** G U M P
[GUMP@vmgump]: Project rat (in module rat) failed
To whom it may engage...
        
This is an automated request, but not an unsolicited one. For 
more information please visit http://gump.apache.org/nagged.html, 
and/or contact the folk at general@gump.apache.org.

Project rat has an issue affecting its community integration.
This issue affects 1 projects.
The current state of this project is 'Failed', with reason 'Build Failed'.
For reference only, the following projects are affected by this:
    - rat :  Release Audit Tool


Full details are available at:
    http://vmgump.apache.org/gump/public/rat/rat/index.html

That said, some information snippets are provided here.

The following annotations (debug/informational/warning/error messages) were provided:
 -INFO- Optional dependency commons-beanutils prerequisite failed with reason build failed
 -INFO- Optional dependency commons-compress failed with reason build failed
 -INFO- Optional dependency commons-collections failed with reason build failed
 -DEBUG- (Apache Gump generated) Apache Maven Settings in: /srv/gump/public/workspace/rat/gump_mvn_settings.xml
 -INFO- Failed with reason build failed
 -DEBUG- Maven POM in: /srv/gump/public/workspace/rat/pom.xml
 -DEBUG- Extracted fallback artifacts from Gump Repository



The following work was performed:
http://vmgump.apache.org/gump/public/rat/rat/gump_work/build_rat_rat.html
Work Name: build_rat_rat (Type: Build)
Work ended in a state of : Failed
Elapsed: 4 secs
Command Line: /opt/maven2/bin/mvn --batch-mode -DskipTests=true --settings /srv/gump/public/workspace/rat/gump_mvn_settings.xml package 
[Working Directory: /srv/gump/public/workspace/rat]
M2_HOME: /opt/maven2
---------------------------------------------
[INFO] Scanning for projects...
[INFO] Reactor build order: 
[INFO]   Apache Creadur Rat
[INFO]   Apache Creadur Rat::Core
[INFO]   Apache Creadur Rat::Plugin4Maven
[INFO]   Apache Creadur Rat::Tasks4Ant
[INFO]   Apache Creadur Rat::Command Line
Downloading: http://localhost:8192/maven2/org/apache/maven/wagon/wagon-ssh/1.0-beta-7/wagon-ssh-1.0-beta-7.pom
2K downloaded  (wagon-ssh-1.0-beta-7.pom)
Downloading: http://localhost:8192/maven2/org/apache/maven/wagon/wagon-providers/1.0-beta-7/wagon-providers-1.0-beta-7.pom
2K downloaded  (wagon-providers-1.0-beta-7.pom)
Downloading: http://localhost:8192/maven2/org/apache/maven/wagon/wagon/1.0-beta-7/wagon-1.0-beta-7.pom
11K downloaded  (wagon-1.0-beta-7.pom)
Downloading: http://localhost:8192/maven2/com/jcraft/jsch/0.1.38/jsch-0.1.38.pom
967b downloaded  (jsch-0.1.38.pom)
Downloading: http://localhost:8192/maven2/org/apache/maven/wagon/wagon-ssh-common/1.0-beta-7/wagon-ssh-common-1.0-beta-7.pom
1K downloaded  (wagon-ssh-common-1.0-beta-7.pom)
Downloading: http://localhost:8192/maven2/org/apache/maven/wagon/wagon-provider-api/1.0-beta-7/wagon-provider-api-1.0-beta-7.pom
1K downloaded  (wagon-provider-api-1.0-beta-7.pom)
Downloading: http://localhost:8192/maven2/org/apache/maven/wagon/wagon-ssh/1.0-beta-7/wagon-ssh-1.0-beta-7.jar
27K downloaded  (wagon-ssh-1.0-beta-7.jar)
Downloading: http://localhost:8192/maven2/org/apache/maven/wagon/wagon-ssh-common/1.0-beta-7/wagon-ssh-common-1.0-beta-7.jar
26K downloaded  (wagon-ssh-common-1.0-beta-7.jar)
[INFO] ------------------------------------------------------------------------
[INFO] Building Apache Creadur Rat
[INFO]    task-segment: [package]
[INFO] ------------------------------------------------------------------------
Downloading: http://localhost:8192/maven2/org/apache/maven/plugins/maven-site-plugin/3.3/maven-site-plugin-3.3.pom
20K downloaded  (maven-site-plugin-3.3.pom)
Downloading: http://localhost:8192/maven2/org/apache/maven/plugins/maven-site-plugin/3.3/maven-site-plugin-3.3.jar
121K downloaded  (maven-site-plugin-3.3.jar)
[INFO] ------------------------------------------------------------------------
[ERROR] BUILD ERROR
[INFO] ------------------------------------------------------------------------
[INFO] Error building POM (may not be this project's POM).


Project ID: junit:junit

Reason: Invalid JDK version in profile 'restrict-doclint': Unbounded range: [1.8, for project junit:junit


[INFO] ------------------------------------------------------------------------
[INFO] For more information, run Maven with the -e switch
[INFO] ------------------------------------------------------------------------
[INFO] Total time: 3 seconds
[INFO] Finished at: Tue May 13 06:31:11 UTC 2014
[INFO] Final Memory: 7M/18M
[INFO] ------------------------------------------------------------------------
---------------------------------------------

To subscribe to this information via syndicated feeds:
- RSS: http://vmgump.apache.org/gump/public/rat/rat/rss.xml
- Atom: http://vmgump.apache.org/gump/public/rat/rat/atom.xml

============================== Gump Tracking Only ===
Produced by Apache Gump(TM) version 2.3.
Gump Run 20140513060006, vmgump.apache.org:vmgump:20140513060006
Gump E-mail Identifier (unique within run) #14.

*********************************************************** G U M P
[GUMP@vmgump]: Project commons-cli (in module apache-commons) failed
To whom it may engage...
        
This is an automated request, but not an unsolicited one. For 
more information please visit http://gump.apache.org/nagged.html, 
and/or contact the folk at general@gump.apache.org.

Project commons-cli has an issue affecting its community integration.
This issue affects 1 projects.
The current state of this project is 'Failed', with reason 'Build Failed'.
For reference only, the following projects are affected by this:
    - commons-cli :  Commons CLI Package


Full details are available at:
    http://vmgump.apache.org/gump/public/apache-commons/commons-cli/index.html

That said, some information snippets are provided here.

The following annotations (debug/informational/warning/error messages) were provided:
 -DEBUG- Sole jar output [commons-cli-*[0-9T].jar] identifier set to project name
 -INFO- Optional dependency commons-collections failed with reason build failed
 -DEBUG- (Apache Gump generated) Apache Maven Settings in: /srv/gump/public/workspace/apache-commons/cli/gump_mvn_settings.xml
 -INFO- Failed with reason build failed
 -DEBUG- Maven POM in: /srv/gump/public/workspace/apache-commons/cli/pom.xml
 -DEBUG- Extracted fallback artifacts from Gump Repository



The following work was performed:
http://vmgump.apache.org/gump/public/apache-commons/commons-cli/gump_work/build_apache-commons_commons-cli.html
Work Name: build_apache-commons_commons-cli (Type: Build)
Work ended in a state of : Failed
Elapsed: 3 secs
Command Line: /opt/maven2/bin/mvn --batch-mode --settings /srv/gump/public/workspace/apache-commons/cli/gump_mvn_settings.xml package 
[Working Directory: /srv/gump/public/workspace/apache-commons/cli]
M2_HOME: /opt/maven2
---------------------------------------------
[INFO] Scanning for projects...
[INFO] ------------------------------------------------------------------------
[INFO] Building Apache Commons CLI
[INFO]    task-segment: [package]
[INFO] ------------------------------------------------------------------------
[INFO] ------------------------------------------------------------------------
[ERROR] BUILD ERROR
[INFO] ------------------------------------------------------------------------
[INFO] Error building POM (may not be this project's POM).


Project ID: junit:junit

Reason: Invalid JDK version in profile 'restrict-doclint': Unbounded range: [1.8, for project junit:junit


[INFO] ------------------------------------------------------------------------
[INFO] For more information, run Maven with the -e switch
[INFO] ------------------------------------------------------------------------
[INFO] Total time: 2 seconds
[INFO] Finished at: Tue May 13 06:31:16 UTC 2014
[INFO] Final Memory: 11M/26M
[INFO] ------------------------------------------------------------------------
---------------------------------------------

To subscribe to this information via syndicated feeds:
- RSS: http://vmgump.apache.org/gump/public/apache-commons/commons-cli/rss.xml
- Atom: http://vmgump.apache.org/gump/public/apache-commons/commons-cli/atom.xml

============================== Gump Tracking Only ===
Produced by Apache Gump(TM) version 2.3.
Gump Run 20140513060006, vmgump.apache.org:vmgump:20140513060006
Gump E-mail Identifier (unique within run) #15.

*********************************************************** G U M P
[GUMP@vmgump]: Project commons-jxpath (in module apache-commons) failed
To whom it may engage...
        
This is an automated request, but not an unsolicited one. For 
more information please visit http://gump.apache.org/nagged.html, 
and/or contact the folk at general@gump.apache.org.

Project commons-jxpath has an issue affecting its community integration.
This issue affects 1 projects.
The current state of this project is 'Failed', with reason 'Build Failed'.
For reference only, the following projects are affected by this:
    - commons-jxpath :  XPath traversal of JavaBeans


Full details are available at:
    http://vmgump.apache.org/gump/public/apache-commons/commons-jxpath/index.html

That said, some information snippets are provided here.

The following annotations (debug/informational/warning/error messages) were provided:
 -DEBUG- Sole jar output [commons-jxpath-*[0-9T].jar] identifier set to project name
 -INFO- Optional dependency commons-beanutils prerequisite failed with reason build failed
 -DEBUG- (Apache Gump generated) Apache Maven Settings in: /srv/gump/public/workspace/apache-commons/jxpath/gump_mvn_settings.xml
 -INFO- Failed with reason build failed
 -DEBUG- Maven POM in: /srv/gump/public/workspace/apache-commons/jxpath/pom.xml
 -DEBUG- Extracted fallback artifacts from Gump Repository



The following work was performed:
http://vmgump.apache.org/gump/public/apache-commons/commons-jxpath/gump_work/build_apache-commons_commons-jxpath.html
Work Name: build_apache-commons_commons-jxpath (Type: Build)
Work ended in a state of : Failed
Elapsed: 4 secs
Command Line: /opt/maven2/bin/mvn --batch-mode -DskipTests=true --settings /srv/gump/public/workspace/apache-commons/jxpath/gump_mvn_settings.xml package 
[Working Directory: /srv/gump/public/workspace/apache-commons/jxpath]
M2_HOME: /opt/maven2
---------------------------------------------
[INFO] Scanning for projects...
Downloading: http://localhost:8192/maven2/org/apache/commons/commons-parent/28/commons-parent-28.pom
48K downloaded  (commons-parent-28.pom)
[INFO] ------------------------------------------------------------------------
[INFO] Building Apache Commons JXPath
[INFO]    task-segment: [package]
[INFO] ------------------------------------------------------------------------
Downloading: http://localhost:8192/maven2/org/apache/maven/plugins/maven-compiler-plugin/3.0/maven-compiler-plugin-3.0.pom
9K downloaded  (maven-compiler-plugin-3.0.pom)
Downloading: http://localhost:8192/maven2/org/apache/maven/plugins/maven-compiler-plugin/3.0/maven-compiler-plugin-3.0.jar
40K downloaded  (maven-compiler-plugin-3.0.jar)
Downloading: http://localhost:8192/maven2/org/apache/maven/plugins/maven-surefire-plugin/2.13/maven-surefire-plugin-2.13.pom
5K downloaded  (maven-surefire-plugin-2.13.pom)
Downloading: http://localhost:8192/maven2/org/apache/maven/surefire/surefire/2.13/surefire-2.13.pom
16K downloaded  (surefire-2.13.pom)
Downloading: http://localhost:8192/maven2/org/apache/maven/plugins/maven-surefire-plugin/2.13/maven-surefire-plugin-2.13.jar
30K downloaded  (maven-surefire-plugin-2.13.jar)
Downloading: http://localhost:8192/maven2/org/apache/rat/apache-rat-plugin/0.8/apache-rat-plugin-0.8.pom
5K downloaded  (apache-rat-plugin-0.8.pom)
Downloading: http://localhost:8192/maven2/org/apache/rat/apache-rat-project/0.8/apache-rat-project-0.8.pom
12K downloaded  (apache-rat-project-0.8.pom)
Downloading: http://localhost:8192/maven2/org/apache/rat/apache-rat-plugin/0.8/apache-rat-plugin-0.8.jar
29K downloaded  (apache-rat-plugin-0.8.jar)
Downloading: http://localhost:8192/maven2/xerces/xercesImpl/2.4.0/xercesImpl-2.4.0.pom
150b downloaded  (xercesImpl-2.4.0.pom)
Downloading: http://localhost:8192/maven2/javax/servlet/servlet-api/2.4/servlet-api-2.4.pom
156b downloaded  (servlet-api-2.4.pom)
Downloading: http://localhost:8192/maven2/javax/servlet/jsp-api/2.0/jsp-api-2.0.pom
362b downloaded  (jsp-api-2.0.pom)
[INFO] ------------------------------------------------------------------------
[ERROR] BUILD ERROR
[INFO] ------------------------------------------------------------------------
[INFO] Error building POM (may not be this project's POM).


Project ID: junit:junit

Reason: Invalid JDK version in profile 'restrict-doclint': Unbounded range: [1.8, for project junit:junit


[INFO] ------------------------------------------------------------------------
[INFO] For more information, run Maven with the -e switch
[INFO] ------------------------------------------------------------------------
[INFO] Total time: 3 seconds
[INFO] Finished at: Tue May 13 06:32:11 UTC 2014
[INFO] Final Memory: 10M/25M
[INFO] ------------------------------------------------------------------------
---------------------------------------------

To subscribe to this information via syndicated feeds:
- RSS: http://vmgump.apache.org/gump/public/apache-commons/commons-jxpath/rss.xml
- Atom: http://vmgump.apache.org/gump/public/apache-commons/commons-jxpath/atom.xml

============================== Gump Tracking Only ===
Produced by Apache Gump(TM) version 2.3.
Gump Run 20140513060006, vmgump.apache.org:vmgump:20140513060006
Gump E-mail Identifier (unique within run) #16.


--
Apache Gump
http://gump.apache.org/ [Instance: vmgump]

---------------------------------------------------------------------
To unsubscribe, e-mail: general-unsubscribe@gump.apache.org
For additional commands, e-mail: general-help@gump.apache.org


Mime
View raw message