gump-general mailing list archives

Site index · List index
Message view « Date » · « Thread »
Top « Date » · « Thread »
From g...@vmgump.apache.org
Subject BATCH: All dressed up, with nowhere to go...
Date Wed, 30 Apr 2014 03:45:17 GMT
Dear Gumpmeisters,
            
The following 4 notifys should have been sent

*********************************************************** G U M P
[GUMP@vmgump]: Project easymock (in module easymock) failed
[GUMP@vmgump]: Project commons-betwixt (in module apache-commons) failed
[GUMP@vmgump]: Project tika-parsers (in module tika) failed
[GUMP@vmgump]: Project tika-reactor (in module tika) failed
*********************************************************** G U M P
[GUMP@vmgump]: Project easymock (in module easymock) failed
To whom it may engage...
        
This is an automated request, but not an unsolicited one. For 
more information please visit http://gump.apache.org/nagged.html, 
and/or contact the folk at general@gump.apache.org.

Project easymock has an issue affecting its community integration.
This issue affects 4 projects,
 and has been outstanding for 414 runs.
The current state of this project is 'Failed', with reason 'Build Failed'.
For reference only, the following projects are affected by this:
    - easymock :  EasyMock is a Java library that provides an easy way to use ...
    - tomcat-trunk-test :  Tomcat 8.x, a web server implementing the Java Servlet 3.1,
...
    - tomcat-trunk-test-nio :  Tomcat 8.x, a web server implementing the Java Servlet 3.1,
...
    - tomcat-trunk-test-nio2 :  Tomcat 8.x, a web server implementing the Java Servlet 3.1,
...


Full details are available at:
    http://vmgump.apache.org/gump/public/easymock/easymock/index.html

That said, some information snippets are provided here.

The following annotations (debug/informational/warning/error messages) were provided:
 -DEBUG- (Apache Gump generated) Apache Maven Settings in: /srv/gump/public/workspace/easymock/easymock/gump_mvn_settings.xml
 -INFO- Failed with reason build failed
 -DEBUG- Maven POM in: /srv/gump/public/workspace/easymock/easymock/pom.xml
 -INFO- Failed to extract fallback artifacts from Gump Repository



The following work was performed:
http://vmgump.apache.org/gump/public/easymock/easymock/gump_work/build_easymock_easymock.html
Work Name: build_easymock_easymock (Type: Build)
Work ended in a state of : Failed
Elapsed: 11 secs
Command Line: /opt/maven3/bin/mvn --batch-mode --settings /srv/gump/public/workspace/easymock/easymock/gump_mvn_settings.xml
package 
[Working Directory: /srv/gump/public/workspace/easymock/easymock]
M2_HOME: /opt/maven3
---------------------------------------------
[INFO] skip non existing resourceDirectory /srv/gump/public/workspace/easymock/easymock/src/main/resources
[INFO] Copying 2 resources
[INFO] 
[INFO] --- maven-compiler-plugin:3.1:compile (default-compile) @ easymock ---
Downloading: http://localhost:8192/maven2/org/codehaus/plexus/plexus-utils/1.5.1/plexus-utils-1.5.1.jar
Downloading: http://localhost:8192/maven2/log4j/log4j/1.2.12/log4j-1.2.12.jar
Downloading: http://localhost:8192/maven2/commons-logging/commons-logging-api/1.1/commons-logging-api-1.1.jar
Downloading: http://localhost:8192/maven2/org/apache/xbean/xbean-reflect/3.4/xbean-reflect-3.4.jar
Downloading: http://localhost:8192/maven2/com/google/collections/google-collections/1.0/google-collections-1.0.jar
Downloaded: http://localhost:8192/maven2/log4j/log4j/1.2.12/log4j-1.2.12.jar (328 KB at 9098.7
KB/sec)
Downloading: http://localhost:8192/maven2/junit/junit/3.8.2/junit-3.8.2.jar
Downloaded: http://localhost:8192/maven2/junit/junit/3.8.2/junit-3.8.2.jar (288 KB at 8460.1
KB/sec)
Downloaded: http://localhost:8192/maven2/org/codehaus/plexus/plexus-utils/1.5.1/plexus-utils-1.5.1.jar
(206 KB at 898.4 KB/sec)
Downloaded: http://localhost:8192/maven2/org/apache/xbean/xbean-reflect/3.4/xbean-reflect-3.4.jar
(131 KB at 553.8 KB/sec)
Downloaded: http://localhost:8192/maven2/com/google/collections/google-collections/1.0/google-collections-1.0.jar
(625 KB at 2313.3 KB/sec)
Downloaded: http://localhost:8192/maven2/commons-logging/commons-logging-api/1.1/commons-logging-api-1.1.jar
(44 KB at 137.4 KB/sec)
[INFO] Changes detected - recompiling the module!
[INFO] Compiling 80 source files to /srv/gump/public/workspace/easymock/easymock/target/classes
[INFO] -------------------------------------------------------------
[ERROR] COMPILATION ERROR : 
[INFO] -------------------------------------------------------------
[ERROR] /srv/gump/public/workspace/easymock/easymock/src/main/java/org/easymock/EasyMockRule.java:[18,29]
cannot find symbol
  symbol:   class EasyMockStatement
  location: package org.easymock.internal
[ERROR] /srv/gump/public/workspace/easymock/easymock/src/main/java/org/easymock/EasyMockRule.java:[38,20]
cannot find symbol
  symbol:   class EasyMockStatement
  location: class org.easymock.EasyMockRule
[INFO] 2 errors 
[INFO] -------------------------------------------------------------
[INFO] ------------------------------------------------------------------------
[INFO] BUILD FAILURE
[INFO] ------------------------------------------------------------------------
[INFO] Total time: 9.402s
[INFO] Finished at: Wed Apr 30 02:14:41 UTC 2014
[INFO] Final Memory: 12M/36M
[INFO] ------------------------------------------------------------------------
[ERROR] Failed to execute goal org.apache.maven.plugins:maven-compiler-plugin:3.1:compile
(default-compile) on project easymock: Compilation failure: Compilation failure:
[ERROR] /srv/gump/public/workspace/easymock/easymock/src/main/java/org/easymock/EasyMockRule.java:[18,29]
cannot find symbol
[ERROR] symbol:   class EasyMockStatement
[ERROR] location: package org.easymock.internal
[ERROR] /srv/gump/public/workspace/easymock/easymock/src/main/java/org/easymock/EasyMockRule.java:[38,20]
cannot find symbol
[ERROR] symbol:   class EasyMockStatement
[ERROR] location: class org.easymock.EasyMockRule
[ERROR] -> [Help 1]
[ERROR] 
[ERROR] To see the full stack trace of the errors, re-run Maven with the -e switch.
[ERROR] Re-run Maven using the -X switch to enable full debug logging.
[ERROR] 
[ERROR] For more information about the errors and possible solutions, please read the following
articles:
[ERROR] [Help 1] http://cwiki.apache.org/confluence/display/MAVEN/MojoFailureException
---------------------------------------------

To subscribe to this information via syndicated feeds:
- RSS: http://vmgump.apache.org/gump/public/easymock/easymock/rss.xml
- Atom: http://vmgump.apache.org/gump/public/easymock/easymock/atom.xml

============================== Gump Tracking Only ===
Produced by Apache Gump(TM) version 2.3.
Gump Run 20140430000006, vmgump.apache.org:vmgump:20140430000006
Gump E-mail Identifier (unique within run) #3.

*********************************************************** G U M P
[GUMP@vmgump]: Project commons-betwixt (in module apache-commons) failed
To whom it may engage...
        
This is an automated request, but not an unsolicited one. For 
more information please visit http://gump.apache.org/nagged.html, 
and/or contact the folk at general@gump.apache.org.

Project commons-betwixt has an issue affecting its community integration.
This issue affects 1 projects,
 and has been outstanding for 3 runs.
The current state of this project is 'Failed', with reason 'Build Failed'.
For reference only, the following projects are affected by this:
    - commons-betwixt :  Commons Betwixt Package


Full details are available at:
    http://vmgump.apache.org/gump/public/apache-commons/commons-betwixt/index.html

That said, some information snippets are provided here.

The following annotations (debug/informational/warning/error messages) were provided:
 -DEBUG- Sole jar output [commons-betwixt-[0-9]*[0-9T].jar] identifier set to project name
 -INFO- Making directory for Maven settings: [/srv/gump/public/workspace/apache-commons/betwixt]
 -DEBUG- (Apache Gump generated) Apache Maven Settings in: /srv/gump/public/workspace/apache-commons/betwixt/gump_mvn_settings.xml
 -INFO- Failed with reason build failed
 -DEBUG- Extracted fallback artifacts from Gump Repository



The following work was performed:
http://vmgump.apache.org/gump/public/apache-commons/commons-betwixt/gump_work/build_apache-commons_commons-betwixt.html
Work Name: build_apache-commons_commons-betwixt (Type: Build)
Work ended in a state of : Failed
Elapsed: 2 secs
Command Line: /opt/maven2/bin/mvn --batch-mode -DskipTests=true --settings /srv/gump/public/workspace/apache-commons/betwixt/gump_mvn_settings.xml
package 
[Working Directory: /srv/gump/public/workspace/apache-commons/betwixt]
M2_HOME: /opt/maven2
---------------------------------------------
[INFO] Scanning for projects...
[INFO] ------------------------------------------------------------------------
[INFO] Building Maven Default Project
[INFO]    task-segment: [package]
[INFO] ------------------------------------------------------------------------
[INFO] ------------------------------------------------------------------------
[ERROR] BUILD ERROR
[INFO] ------------------------------------------------------------------------
[INFO] Cannot execute mojo: resources. It requires a project with an existing pom.xml, but
the build is not using one.
[INFO] ------------------------------------------------------------------------
[INFO] For more information, run Maven with the -e switch
[INFO] ------------------------------------------------------------------------
[INFO] Total time: 1 second
[INFO] Finished at: Wed Apr 30 02:49:08 UTC 2014
[INFO] Final Memory: 4M/15M
[INFO] ------------------------------------------------------------------------
---------------------------------------------

To subscribe to this information via syndicated feeds:
- RSS: http://vmgump.apache.org/gump/public/apache-commons/commons-betwixt/rss.xml
- Atom: http://vmgump.apache.org/gump/public/apache-commons/commons-betwixt/atom.xml

============================== Gump Tracking Only ===
Produced by Apache Gump(TM) version 2.3.
Gump Run 20140430000006, vmgump.apache.org:vmgump:20140430000006
Gump E-mail Identifier (unique within run) #5.

*********************************************************** G U M P
[GUMP@vmgump]: Project tika-parsers (in module tika) failed
To whom it may engage...
        
This is an automated request, but not an unsolicited one. For 
more information please visit http://gump.apache.org/nagged.html, 
and/or contact the folk at general@gump.apache.org.

Project tika-parsers has an issue affecting its community integration.
This issue affects 2 projects,
 and has been outstanding for 500 runs.
The current state of this project is 'Failed', with reason 'Build Failed'.
For reference only, the following projects are affected by this:
    - tika-parsers :  Apache Tika is a toolkit for detecting and extracting metada...
    - tika-parsers-test :  Apache Tika is a toolkit for detecting and extracting metada...


Full details are available at:
    http://vmgump.apache.org/gump/public/tika/tika-parsers/index.html

That said, some information snippets are provided here.

The following annotations (debug/informational/warning/error messages) were provided:
 -DEBUG- Sole jar output [tika-parsers-*[0-9T].jar] identifier set to project name
 -DEBUG- (Apache Gump generated) Apache Maven Settings in: /srv/gump/public/workspace/tika/tika-parsers/gump_mvn_settings.xml
 -INFO- Failed with reason build failed
 -DEBUG- Maven POM in: /srv/gump/public/workspace/tika/tika-parsers/pom.xml
 -INFO- Failed to extract fallback artifacts from Gump Repository



The following work was performed:
http://vmgump.apache.org/gump/public/tika/tika-parsers/gump_work/build_tika_tika-parsers.html
Work Name: build_tika_tika-parsers (Type: Build)
Work ended in a state of : Failed
Elapsed: 29 secs
Command Line: /opt/maven2/bin/mvn --batch-mode -DskipTests=true --settings /srv/gump/public/workspace/tika/tika-parsers/gump_mvn_settings.xml
package 
[Working Directory: /srv/gump/public/workspace/tika/tika-parsers]
M2_HOME: /opt/maven2
---------------------------------------------
Downloading: http://localhost:8192/maven2/edu/ucar/netcdf/4.2-min/netcdf-4.2-min.jar
334K downloaded  (asm-debug-all-4.1.jar)
Downloading: http://localhost:8192/maven2/log4j/log4j/1.2.14/log4j-1.2.14.jar
327K downloaded  (log4j-1.2.14.jar)
Downloading: http://localhost:8192/maven2/org/apache/james/apache-mime4j-dom/0.7.2/apache-mime4j-dom-0.7.2.jar
Downloading: http://localhost:8192/maven2/org/apache/poi/poi-scratchpad/3.10-FINAL/poi-scratchpad-3.10-FINAL.jar
1254K downloaded  (poi-scratchpad-3.10-FINAL.jar)
Downloading: http://localhost:8192/maven2/org/slf4j/slf4j-log4j12/1.5.6/slf4j-log4j12-1.5.6.jar
Downloading: http://localhost:8192/maven2/org/apache/pdfbox/fontbox/1.8.4/fontbox-1.8.4.jar
4225K downloaded  (netcdf-4.2-min.jar)
225K downloaded  (fontbox-1.8.4.jar)
297K downloaded  (apache-mime4j-dom-0.7.2.jar)
Downloading: http://localhost:8192/maven2/org/gagravarr/vorbis-java-core/0.4/vorbis-java-core-0.4.jar
9K downloaded  (slf4j-log4j12-1.5.6.jar)
Downloading: http://localhost:8192/maven2/org/bouncycastle/bcprov-jdk15/1.45/bcprov-jdk15-1.45.jar
Downloading: http://localhost:8192/maven2/org/apache/poi/poi-ooxml/3.10-FINAL/poi-ooxml-3.10-FINAL.jar
73K downloaded  (vorbis-java-core-0.4.jar)
1050K downloaded  (poi-ooxml-3.10-FINAL.jar)
Downloading: http://localhost:8192/maven2/org/apache/pdfbox/jempbox/1.8.4/jempbox-1.8.4.jar
860K downloaded  (mockito-core-1.7.jar)
Downloading: http://localhost:8192/maven2/org/apache/poi/poi-ooxml-schemas/3.10-FINAL/poi-ooxml-schemas-3.10-FINAL.jar
49K downloaded  (jempbox-1.8.4.jar)
1624K downloaded  (bcprov-jdk15-1.45.jar)
4830K downloaded  (poi-ooxml-schemas-3.10-FINAL.jar)
[debug] execute contextualize
[INFO] [resources:resources {execution: default-resources}]
[INFO] Using 'UTF-8' encoding to copy filtered resources.
[INFO] Copying 5 resources
[INFO] Copying 3 resources
[INFO] [compiler:compile {execution: default-compile}]
[INFO] Compiling 139 source files to /srv/gump/public/workspace/tika/tika-parsers/target/classes
[INFO] -------------------------------------------------------------
[ERROR] COMPILATION ERROR : 
[INFO] -------------------------------------------------------------
[ERROR] /srv/gump/public/workspace/tika/tika-parsers/src/main/java/org/apache/tika/parser/font/AdobeFontMetricParser.java:[62,27]
error: cannot find symbol
[INFO] 1 error
[INFO] -------------------------------------------------------------
[INFO] ------------------------------------------------------------------------
[ERROR] BUILD FAILURE
[INFO] ------------------------------------------------------------------------
[INFO] Compilation failure
/srv/gump/public/workspace/tika/tika-parsers/src/main/java/org/apache/tika/parser/font/AdobeFontMetricParser.java:[62,27]
error: cannot find symbol

[INFO] ------------------------------------------------------------------------
[INFO] For more information, run Maven with the -e switch
[INFO] ------------------------------------------------------------------------
[INFO] Total time: 28 seconds
[INFO] Finished at: Wed Apr 30 03:43:43 UTC 2014
[INFO] Final Memory: 30M/81M
[INFO] ------------------------------------------------------------------------
---------------------------------------------

To subscribe to this information via syndicated feeds:
- RSS: http://vmgump.apache.org/gump/public/tika/tika-parsers/rss.xml
- Atom: http://vmgump.apache.org/gump/public/tika/tika-parsers/atom.xml

============================== Gump Tracking Only ===
Produced by Apache Gump(TM) version 2.3.
Gump Run 20140430000006, vmgump.apache.org:vmgump:20140430000006
Gump E-mail Identifier (unique within run) #6.

*********************************************************** G U M P
[GUMP@vmgump]: Project tika-reactor (in module tika) failed
To whom it may engage...
        
This is an automated request, but not an unsolicited one. For 
more information please visit http://gump.apache.org/nagged.html, 
and/or contact the folk at general@gump.apache.org.

Project tika-reactor has an issue affecting its community integration.
This issue affects 1 projects,
 and has been outstanding for 500 runs.
The current state of this project is 'Failed', with reason 'Build Failed'.
For reference only, the following projects are affected by this:
    - tika-reactor :  Apache Tika is a toolkit for detecting and extracting metada...


Full details are available at:
    http://vmgump.apache.org/gump/public/tika/tika-reactor/index.html

That said, some information snippets are provided here.

The following annotations (debug/informational/warning/error messages) were provided:
 -INFO- Optional dependency tika-parsers failed with reason build failed
 -DEBUG- (Apache Gump generated) Apache Maven Settings in: /srv/gump/public/workspace/tika/gump_mvn_settings.xml
 -INFO- Failed with reason build failed
 -DEBUG- Maven POM in: /srv/gump/public/workspace/tika/pom.xml



The following work was performed:
http://vmgump.apache.org/gump/public/tika/tika-reactor/gump_work/build_tika_tika-reactor.html
Work Name: build_tika_tika-reactor (Type: Build)
Work ended in a state of : Failed
Elapsed: 26 secs
Command Line: /opt/maven2/bin/mvn --batch-mode -DskipTests=true --settings /srv/gump/public/workspace/tika/gump_mvn_settings.xml
install 
[Working Directory: /srv/gump/public/workspace/tika]
MAVEN_OPTS: -Xmx512m 
M2_HOME: /opt/maven2
---------------------------------------------
[INFO] [clirr:check {execution: default}]
Downloading: http://localhost:8192/maven2/org/apache/tika/tika-core/1.0/tika-core-1.0.jar
483K downloaded  (tika-core-1.0.jar)
Downloading: http://localhost:8192/maven2/org/apache/tika/tika-core/1.0/tika-core-1.0.pom
4K downloaded  (tika-core-1.0.pom)
Downloading: http://localhost:8192/maven2/org/apache/tika/tika-parent/1.0/tika-parent-1.0.pom
9K downloaded  (tika-parent-1.0.pom)
[WARNING] POM for 'biz.aQute:bndlib:pom:1.43.0:provided' is invalid.

Its dependencies (if any) will NOT be available to the current build.
[INFO] Succeeded with 0 errors; 0 warnings; and 0 other changes.
[INFO] [failsafe:verify {execution: default}]
[INFO] Tests are skipped.
[INFO] [install:install {execution: default-install}]
[INFO] Installing /srv/gump/public/workspace/tika/tika-core/target/tika-core-1.6-SNAPSHOT.jar
to /srv/gump/public/workspace/mvnlocalrepo/shared/org/apache/tika/tika-core/1.6-SNAPSHOT/tika-core-1.6-SNAPSHOT.jar
[INFO] Installing /srv/gump/public/workspace/tika/tika-core/target/tika-core-1.6-SNAPSHOT-tests.jar
to /srv/gump/public/workspace/mvnlocalrepo/shared/org/apache/tika/tika-core/1.6-SNAPSHOT/tika-core-1.6-SNAPSHOT-tests.jar
[INFO] [bundle:install {execution: default-install}]
[INFO] Installing org/apache/tika/tika-core/1.6-SNAPSHOT/tika-core-1.6-SNAPSHOT.jar
[INFO] Writing OBR metadata
[INFO] ------------------------------------------------------------------------
[INFO] Building Apache Tika parsers
[INFO]    task-segment: [install]
[INFO] ------------------------------------------------------------------------
[INFO] [remote-resources:process {execution: default}]
[debug] execute contextualize
[INFO] [resources:resources {execution: default-resources}]
[INFO] Using 'UTF-8' encoding to copy filtered resources.
[INFO] Copying 5 resources
[INFO] Copying 3 resources
[INFO] [compiler:compile {execution: default-compile}]
[INFO] Compiling 48 source files to /srv/gump/public/workspace/tika/tika-parsers/target/classes
[INFO] -------------------------------------------------------------
[ERROR] COMPILATION ERROR : 
[INFO] -------------------------------------------------------------
[ERROR] /srv/gump/public/workspace/tika/tika-parsers/src/main/java/org/apache/tika/parser/font/AdobeFontMetricParser.java:[62,27]
error: cannot find symbol
[INFO] 1 error
[INFO] -------------------------------------------------------------
[INFO] ------------------------------------------------------------------------
[ERROR] BUILD FAILURE
[INFO] ------------------------------------------------------------------------
[INFO] Compilation failure
/srv/gump/public/workspace/tika/tika-parsers/src/main/java/org/apache/tika/parser/font/AdobeFontMetricParser.java:[62,27]
error: cannot find symbol

[INFO] ------------------------------------------------------------------------
[INFO] For more information, run Maven with the -e switch
[INFO] ------------------------------------------------------------------------
[INFO] Total time: 25 seconds
[INFO] Finished at: Wed Apr 30 03:44:10 UTC 2014
[INFO] Final Memory: 58M/150M
[INFO] ------------------------------------------------------------------------
---------------------------------------------

To subscribe to this information via syndicated feeds:
- RSS: http://vmgump.apache.org/gump/public/tika/tika-reactor/rss.xml
- Atom: http://vmgump.apache.org/gump/public/tika/tika-reactor/atom.xml

============================== Gump Tracking Only ===
Produced by Apache Gump(TM) version 2.3.
Gump Run 20140430000006, vmgump.apache.org:vmgump:20140430000006
Gump E-mail Identifier (unique within run) #7.


--
Apache Gump
http://gump.apache.org/ [Instance: vmgump]

---------------------------------------------------------------------
To unsubscribe, e-mail: general-unsubscribe@gump.apache.org
For additional commands, e-mail: general-help@gump.apache.org


Mime
View raw message