gump-general mailing list archives

Site index · List index
Message view « Date » · « Thread »
Top « Date » · « Thread »
From g...@vmgump.apache.org
Subject BATCH: All dressed up, with nowhere to go...
Date Sat, 29 Mar 2014 02:58:17 GMT
Dear Gumpmeisters,
            
The following 3 notifys should have been sent

*********************************************************** G U M P
[GUMP@vmgump]: Project apache-httpd-configure (in module apache-httpd) failed
[GUMP@vmgump]: Project tika-parsers (in module tika) failed
[GUMP@vmgump]: Project tika-reactor (in module tika) failed
*********************************************************** G U M P
[GUMP@vmgump]: Project apache-httpd-configure (in module apache-httpd) failed
To whom it may engage...
        
This is an automated request, but not an unsolicited one. For 
more information please visit http://gump.apache.org/nagged.html, 
and/or contact the folk at general@gump.apache.org.

Project apache-httpd-configure has an issue affecting its community integration.
This issue affects 6 projects,
 and has been outstanding for 37 runs.
The current state of this project is 'Failed', with reason 'Build Failed'.
For reference only, the following projects are affected by this:
    - apache-httpd-configure :  Apache HTTP Server
    - apache-httpd-make :  Apache HTTP Server
    - apache-httpd-make-install :  Apache HTTP Server
    - tomcat-jk-native :  Connectors to various web servers
    - tomcat-jk-native-buildconf :  Connectors to various web servers
    - tomcat-jk-native-configure :  Connectors to various web servers


Full details are available at:
    http://vmgump.apache.org/gump/public/apache-httpd/apache-httpd-configure/index.html

That said, some information snippets are provided here.

The following annotations (debug/informational/warning/error messages) were provided:
 -INFO- Failed with reason build failed



The following work was performed:
http://vmgump.apache.org/gump/public/apache-httpd/apache-httpd-configure/gump_work/buildscript_apache-httpd_apache-httpd-configure.html
Work Name: buildscript_apache-httpd_apache-httpd-configure (Type: Build)
Work ended in a state of : Failed
Elapsed: 
Command Line: /srv/gump/public/workspace/apache-httpd/configure --with-pcre=/srv/gump/public/workspace/pcre/dest-20140329
--with-apr=/srv/gump/public/workspace/apr/dest-20140329 --prefix=/srv/gump/public/workspace/apache-httpd/dest-20140329

[Working Directory: /srv/gump/public/workspace/apache-httpd]
---------------------------------------------
checking for chosen layout... Apache
checking for working mkdir -p... yes
checking for grep that handles long lines and -e... /bin/grep
checking for egrep... /bin/grep -E
checking build system type... x86_64-unknown-linux-gnu
checking host system type... x86_64-unknown-linux-gnu
checking target system type... x86_64-unknown-linux-gnu
configure: 
configure: Configuring Apache Portable Runtime library...
configure: 
checking for APR... yes
  setting CC to "gcc"
  setting CPP to "gcc -E"
  setting CFLAGS to " -g -O2 -pthread"
  setting CPPFLAGS to " -DLINUX -D_REENTRANT -D_GNU_SOURCE"
  setting LDFLAGS to " "
configure: 
configure: Configuring Apache Portable Runtime Utility library...
configure: 
configure: APR-util obsoleted, woohoo
checking for gcc... gcc
checking whether the C compiler works... yes
checking for C compiler default output file name... a.out
checking for suffix of executables... 
checking whether we are cross compiling... no
checking for suffix of object files... o
checking whether we are using the GNU C compiler... yes
checking whether gcc accepts -g... yes
checking for gcc option to accept ISO C89... none needed
checking how to run the C preprocessor... gcc -E
checking for gcc option to accept ISO C99... -std=gnu99
checking for pcre-config... false
configure: Using external PCRE library from /srv/gump/public/workspace/pcre/dest-20140329/bin/pcre-config
  setting PCRE_INCLUDES to "-I/srv/gump/public/workspace/pcre/dest-20140329/include"
  setting PCRE_LIBS to "-L/srv/gump/public/workspace/pcre/dest-20140329/lib -lpcre"
  setting HTTPD_LIBS to "$(PCRE_LIBS)"
configure: 
configure: Configuring Apache httpd...
configure: 
  setting INCLUDES to "-I."
  adding "-I$(top_srcdir)/os/$(OS_DIR)" to INCLUDES
  adding "-I$(top_srcdir)/include" to INCLUDES
  adding "-I/srv/gump/public/workspace/apr/dest-20140329/include/apr-2" to INCLUDES
  adding "-I/srv/gump/public/workspace/pcre/dest-20140329/include" to INCLUDES
configure: error: pcre version does not support PCRE_DUPNAMES
---------------------------------------------

To subscribe to this information via syndicated feeds:
- RSS: http://vmgump.apache.org/gump/public/apache-httpd/apache-httpd-configure/rss.xml
- Atom: http://vmgump.apache.org/gump/public/apache-httpd/apache-httpd-configure/atom.xml

============================== Gump Tracking Only ===
Produced by Apache Gump(TM) version 2.3.
Gump Run 20140329000005, vmgump.apache.org:vmgump:20140329000005
Gump E-mail Identifier (unique within run) #1.

*********************************************************** G U M P
[GUMP@vmgump]: Project tika-parsers (in module tika) failed
To whom it may engage...
        
This is an automated request, but not an unsolicited one. For 
more information please visit http://gump.apache.org/nagged.html, 
and/or contact the folk at general@gump.apache.org.

Project tika-parsers has an issue affecting its community integration.
This issue affects 2 projects,
 and has been outstanding for 373 runs.
The current state of this project is 'Failed', with reason 'Build Failed'.
For reference only, the following projects are affected by this:
    - tika-parsers :  Apache Tika is a toolkit for detecting and extracting metada...
    - tika-parsers-test :  Apache Tika is a toolkit for detecting and extracting metada...


Full details are available at:
    http://vmgump.apache.org/gump/public/tika/tika-parsers/index.html

That said, some information snippets are provided here.

The following annotations (debug/informational/warning/error messages) were provided:
 -DEBUG- Sole jar output [tika-parsers-*[0-9T].jar] identifier set to project name
 -DEBUG- (Apache Gump generated) Apache Maven Settings in: /srv/gump/public/workspace/tika/tika-parsers/gump_mvn_settings.xml
 -INFO- Failed with reason build failed
 -DEBUG- Maven POM in: /srv/gump/public/workspace/tika/tika-parsers/pom.xml
 -INFO- Failed to extract fallback artifacts from Gump Repository



The following work was performed:
http://vmgump.apache.org/gump/public/tika/tika-parsers/gump_work/build_tika_tika-parsers.html
Work Name: build_tika_tika-parsers (Type: Build)
Work ended in a state of : Failed
Elapsed: 27 secs
Command Line: /opt/maven2/bin/mvn --batch-mode -DskipTests=true --settings /srv/gump/public/workspace/tika/tika-parsers/gump_mvn_settings.xml
package 
[Working Directory: /srv/gump/public/workspace/tika/tika-parsers]
M2_HOME: /opt/maven2
---------------------------------------------
75K downloaded  (commons-codec-1.5.jar)
Downloading: http://localhost:8192/maven2/edu/ucar/netcdf/4.2-min/netcdf-4.2-min.jar
Downloading: http://localhost:8192/maven2/org/apache/pdfbox/fontbox/1.8.4/fontbox-1.8.4.jar
327K downloaded  (log4j-1.2.14.jar)
334K downloaded  (asm-debug-all-4.1.jar)
Downloading: http://localhost:8192/maven2/org/apache/james/apache-mime4j-dom/0.7.2/apache-mime4j-dom-0.7.2.jar
860K downloaded  (mockito-core-1.7.jar)
Downloading: http://localhost:8192/maven2/org/apache/poi/poi-scratchpad/3.10-FINAL/poi-scratchpad-3.10-FINAL.jar
224K downloaded  (fontbox-1.8.4.jar)
297K downloaded  (apache-mime4j-dom-0.7.2.jar)
Downloading: http://localhost:8192/maven2/org/gagravarr/vorbis-java-core/0.4/vorbis-java-core-0.4.jar
Downloading: http://localhost:8192/maven2/org/slf4j/slf4j-log4j12/1.5.6/slf4j-log4j12-1.5.6.jar
9K downloaded  (slf4j-log4j12-1.5.6.jar)
73K downloaded  (vorbis-java-core-0.4.jar)
1254K downloaded  (poi-scratchpad-3.10-FINAL.jar)
Downloading: http://localhost:8192/maven2/org/bouncycastle/bcprov-jdk15/1.45/bcprov-jdk15-1.45.jar
Downloading: http://localhost:8192/maven2/org/apache/pdfbox/jempbox/1.8.4/jempbox-1.8.4.jar
49K downloaded  (jempbox-1.8.4.jar)
Downloading: http://localhost:8192/maven2/org/apache/poi/poi-ooxml/3.10-FINAL/poi-ooxml-3.10-FINAL.jar
4225K downloaded  (netcdf-4.2-min.jar)
1624K downloaded  (bcprov-jdk15-1.45.jar)
1050K downloaded  (poi-ooxml-3.10-FINAL.jar)
Downloading: http://localhost:8192/maven2/org/apache/poi/poi-ooxml-schemas/3.10-FINAL/poi-ooxml-schemas-3.10-FINAL.jar
4830K downloaded  (poi-ooxml-schemas-3.10-FINAL.jar)
[debug] execute contextualize
[INFO] [resources:resources {execution: default-resources}]
[INFO] Using 'UTF-8' encoding to copy filtered resources.
[INFO] Copying 5 resources
[INFO] Copying 3 resources
[INFO] [compiler:compile {execution: default-compile}]
[INFO] Compiling 137 source files to /srv/gump/public/workspace/tika/tika-parsers/target/classes
[INFO] -------------------------------------------------------------
[ERROR] COMPILATION ERROR : 
[INFO] -------------------------------------------------------------
[ERROR] /srv/gump/public/workspace/tika/tika-parsers/src/main/java/org/apache/tika/parser/font/AdobeFontMetricParser.java:[62,27]
error: cannot find symbol
[INFO] 1 error
[INFO] -------------------------------------------------------------
[INFO] ------------------------------------------------------------------------
[ERROR] BUILD FAILURE
[INFO] ------------------------------------------------------------------------
[INFO] Compilation failure
/srv/gump/public/workspace/tika/tika-parsers/src/main/java/org/apache/tika/parser/font/AdobeFontMetricParser.java:[62,27]
error: cannot find symbol

[INFO] ------------------------------------------------------------------------
[INFO] For more information, run Maven with the -e switch
[INFO] ------------------------------------------------------------------------
[INFO] Total time: 26 seconds
[INFO] Finished at: Sat Mar 29 02:33:52 UTC 2014
[INFO] Final Memory: 30M/89M
[INFO] ------------------------------------------------------------------------
---------------------------------------------

To subscribe to this information via syndicated feeds:
- RSS: http://vmgump.apache.org/gump/public/tika/tika-parsers/rss.xml
- Atom: http://vmgump.apache.org/gump/public/tika/tika-parsers/atom.xml

============================== Gump Tracking Only ===
Produced by Apache Gump(TM) version 2.3.
Gump Run 20140329000005, vmgump.apache.org:vmgump:20140329000005
Gump E-mail Identifier (unique within run) #3.

*********************************************************** G U M P
[GUMP@vmgump]: Project tika-reactor (in module tika) failed
To whom it may engage...
        
This is an automated request, but not an unsolicited one. For 
more information please visit http://gump.apache.org/nagged.html, 
and/or contact the folk at general@gump.apache.org.

Project tika-reactor has an issue affecting its community integration.
This issue affects 1 projects,
 and has been outstanding for 373 runs.
The current state of this project is 'Failed', with reason 'Build Failed'.
For reference only, the following projects are affected by this:
    - tika-reactor :  Apache Tika is a toolkit for detecting and extracting metada...


Full details are available at:
    http://vmgump.apache.org/gump/public/tika/tika-reactor/index.html

That said, some information snippets are provided here.

The following annotations (debug/informational/warning/error messages) were provided:
 -INFO- Optional dependency tika-parsers failed with reason build failed
 -DEBUG- (Apache Gump generated) Apache Maven Settings in: /srv/gump/public/workspace/tika/gump_mvn_settings.xml
 -INFO- Failed with reason build failed
 -DEBUG- Maven POM in: /srv/gump/public/workspace/tika/pom.xml



The following work was performed:
http://vmgump.apache.org/gump/public/tika/tika-reactor/gump_work/build_tika_tika-reactor.html
Work Name: build_tika_tika-reactor (Type: Build)
Work ended in a state of : Failed
Elapsed: 28 secs
Command Line: /opt/maven2/bin/mvn --batch-mode -DskipTests=true --settings /srv/gump/public/workspace/tika/gump_mvn_settings.xml
install 
[Working Directory: /srv/gump/public/workspace/tika]
MAVEN_OPTS: -Xmx512m 
M2_HOME: /opt/maven2
---------------------------------------------
[INFO] [clirr:check {execution: default}]
Downloading: http://localhost:8192/maven2/org/apache/tika/tika-core/1.0/tika-core-1.0.jar
482K downloaded  (tika-core-1.0.jar)
Downloading: http://localhost:8192/maven2/org/apache/tika/tika-core/1.0/tika-core-1.0.pom
4K downloaded  (tika-core-1.0.pom)
Downloading: http://localhost:8192/maven2/org/apache/tika/tika-parent/1.0/tika-parent-1.0.pom
9K downloaded  (tika-parent-1.0.pom)
[WARNING] POM for 'biz.aQute:bndlib:pom:1.43.0:provided' is invalid.

Its dependencies (if any) will NOT be available to the current build.
[INFO] Succeeded with 0 errors; 0 warnings; and 0 other changes.
[INFO] [failsafe:verify {execution: default}]
[INFO] Tests are skipped.
[INFO] [install:install {execution: default-install}]
[INFO] Installing /srv/gump/public/workspace/tika/tika-core/target/tika-core-1.6-SNAPSHOT.jar
to /srv/gump/public/workspace/mvnlocalrepo/shared/org/apache/tika/tika-core/1.6-SNAPSHOT/tika-core-1.6-SNAPSHOT.jar
[INFO] Installing /srv/gump/public/workspace/tika/tika-core/target/tika-core-1.6-SNAPSHOT-tests.jar
to /srv/gump/public/workspace/mvnlocalrepo/shared/org/apache/tika/tika-core/1.6-SNAPSHOT/tika-core-1.6-SNAPSHOT-tests.jar
[INFO] [bundle:install {execution: default-install}]
[INFO] Installing org/apache/tika/tika-core/1.6-SNAPSHOT/tika-core-1.6-SNAPSHOT.jar
[INFO] Writing OBR metadata
[INFO] ------------------------------------------------------------------------
[INFO] Building Apache Tika parsers
[INFO]    task-segment: [install]
[INFO] ------------------------------------------------------------------------
[INFO] [remote-resources:process {execution: default}]
[debug] execute contextualize
[INFO] [resources:resources {execution: default-resources}]
[INFO] Using 'UTF-8' encoding to copy filtered resources.
[INFO] Copying 5 resources
[INFO] Copying 3 resources
[INFO] [compiler:compile {execution: default-compile}]
[INFO] Compiling 48 source files to /srv/gump/public/workspace/tika/tika-parsers/target/classes
[INFO] -------------------------------------------------------------
[ERROR] COMPILATION ERROR : 
[INFO] -------------------------------------------------------------
[ERROR] /srv/gump/public/workspace/tika/tika-parsers/src/main/java/org/apache/tika/parser/font/AdobeFontMetricParser.java:[62,27]
error: cannot find symbol
[INFO] 1 error
[INFO] -------------------------------------------------------------
[INFO] ------------------------------------------------------------------------
[ERROR] BUILD FAILURE
[INFO] ------------------------------------------------------------------------
[INFO] Compilation failure
/srv/gump/public/workspace/tika/tika-parsers/src/main/java/org/apache/tika/parser/font/AdobeFontMetricParser.java:[62,27]
error: cannot find symbol

[INFO] ------------------------------------------------------------------------
[INFO] For more information, run Maven with the -e switch
[INFO] ------------------------------------------------------------------------
[INFO] Total time: 27 seconds
[INFO] Finished at: Sat Mar 29 02:34:21 UTC 2014
[INFO] Final Memory: 57M/142M
[INFO] ------------------------------------------------------------------------
---------------------------------------------

To subscribe to this information via syndicated feeds:
- RSS: http://vmgump.apache.org/gump/public/tika/tika-reactor/rss.xml
- Atom: http://vmgump.apache.org/gump/public/tika/tika-reactor/atom.xml

============================== Gump Tracking Only ===
Produced by Apache Gump(TM) version 2.3.
Gump Run 20140329000005, vmgump.apache.org:vmgump:20140329000005
Gump E-mail Identifier (unique within run) #4.


--
Apache Gump
http://gump.apache.org/ [Instance: vmgump]

---------------------------------------------------------------------
To unsubscribe, e-mail: general-unsubscribe@gump.apache.org
For additional commands, e-mail: general-help@gump.apache.org


Mime
View raw message