gump-general mailing list archives

Site index · List index
Message view « Date » · « Thread »
Top « Date » · « Thread »
From g...@vmgump.apache.org
Subject BATCH: All dressed up, with nowhere to go...
Date Wed, 30 Jan 2013 18:21:25 GMT
Dear Gumpmeisters,
            
The following 59 notifys should have been sent

*********************************************************** G U M P
[GUMP@vmgump]: Project gump-shared-axiom-parent (in module ws-axiom) failed
[GUMP@vmgump]: Project jetty-util (in module jetty) failed
[GUMP@vmgump]: Project jetty-continuation (in module jetty) failed
[GUMP@vmgump]: Project jetty-xml (in module jetty) failed
[GUMP@vmgump]: Project jetty-jsp-2.1 (in module jetty) failed
[GUMP@vmgump]: Project jetty-start (in module jetty) failed
[GUMP@vmgump]: Project lenya-parent (in module lenya) failed
[GUMP@vmgump]: Project velocity-anakia (in module velocity-anakia) failed
[GUMP@vmgump]: Project velocity-texen (in module velocity-texen) failed
[GUMP@vmgump]: Project doxia-logging-api (in module doxia) failed
[GUMP@vmgump]: Project doxia-sink-api-jar (in module doxia) failed
[GUMP@vmgump]: Project cocoon22-xml-util (in module cocoon) failed
[GUMP@vmgump]: Project cocoon22-pipeline-api (in module cocoon) failed
[GUMP@vmgump]: Project cocoon22-xml-impl (in module cocoon) failed
[GUMP@vmgump]: Project axis2-resource-bundle (in module ws-axis2) failed
[GUMP@vmgump]: Project google-docbkx-maven-base (in module google-docbkx) failed
[GUMP@vmgump]: Project tika-core (in module tika) failed
[GUMP@vmgump]: Project velocity-dvsl (in module velocity-dvsl) failed
[GUMP@vmgump]: Project jetty-io (in module jetty) failed
[GUMP@vmgump]: Project castor-xml (in module castor) failed
[GUMP@vmgump]: Project cocoon22-spring-configurator (in module cocoon-subprojects) failed
[GUMP@vmgump]: Project cocoon22-util (in module cocoon) failed
[GUMP@vmgump]: Project cocoon22-thread-impl (in module cocoon) failed
[GUMP@vmgump]: Project cocoon22-store-impl (in module cocoon) failed
[GUMP@vmgump]: Project fontbox (in module pdfbox) failed
[GUMP@vmgump]: Project velocity-tools-generic (in module velocity-tools) failed
[GUMP@vmgump]: Project portals-bridges-common (in module portals-bridges) failed
[GUMP@vmgump]: Project velocity-engine2-test (in module velocity-engine2) failed
[GUMP@vmgump]: Project directory-junit-addons (in module directory-junit-addons) failed
[GUMP@vmgump]: Project doxia-core (in module doxia) failed
[GUMP@vmgump]: Project google-guava (in module google-guava) failed
[GUMP@vmgump]: Project doxia-decoration-model (in module doxia) failed
[GUMP@vmgump]: Project doxia-module-docbook-simple (in module doxia) failed
[GUMP@vmgump]: Project doxia-test-docs (in module doxia) failed
[GUMP@vmgump]: Project doxia-module-xhtml (in module doxia) failed
[GUMP@vmgump]: Project cocoon22-pipeline-impl (in module cocoon) failed
[GUMP@vmgump]: Project cocoon22-xml-resolver (in module cocoon) failed
[GUMP@vmgump]: Project checkstyle (in module checkstyle) failed
[GUMP@vmgump]: Project jempbox (in module pdfbox) failed
[GUMP@vmgump]: Project msv-core (in module msv) failed
[GUMP@vmgump]: Project doxia-module-apt (in module doxia) failed
[GUMP@vmgump]: Project doxia-module-fml (in module doxia) failed
[GUMP@vmgump]: Project cocoon22-sitemap-api (in module cocoon) failed
[GUMP@vmgump]: Project jetty-nested (in module jetty) failed
[GUMP@vmgump]: Project mina-core (in module mina) failed
[GUMP@vmgump]: Project doxia-module-confluence (in module doxia) failed
[GUMP@vmgump]: Project doxia-module-xdoc (in module doxia) failed
[GUMP@vmgump]: Project doxia-site-renderer (in module doxia) failed
[GUMP@vmgump]: Project apache-mailet-base-testjar (in module apache-mailet) failed
[GUMP@vmgump]: Project apache-standard-mailets (in module apache-mailet) failed
[GUMP@vmgump]: Project commons-jci (in module apache-commons) failed
[GUMP@vmgump]: Project ws-commons-xmlschema (in module ws-commons-xmlschema) failed
[GUMP@vmgump]: Project cocoon22-expression-language-impl (in module cocoon) failed
[GUMP@vmgump]: Project apache-mime4j-dom (in module james-mime4j) failed
[GUMP@vmgump]: Project woden-parent (in module woden) failed
[GUMP@vmgump]: Project xmlschema-core (in module ws-xmlschema) failed
[GUMP@vmgump]: Project cocoon22-rcl-webapp-wrapper (in module cocoon-subprojects) failed
[GUMP@vmgump]: Project portals-bridges-velocity (in module portals-bridges) failed
[GUMP@vmgump]: Project apacheds-protocol-dhcp (in module apacheds) failed
*********************************************************** G U M P
[GUMP@vmgump]: Project gump-shared-axiom-parent (in module ws-axiom) failed
To whom it may engage...
        
This is an automated request, but not an unsolicited one. For 
more information please visit http://gump.apache.org/nagged.html, 
and/or contact the folk at general@gump.apache.org.

Project gump-shared-axiom-parent has an issue affecting its community integration.
This issue affects 1 projects.
The current state of this project is 'Failed', with reason 'Build Timed Out'.
For reference only, the following projects are affected by this:
    - gump-shared-axiom-parent :  Apache Axiom


Full details are available at:
    http://vmgump.apache.org/gump/public/ws-axiom/gump-shared-axiom-parent/index.html

That said, some information snippets are provided here.

The following annotations (debug/informational/warning/error messages) were provided:
 -DEBUG- (Apache Gump generated) Apache Maven Settings in: /srv/gump/public/workspace/ws-axiom/gump_mvn_settings.xml
 -INFO- Failed with reason build timed out
 -DEBUG- Maven POM in: /srv/gump/public/workspace/ws-axiom/pom.xml



The following work was performed:
http://vmgump.apache.org/gump/public/ws-axiom/gump-shared-axiom-parent/gump_work/build_ws-axiom_gump-shared-axiom-parent.html
Work Name: build_ws-axiom_gump-shared-axiom-parent (Type: Build)
Work ended in a state of : Failed
Elapsed: 60 mins
Command Line: /opt/maven2/bin/mvn --batch-mode -Dpackaging=pom -DgroupId=org.apache.ws.commons.axiom -Dfile=pom.xml -DartifactId=axiom -Dversion=1.2.15-SNAPSHOT --settings /srv/gump/public/workspace/ws-axiom/gump_mvn_settings.xml install:install-file 
[Working Directory: /srv/gump/public/workspace/ws-axiom]
M2_HOME: /opt/maven2
---------------------------------------------
[INFO] Scanning for projects...
[INFO] Reactor build order: 
[INFO]   Axiom
[INFO]   Axiom Build Utilities
[INFO]   Axiom Test Utilities
[INFO]   Axiom Jaxen Test Suite
[INFO]   Axiom DOM Test Suite
[INFO]   Axiom API
[INFO]   Axiom Implementation Test Suite
[INFO]   Axiom Common Implementation Classes
[INFO]   Axiom Impl
[INFO]   Axiom DOM
[INFO]   Axiom Compatibility Classes
[INFO]   Axiom JAXB Integration
[INFO]   Axiom C14N
[INFO]   Axiom Test Suite
[INFO]   Axiom Integration Test Suite
[INFO]   Axiom Uber-JAR
[INFO]   Axiom Samples
[INFO]   System Tests
[INFO]   JBoss Tests
[INFO]   Axiom OSGi Tests
[INFO]   Spring WS Tests
[INFO]   Developer Guide
[INFO]   User Guide
[INFO]   Javadoc
[INFO]   Distribution
[INFO]   Code Coverage Report
Downloading: http://localhost:8192/maven2/org/apache/maven/plugins/maven-enforcer-plugin/1.1/maven-enforcer-plugin-1.1.pom
---------------------------------------------

To subscribe to this information via syndicated feeds:
- RSS: http://vmgump.apache.org/gump/public/ws-axiom/gump-shared-axiom-parent/rss.xml
- Atom: http://vmgump.apache.org/gump/public/ws-axiom/gump-shared-axiom-parent/atom.xml

============================== Gump Tracking Only ===
Produced by Apache Gump(TM) version 2.3.
Gump Run 20130125180006, vmgump.apache.org:vmgump:20130125180006
Gump E-mail Identifier (unique within run) #3.

*********************************************************** G U M P
[GUMP@vmgump]: Project jetty-util (in module jetty) failed
To whom it may engage...
        
This is an automated request, but not an unsolicited one. For 
more information please visit http://gump.apache.org/nagged.html, 
and/or contact the folk at general@gump.apache.org.

Project jetty-util has an issue affecting its community integration.
This issue affects 30 projects.
The current state of this project is 'Failed', with reason 'Build Timed Out'.
For reference only, the following projects are affected by this:
    - jetty-aggregate-server :  Java HTTP Servlet Server
    - jetty-ajp :  Java HTTP Servlet Server
    - jetty-all :  Java HTTP Servlet Server
    - jetty-all-client :  Java HTTP Servlet Server
    - jetty-all-plus :  Java HTTP Servlet Server
    - jetty-all-server :  Java HTTP Servlet Server
    - jetty-all-servlet :  Java HTTP Servlet Server
    - jetty-all-webapp :  Java HTTP Servlet Server
    - jetty-annotations :  Java HTTP Servlet Server
    - jetty-client :  Java HTTP Servlet Server
    - jetty-client-test :  Java HTTP Servlet Server
    - jetty-deploy :  Java HTTP Servlet Server
    - jetty-jaspi :  Java HTTP Servlet Server
    - jetty-jmx :  Java HTTP Servlet Server
    - jetty-jndi :  Java HTTP Servlet Server
    - jetty-plus :  Java HTTP Servlet Server
    - jetty-rewrite :  Java HTTP Servlet Server
    - jetty-security :  Java HTTP Servlet Server
    - jetty-security-test :  Java HTTP Servlet Server
    - jetty-server :  Java HTTP Servlet Server
    - jetty-server-test :  Java HTTP Servlet Server
    - jetty-servlet :  Java HTTP Servlet Server
    - jetty-servlets :  Java HTTP Servlet Server
    - jetty-servlets-test :  Java HTTP Servlet Server
    - jetty-util :  Java HTTP Servlet Server
    - jetty-util-test :  Java HTTP Servlet Server
    - jetty-webapp :  Java HTTP Servlet Server
    - jetty-websocket :  Java HTTP Servlet Server
    - jetty-websocket-test :  Java HTTP Servlet Server
    - test-jetty-servlet :  Java HTTP Servlet Server


Full details are available at:
    http://vmgump.apache.org/gump/public/jetty/jetty-util/index.html

That said, some information snippets are provided here.

The following annotations (debug/informational/warning/error messages) were provided:
 -DEBUG- Sole jar output [jetty-util-*[0-9T].jar] identifier set to project name
 -DEBUG- (Apache Gump generated) Apache Maven Settings in: /srv/gump/public/workspace/jetty/jetty-util/gump_mvn_settings.xml
 -INFO- Failed with reason build timed out
 -DEBUG- Maven POM in: /srv/gump/public/workspace/jetty/jetty-util/pom.xml
 -DEBUG- Extracted fallback artifacts from Gump Repository



The following work was performed:
http://vmgump.apache.org/gump/public/jetty/jetty-util/gump_work/build_jetty_jetty-util.html
Work Name: build_jetty_jetty-util (Type: Build)
Work ended in a state of : Failed
Elapsed: 60 mins
Command Line: /opt/maven2/bin/mvn --batch-mode -DskipTests=true --settings /srv/gump/public/workspace/jetty/jetty-util/gump_mvn_settings.xml install 
[Working Directory: /srv/gump/public/workspace/jetty/jetty-util]
M2_HOME: /opt/maven2
---------------------------------------------
[INFO] Scanning for projects...
[WARNING] POM for 'biz.aQute:bndlib:pom:1.15.0:runtime' is invalid.

Its dependencies (if any) will NOT be available to the current build.
[INFO] ------------------------------------------------------------------------
[INFO] Building Jetty :: Utilities
[INFO]    task-segment: [install]
[INFO] ------------------------------------------------------------------------
Downloading: http://localhost:8192/maven2/org/apache/maven/plugins/maven-surefire-plugin/2.8.1/maven-surefire-plugin-2.8.1.pom
---------------------------------------------

To subscribe to this information via syndicated feeds:
- RSS: http://vmgump.apache.org/gump/public/jetty/jetty-util/rss.xml
- Atom: http://vmgump.apache.org/gump/public/jetty/jetty-util/atom.xml

============================== Gump Tracking Only ===
Produced by Apache Gump(TM) version 2.3.
Gump Run 20130125180006, vmgump.apache.org:vmgump:20130125180006
Gump E-mail Identifier (unique within run) #4.

*********************************************************** G U M P
[GUMP@vmgump]: Project jetty-continuation (in module jetty) failed
To whom it may engage...
        
This is an automated request, but not an unsolicited one. For 
more information please visit http://gump.apache.org/nagged.html, 
and/or contact the folk at general@gump.apache.org.

Project jetty-continuation has an issue affecting its community integration.
This issue affects 1 projects.
The current state of this project is 'Failed', with reason 'Build Timed Out'.
For reference only, the following projects are affected by this:
    - jetty-continuation :  Java HTTP Servlet Server


Full details are available at:
    http://vmgump.apache.org/gump/public/jetty/jetty-continuation/index.html

That said, some information snippets are provided here.

The following annotations (debug/informational/warning/error messages) were provided:
 -DEBUG- Sole jar output [jetty-continuation-*[0-9T].jar] identifier set to project name
 -INFO- Optional dependency jetty-util failed with reason build timed out
 -DEBUG- (Apache Gump generated) Apache Maven Settings in: /srv/gump/public/workspace/jetty/jetty-continuation/gump_mvn_settings.xml
 -INFO- Failed with reason build timed out
 -DEBUG- Maven POM in: /srv/gump/public/workspace/jetty/jetty-continuation/pom.xml
 -DEBUG- Extracted fallback artifacts from Gump Repository



The following work was performed:
http://vmgump.apache.org/gump/public/jetty/jetty-continuation/gump_work/build_jetty_jetty-continuation.html
Work Name: build_jetty_jetty-continuation (Type: Build)
Work ended in a state of : Failed
Elapsed: 60 mins
Command Line: /opt/maven2/bin/mvn --batch-mode --settings /srv/gump/public/workspace/jetty/jetty-continuation/gump_mvn_settings.xml install 
[Working Directory: /srv/gump/public/workspace/jetty/jetty-continuation]
M2_HOME: /opt/maven2
---------------------------------------------
[INFO] Scanning for projects...
[WARNING] POM for 'biz.aQute:bndlib:pom:1.15.0:runtime' is invalid.

Its dependencies (if any) will NOT be available to the current build.
[INFO] ------------------------------------------------------------------------
[INFO] Building Jetty :: Continuation
[INFO]    task-segment: [install]
[INFO] ------------------------------------------------------------------------
Downloading: http://localhost:8192/maven2/org/apache/maven/plugins/maven-surefire-plugin/2.8.1/maven-surefire-plugin-2.8.1.pom
---------------------------------------------

To subscribe to this information via syndicated feeds:
- RSS: http://vmgump.apache.org/gump/public/jetty/jetty-continuation/rss.xml
- Atom: http://vmgump.apache.org/gump/public/jetty/jetty-continuation/atom.xml

============================== Gump Tracking Only ===
Produced by Apache Gump(TM) version 2.3.
Gump Run 20130125180006, vmgump.apache.org:vmgump:20130125180006
Gump E-mail Identifier (unique within run) #5.

*********************************************************** G U M P
[GUMP@vmgump]: Project jetty-xml (in module jetty) failed
To whom it may engage...
        
This is an automated request, but not an unsolicited one. For 
more information please visit http://gump.apache.org/nagged.html, 
and/or contact the folk at general@gump.apache.org.

Project jetty-xml has an issue affecting its community integration.
This issue affects 1 projects.
The current state of this project is 'Failed', with reason 'Build Timed Out'.
For reference only, the following projects are affected by this:
    - jetty-xml :  Java HTTP Servlet Server


Full details are available at:
    http://vmgump.apache.org/gump/public/jetty/jetty-xml/index.html

That said, some information snippets are provided here.

The following annotations (debug/informational/warning/error messages) were provided:
 -DEBUG- Sole jar output [jetty-xml-*[0-9T].jar] identifier set to project name
 -INFO- Optional dependency jetty-util failed with reason build timed out
 -DEBUG- (Apache Gump generated) Apache Maven Settings in: /srv/gump/public/workspace/jetty/jetty-xml/gump_mvn_settings.xml
 -INFO- Failed with reason build timed out
 -DEBUG- Maven POM in: /srv/gump/public/workspace/jetty/jetty-xml/pom.xml
 -DEBUG- Extracted fallback artifacts from Gump Repository



The following work was performed:
http://vmgump.apache.org/gump/public/jetty/jetty-xml/gump_work/build_jetty_jetty-xml.html
Work Name: build_jetty_jetty-xml (Type: Build)
Work ended in a state of : Failed
Elapsed: 60 mins
Command Line: /opt/maven2/bin/mvn --batch-mode --settings /srv/gump/public/workspace/jetty/jetty-xml/gump_mvn_settings.xml install 
[Working Directory: /srv/gump/public/workspace/jetty/jetty-xml]
M2_HOME: /opt/maven2
---------------------------------------------
[INFO] Scanning for projects...
[WARNING] POM for 'biz.aQute:bndlib:pom:1.15.0:runtime' is invalid.

Its dependencies (if any) will NOT be available to the current build.
[INFO] ------------------------------------------------------------------------
[INFO] Building Jetty :: XML utilities
[INFO]    task-segment: [install]
[INFO] ------------------------------------------------------------------------
Downloading: http://localhost:8192/maven2/org/apache/maven/plugins/maven-surefire-plugin/2.8.1/maven-surefire-plugin-2.8.1.pom
---------------------------------------------

To subscribe to this information via syndicated feeds:
- RSS: http://vmgump.apache.org/gump/public/jetty/jetty-xml/rss.xml
- Atom: http://vmgump.apache.org/gump/public/jetty/jetty-xml/atom.xml

============================== Gump Tracking Only ===
Produced by Apache Gump(TM) version 2.3.
Gump Run 20130125180006, vmgump.apache.org:vmgump:20130125180006
Gump E-mail Identifier (unique within run) #6.

*********************************************************** G U M P
[GUMP@vmgump]: Project jetty-jsp-2.1 (in module jetty) failed
To whom it may engage...
        
This is an automated request, but not an unsolicited one. For 
more information please visit http://gump.apache.org/nagged.html, 
and/or contact the folk at general@gump.apache.org.

Project jetty-jsp-2.1 has an issue affecting its community integration.
This issue affects 1 projects.
The current state of this project is 'Failed', with reason 'Build Timed Out'.
For reference only, the following projects are affected by this:
    - jetty-jsp-2.1 :  Java HTTP Servlet Server


Full details are available at:
    http://vmgump.apache.org/gump/public/jetty/jetty-jsp-2.1/index.html

That said, some information snippets are provided here.

The following annotations (debug/informational/warning/error messages) were provided:
 -DEBUG- Sole jar output [jetty-jsp-2.1-*[0-9T].jar] identifier set to project name
 -INFO- Optional dependency jetty-util failed with reason build timed out
 -DEBUG- (Apache Gump generated) Apache Maven Settings in: /srv/gump/public/workspace/jetty/jetty-jsp-2.1/gump_mvn_settings.xml
 -INFO- Failed with reason build timed out
 -DEBUG- Maven POM in: /srv/gump/public/workspace/jetty/jetty-jsp-2.1/pom.xml
 -DEBUG- Extracted fallback artifacts from Gump Repository



The following work was performed:
http://vmgump.apache.org/gump/public/jetty/jetty-jsp-2.1/gump_work/build_jetty_jetty-jsp-2.1.html
Work Name: build_jetty_jetty-jsp-2.1 (Type: Build)
Work ended in a state of : Failed
Elapsed: 60 mins
Command Line: /opt/maven2/bin/mvn --batch-mode --settings /srv/gump/public/workspace/jetty/jetty-jsp-2.1/gump_mvn_settings.xml install 
[Working Directory: /srv/gump/public/workspace/jetty/jetty-jsp-2.1]
M2_HOME: /opt/maven2
---------------------------------------------
[INFO] Scanning for projects...
[WARNING] POM for 'biz.aQute:bndlib:pom:1.15.0:runtime' is invalid.

Its dependencies (if any) will NOT be available to the current build.
[INFO] ------------------------------------------------------------------------
[INFO] Building Jetty :: Jetty JSP Additions
[INFO]    task-segment: [install]
[INFO] ------------------------------------------------------------------------
Downloading: http://localhost:8192/maven2/org/apache/maven/plugins/maven-surefire-plugin/2.8.1/maven-surefire-plugin-2.8.1.pom
---------------------------------------------

To subscribe to this information via syndicated feeds:
- RSS: http://vmgump.apache.org/gump/public/jetty/jetty-jsp-2.1/rss.xml
- Atom: http://vmgump.apache.org/gump/public/jetty/jetty-jsp-2.1/atom.xml

============================== Gump Tracking Only ===
Produced by Apache Gump(TM) version 2.3.
Gump Run 20130125180006, vmgump.apache.org:vmgump:20130125180006
Gump E-mail Identifier (unique within run) #7.

*********************************************************** G U M P
[GUMP@vmgump]: Project jetty-start (in module jetty) failed
To whom it may engage...
        
This is an automated request, but not an unsolicited one. For 
more information please visit http://gump.apache.org/nagged.html, 
and/or contact the folk at general@gump.apache.org.

Project jetty-start has an issue affecting its community integration.
This issue affects 1 projects.
The current state of this project is 'Failed', with reason 'Build Timed Out'.
For reference only, the following projects are affected by this:
    - jetty-start :  Java HTTP Servlet Server


Full details are available at:
    http://vmgump.apache.org/gump/public/jetty/jetty-start/index.html

That said, some information snippets are provided here.

The following annotations (debug/informational/warning/error messages) were provided:
 -DEBUG- Sole jar output [jetty-start-*[0-9T].jar] identifier set to project name
 -DEBUG- (Apache Gump generated) Apache Maven Settings in: /srv/gump/public/workspace/jetty/jetty-start/gump_mvn_settings.xml
 -INFO- Failed with reason build timed out
 -DEBUG- Maven POM in: /srv/gump/public/workspace/jetty/jetty-start/pom.xml
 -DEBUG- Extracted fallback artifacts from Gump Repository



The following work was performed:
http://vmgump.apache.org/gump/public/jetty/jetty-start/gump_work/build_jetty_jetty-start.html
Work Name: build_jetty_jetty-start (Type: Build)
Work ended in a state of : Failed
Elapsed: 60 mins
Command Line: /opt/maven2/bin/mvn --batch-mode --settings /srv/gump/public/workspace/jetty/jetty-start/gump_mvn_settings.xml install 
[Working Directory: /srv/gump/public/workspace/jetty/jetty-start]
M2_HOME: /opt/maven2
---------------------------------------------
[INFO] Scanning for projects...
[INFO] ------------------------------------------------------------------------
[INFO] Building Jetty :: Start
[INFO]    task-segment: [install]
[INFO] ------------------------------------------------------------------------
Downloading: http://localhost:8192/maven2/org/apache/maven/plugins/maven-surefire-plugin/2.8.1/maven-surefire-plugin-2.8.1.pom
---------------------------------------------

To subscribe to this information via syndicated feeds:
- RSS: http://vmgump.apache.org/gump/public/jetty/jetty-start/rss.xml
- Atom: http://vmgump.apache.org/gump/public/jetty/jetty-start/atom.xml

============================== Gump Tracking Only ===
Produced by Apache Gump(TM) version 2.3.
Gump Run 20130125180006, vmgump.apache.org:vmgump:20130125180006
Gump E-mail Identifier (unique within run) #8.

*********************************************************** G U M P
[GUMP@vmgump]: Project lenya-parent (in module lenya) failed
To whom it may engage...
        
This is an automated request, but not an unsolicited one. For 
more information please visit http://gump.apache.org/nagged.html, 
and/or contact the folk at general@gump.apache.org.

Project lenya-parent has an issue affecting its community integration.
This issue affects 3 projects.
The current state of this project is 'Failed', with reason 'Build Timed Out'.
For reference only, the following projects are affected by this:
    - lenya-core-api :  Content Management System
    - lenya-parent :  Content Management System
    - lenya-reactor :  Content Management System


Full details are available at:
    http://vmgump.apache.org/gump/public/lenya/lenya-parent/index.html

That said, some information snippets are provided here.

The following annotations (debug/informational/warning/error messages) were provided:
 -DEBUG- Sole pom output [pom.xml] identifier set to project name
 -DEBUG- (Apache Gump generated) Apache Maven Settings in: /srv/gump/public/workspace/lenya/org.apache.lenya.parent/gump_mvn_settings.xml
 -INFO- Failed with reason build timed out
 -DEBUG- Maven POM in: /srv/gump/public/workspace/lenya/org.apache.lenya.parent/pom.xml
 -DEBUG- Extracted fallback artifacts from Gump Repository



The following work was performed:
http://vmgump.apache.org/gump/public/lenya/lenya-parent/gump_work/build_lenya_lenya-parent.html
Work Name: build_lenya_lenya-parent (Type: Build)
Work ended in a state of : Failed
Elapsed: 1 hour 2 secs
Command Line: /opt/maven2/bin/mvn --batch-mode -Dpackaging=pom -DgroupId=org.apache.lenya -Dfile=pom.xml -DartifactId=lenya-parent -Dversion=2.2.0-SNAPSHOT --settings /srv/gump/public/workspace/lenya/org.apache.lenya.parent/gump_mvn_settings.xml install:install-file 
[Working Directory: /srv/gump/public/workspace/lenya/org.apache.lenya.parent]
M2_HOME: /opt/maven2
---------------------------------------------
[INFO] Scanning for projects...
Downloading: http://download.java.net/maven/2/org/apache/apache/4/apache-4.pom
[INFO] Unable to find resource 'org.apache:apache:pom:4' in repository java.net.2 (http://download.java.net/maven/2)
Downloading: http://localhost:8192/maven2/org/apache/apache/4/apache-4.pom
---------------------------------------------

To subscribe to this information via syndicated feeds:
- RSS: http://vmgump.apache.org/gump/public/lenya/lenya-parent/rss.xml
- Atom: http://vmgump.apache.org/gump/public/lenya/lenya-parent/atom.xml

============================== Gump Tracking Only ===
Produced by Apache Gump(TM) version 2.3.
Gump Run 20130125180006, vmgump.apache.org:vmgump:20130125180006
Gump E-mail Identifier (unique within run) #9.

*********************************************************** G U M P
[GUMP@vmgump]: Project velocity-anakia (in module velocity-anakia) failed
To whom it may engage...
        
This is an automated request, but not an unsolicited one. For 
more information please visit http://gump.apache.org/nagged.html, 
and/or contact the folk at general@gump.apache.org.

Project velocity-anakia has an issue affecting its community integration.
This issue affects 2 projects.
The current state of this project is 'Failed', with reason 'Build Timed Out'.
For reference only, the following projects are affected by this:
    - velocity-anakia :  Anakia uses Apache Velocity to generate documents based on X...
    - velocity-anakia-test :  Anakia uses Apache Velocity to generate documents based on X...


Full details are available at:
    http://vmgump.apache.org/gump/public/velocity-anakia/velocity-anakia/index.html

That said, some information snippets are provided here.

The following annotations (debug/informational/warning/error messages) were provided:
 -DEBUG- Sole jar output [velocity-anakia-*[0-9T].jar] identifier set to project name
 -DEBUG- (Apache Gump generated) Apache Maven Settings in: /srv/gump/public/workspace/velocity-anakia/gump_mvn_settings.xml
 -INFO- Failed with reason build timed out
 -DEBUG- Maven POM in: /srv/gump/public/workspace/velocity-anakia/pom.xml
 -DEBUG- Extracted fallback artifacts from Gump Repository



The following work was performed:
http://vmgump.apache.org/gump/public/velocity-anakia/velocity-anakia/gump_work/build_velocity-anakia_velocity-anakia.html
Work Name: build_velocity-anakia_velocity-anakia (Type: Build)
Work ended in a state of : Failed
Elapsed: 60 mins
Command Line: /opt/maven2/bin/mvn --batch-mode -DskipTests=true --settings /srv/gump/public/workspace/velocity-anakia/gump_mvn_settings.xml install 
[Working Directory: /srv/gump/public/workspace/velocity-anakia]
M2_HOME: /opt/maven2
---------------------------------------------
[INFO] Scanning for projects...
[INFO] ------------------------------------------------------------------------
[INFO] Building Anakia
[INFO]    task-segment: [install]
[INFO] ------------------------------------------------------------------------
[INFO] [remote-resources:process {execution: default}]
Downloading: http://localhost:8192/maven2/antlr/antlr/2.7.5/antlr-2.7.5.pom
---------------------------------------------

To subscribe to this information via syndicated feeds:
- RSS: http://vmgump.apache.org/gump/public/velocity-anakia/velocity-anakia/rss.xml
- Atom: http://vmgump.apache.org/gump/public/velocity-anakia/velocity-anakia/atom.xml

============================== Gump Tracking Only ===
Produced by Apache Gump(TM) version 2.3.
Gump Run 20130125180006, vmgump.apache.org:vmgump:20130125180006
Gump E-mail Identifier (unique within run) #10.

*********************************************************** G U M P
[GUMP@vmgump]: Project velocity-texen (in module velocity-texen) failed
To whom it may engage...
        
This is an automated request, but not an unsolicited one. For 
more information please visit http://gump.apache.org/nagged.html, 
and/or contact the folk at general@gump.apache.org.

Project velocity-texen has an issue affecting its community integration.
This issue affects 2 projects.
The current state of this project is 'Failed', with reason 'Build Timed Out'.
For reference only, the following projects are affected by this:
    - velocity-texen :  Texen is a general purpose text generating utility based on ...
    - velocity-texen-test :  Texen is a general purpose text generating utility based on ...


Full details are available at:
    http://vmgump.apache.org/gump/public/velocity-texen/velocity-texen/index.html

That said, some information snippets are provided here.

The following annotations (debug/informational/warning/error messages) were provided:
 -DEBUG- Sole jar output [velocity-texen-*[0-9T].jar] identifier set to project name
 -INFO- Optional dependency velocity-anakia failed with reason build timed out
 -DEBUG- (Apache Gump generated) Apache Maven Settings in: /srv/gump/public/workspace/velocity-texen/gump_mvn_settings.xml
 -INFO- Failed with reason build timed out
 -DEBUG- Maven POM in: /srv/gump/public/workspace/velocity-texen/pom.xml
 -DEBUG- Extracted fallback artifacts from Gump Repository



The following work was performed:
http://vmgump.apache.org/gump/public/velocity-texen/velocity-texen/gump_work/build_velocity-texen_velocity-texen.html
Work Name: build_velocity-texen_velocity-texen (Type: Build)
Work ended in a state of : Failed
Elapsed: 60 mins
Command Line: /opt/maven2/bin/mvn --batch-mode -DskipTests=true --settings /srv/gump/public/workspace/velocity-texen/gump_mvn_settings.xml install 
[Working Directory: /srv/gump/public/workspace/velocity-texen]
M2_HOME: /opt/maven2
---------------------------------------------
[INFO] Scanning for projects...
[INFO] ------------------------------------------------------------------------
[INFO] Building Velocity Texen
[INFO]    task-segment: [install]
[INFO] ------------------------------------------------------------------------
Downloading: http://localhost:8192/maven2/org/apache/maven/plugins/maven-site-plugin/2.1.1/maven-site-plugin-2.1.1.pom
---------------------------------------------

To subscribe to this information via syndicated feeds:
- RSS: http://vmgump.apache.org/gump/public/velocity-texen/velocity-texen/rss.xml
- Atom: http://vmgump.apache.org/gump/public/velocity-texen/velocity-texen/atom.xml

============================== Gump Tracking Only ===
Produced by Apache Gump(TM) version 2.3.
Gump Run 20130125180006, vmgump.apache.org:vmgump:20130125180006
Gump E-mail Identifier (unique within run) #11.

*********************************************************** G U M P
[GUMP@vmgump]: Project doxia-logging-api (in module doxia) failed
To whom it may engage...
        
This is an automated request, but not an unsolicited one. For 
more information please visit http://gump.apache.org/nagged.html, 
and/or contact the folk at general@gump.apache.org.

Project doxia-logging-api has an issue affecting its community integration.
This issue affects 1 projects.
The current state of this project is 'Failed', with reason 'Build Timed Out'.
For reference only, the following projects are affected by this:
    - doxia-logging-api :  A content generation framework which aims to provide its use...


Full details are available at:
    http://vmgump.apache.org/gump/public/doxia/doxia-logging-api/index.html

That said, some information snippets are provided here.

The following annotations (debug/informational/warning/error messages) were provided:
 -DEBUG- Sole jar output [doxia-logging-api-*[0-9T].jar] identifier set to project name
 -DEBUG- (Apache Gump generated) Apache Maven Settings in: /srv/gump/public/workspace/doxia/doxia/doxia-logging-api/gump_mvn_settings.xml
 -INFO- Failed with reason build timed out
 -DEBUG- Maven POM in: /srv/gump/public/workspace/doxia/doxia/doxia-logging-api/pom.xml
 -DEBUG- Extracted fallback artifacts from Gump Repository



The following work was performed:
http://vmgump.apache.org/gump/public/doxia/doxia-logging-api/gump_work/build_doxia_doxia-logging-api.html
Work Name: build_doxia_doxia-logging-api (Type: Build)
Work ended in a state of : Failed
Elapsed: 60 mins
Command Line: /opt/maven2/bin/mvn --batch-mode --settings /srv/gump/public/workspace/doxia/doxia/doxia-logging-api/gump_mvn_settings.xml install 
[Working Directory: /srv/gump/public/workspace/doxia/doxia/doxia-logging-api]
M2_HOME: /opt/maven2
---------------------------------------------
[INFO] Scanning for projects...
[INFO] ------------------------------------------------------------------------
[INFO] Building Doxia :: Logging API
[INFO]    task-segment: [install]
[INFO] ------------------------------------------------------------------------
Downloading: http://localhost:8192/maven2/org/apache/maven/plugins/maven-resources-plugin/2.6/maven-resources-plugin-2.6.pom
---------------------------------------------

To subscribe to this information via syndicated feeds:
- RSS: http://vmgump.apache.org/gump/public/doxia/doxia-logging-api/rss.xml
- Atom: http://vmgump.apache.org/gump/public/doxia/doxia-logging-api/atom.xml

============================== Gump Tracking Only ===
Produced by Apache Gump(TM) version 2.3.
Gump Run 20130125180006, vmgump.apache.org:vmgump:20130125180006
Gump E-mail Identifier (unique within run) #13.

*********************************************************** G U M P
[GUMP@vmgump]: Project doxia-sink-api-jar (in module doxia) failed
To whom it may engage...
        
This is an automated request, but not an unsolicited one. For 
more information please visit http://gump.apache.org/nagged.html, 
and/or contact the folk at general@gump.apache.org.

Project doxia-sink-api-jar has an issue affecting its community integration.
This issue affects 2 projects.
The current state of this project is 'Failed', with reason 'Build Timed Out'.
For reference only, the following projects are affected by this:
    - doxia-sink-api :  Cross project build tool
    - doxia-sink-api-jar :  A content generation framework which aims to provide its use...


Full details are available at:
    http://vmgump.apache.org/gump/public/doxia/doxia-sink-api-jar/index.html

That said, some information snippets are provided here.

The following annotations (debug/informational/warning/error messages) were provided:
 -INFO- Optional dependency doxia-logging-api failed with reason build timed out
 -DEBUG- (Apache Gump generated) Apache Maven Settings in: /srv/gump/public/workspace/doxia/doxia/doxia-sink-api/gump_mvn_settings.xml
 -INFO- Failed with reason build timed out
 -DEBUG- Maven POM in: /srv/gump/public/workspace/doxia/doxia/doxia-sink-api/pom.xml
 -DEBUG- Extracted fallback artifacts from Gump Repository



The following work was performed:
http://vmgump.apache.org/gump/public/doxia/doxia-sink-api-jar/gump_work/build_doxia_doxia-sink-api-jar.html
Work Name: build_doxia_doxia-sink-api-jar (Type: Build)
Work ended in a state of : Failed
Elapsed: 60 mins
Command Line: /opt/maven2/bin/mvn --batch-mode --settings /srv/gump/public/workspace/doxia/doxia/doxia-sink-api/gump_mvn_settings.xml install 
[Working Directory: /srv/gump/public/workspace/doxia/doxia/doxia-sink-api]
M2_HOME: /opt/maven2
---------------------------------------------
[INFO] Scanning for projects...
[INFO] ------------------------------------------------------------------------
[INFO] Building Doxia :: Sink API
[INFO]    task-segment: [install]
[INFO] ------------------------------------------------------------------------
Downloading: http://localhost:8192/maven2/org/apache/maven/plugins/maven-resources-plugin/2.6/maven-resources-plugin-2.6.pom
---------------------------------------------

To subscribe to this information via syndicated feeds:
- RSS: http://vmgump.apache.org/gump/public/doxia/doxia-sink-api-jar/rss.xml
- Atom: http://vmgump.apache.org/gump/public/doxia/doxia-sink-api-jar/atom.xml

============================== Gump Tracking Only ===
Produced by Apache Gump(TM) version 2.3.
Gump Run 20130125180006, vmgump.apache.org:vmgump:20130125180006
Gump E-mail Identifier (unique within run) #14.

*********************************************************** G U M P
[GUMP@vmgump]: Project cocoon22-xml-util (in module cocoon) failed
To whom it may engage...
        
This is an automated request, but not an unsolicited one. For 
more information please visit http://gump.apache.org/nagged.html, 
and/or contact the folk at general@gump.apache.org.

Project cocoon22-xml-util has an issue affecting its community integration.
This issue affects 1 projects.
The current state of this project is 'Failed', with reason 'Build Timed Out'.
For reference only, the following projects are affected by this:
    - cocoon22-xml-util :  Java XML Framework


Full details are available at:
    http://vmgump.apache.org/gump/public/cocoon/cocoon22-xml-util/index.html

That said, some information snippets are provided here.

The following annotations (debug/informational/warning/error messages) were provided:
 -DEBUG- (Apache Gump generated) Apache Maven Settings in: /srv/gump/public/workspace/cocoon/core/cocoon-xml/cocoon-xml-util/gump_mvn_settings.xml
 -INFO- Failed with reason build timed out
 -DEBUG- Maven POM in: /srv/gump/public/workspace/cocoon/core/cocoon-xml/cocoon-xml-util/pom.xml
 -DEBUG- Extracted fallback artifacts from Gump Repository



The following work was performed:
http://vmgump.apache.org/gump/public/cocoon/cocoon22-xml-util/gump_work/build_cocoon_cocoon22-xml-util.html
Work Name: build_cocoon_cocoon22-xml-util (Type: Build)
Work ended in a state of : Failed
Elapsed: 60 mins
Command Line: /opt/maven2/bin/mvn --batch-mode --settings /srv/gump/public/workspace/cocoon/core/cocoon-xml/cocoon-xml-util/gump_mvn_settings.xml install 
[Working Directory: /srv/gump/public/workspace/cocoon/core/cocoon-xml/cocoon-xml-util]
M2_HOME: /opt/maven2
---------------------------------------------
[INFO] Scanning for projects...
[INFO] ------------------------------------------------------------------------
[INFO] Building Cocoon XML Utilities
[INFO]    task-segment: [install]
[INFO] ------------------------------------------------------------------------
Downloading: http://localhost:8192/maven2/xml-apis/xml-apis/1.3.02/xml-apis-1.3.02.pom
---------------------------------------------

To subscribe to this information via syndicated feeds:
- RSS: http://vmgump.apache.org/gump/public/cocoon/cocoon22-xml-util/rss.xml
- Atom: http://vmgump.apache.org/gump/public/cocoon/cocoon22-xml-util/atom.xml

============================== Gump Tracking Only ===
Produced by Apache Gump(TM) version 2.3.
Gump Run 20130125180006, vmgump.apache.org:vmgump:20130125180006
Gump E-mail Identifier (unique within run) #16.

*********************************************************** G U M P
[GUMP@vmgump]: Project cocoon22-pipeline-api (in module cocoon) failed
To whom it may engage...
        
This is an automated request, but not an unsolicited one. For 
more information please visit http://gump.apache.org/nagged.html, 
and/or contact the folk at general@gump.apache.org.

Project cocoon22-pipeline-api has an issue affecting its community integration.
This issue affects 1 projects.
The current state of this project is 'Failed', with reason 'Build Timed Out'.
For reference only, the following projects are affected by this:
    - cocoon22-pipeline-api :  Java XML Framework


Full details are available at:
    http://vmgump.apache.org/gump/public/cocoon/cocoon22-pipeline-api/index.html

That said, some information snippets are provided here.

The following annotations (debug/informational/warning/error messages) were provided:
 -DEBUG- (Apache Gump generated) Apache Maven Settings in: /srv/gump/public/workspace/cocoon/core/cocoon-pipeline/cocoon-pipeline-api/gump_mvn_settings.xml
 -INFO- Failed with reason build timed out
 -DEBUG- Maven POM in: /srv/gump/public/workspace/cocoon/core/cocoon-pipeline/cocoon-pipeline-api/pom.xml
 -DEBUG- Extracted fallback artifacts from Gump Repository



The following work was performed:
http://vmgump.apache.org/gump/public/cocoon/cocoon22-pipeline-api/gump_work/build_cocoon_cocoon22-pipeline-api.html
Work Name: build_cocoon_cocoon22-pipeline-api (Type: Build)
Work ended in a state of : Failed
Elapsed: 60 mins
Command Line: /opt/maven2/bin/mvn --batch-mode --settings /srv/gump/public/workspace/cocoon/core/cocoon-pipeline/cocoon-pipeline-api/gump_mvn_settings.xml install 
[Working Directory: /srv/gump/public/workspace/cocoon/core/cocoon-pipeline/cocoon-pipeline-api]
M2_HOME: /opt/maven2
---------------------------------------------
[INFO] Scanning for projects...
[INFO] ------------------------------------------------------------------------
[INFO] Building Cocoon Pipeline API
[INFO]    task-segment: [install]
[INFO] ------------------------------------------------------------------------
Downloading: http://localhost:8192/maven2/org/apache/excalibur/components/excalibur-sourceresolve/2.2.3/excalibur-sourceresolve-2.2.3.pom
---------------------------------------------

To subscribe to this information via syndicated feeds:
- RSS: http://vmgump.apache.org/gump/public/cocoon/cocoon22-pipeline-api/rss.xml
- Atom: http://vmgump.apache.org/gump/public/cocoon/cocoon22-pipeline-api/atom.xml

============================== Gump Tracking Only ===
Produced by Apache Gump(TM) version 2.3.
Gump Run 20130125180006, vmgump.apache.org:vmgump:20130125180006
Gump E-mail Identifier (unique within run) #18.

*********************************************************** G U M P
[GUMP@vmgump]: Project cocoon22-xml-impl (in module cocoon) failed
To whom it may engage...
        
This is an automated request, but not an unsolicited one. For 
more information please visit http://gump.apache.org/nagged.html, 
and/or contact the folk at general@gump.apache.org.

Project cocoon22-xml-impl has an issue affecting its community integration.
This issue affects 1 projects.
The current state of this project is 'Failed', with reason 'Build Timed Out'.
For reference only, the following projects are affected by this:
    - cocoon22-xml-impl :  Java XML Framework


Full details are available at:
    http://vmgump.apache.org/gump/public/cocoon/cocoon22-xml-impl/index.html

That said, some information snippets are provided here.

The following annotations (debug/informational/warning/error messages) were provided:
 -DEBUG- (Apache Gump generated) Apache Maven Settings in: /srv/gump/public/workspace/cocoon/core/cocoon-xml/cocoon-xml-impl/gump_mvn_settings.xml
 -INFO- Failed with reason build timed out
 -DEBUG- Maven POM in: /srv/gump/public/workspace/cocoon/core/cocoon-xml/cocoon-xml-impl/pom.xml
 -DEBUG- Extracted fallback artifacts from Gump Repository



The following work was performed:
http://vmgump.apache.org/gump/public/cocoon/cocoon22-xml-impl/gump_work/build_cocoon_cocoon22-xml-impl.html
Work Name: build_cocoon_cocoon22-xml-impl (Type: Build)
Work ended in a state of : Failed
Elapsed: 60 mins
Command Line: /opt/maven2/bin/mvn --batch-mode --settings /srv/gump/public/workspace/cocoon/core/cocoon-xml/cocoon-xml-impl/gump_mvn_settings.xml install 
[Working Directory: /srv/gump/public/workspace/cocoon/core/cocoon-xml/cocoon-xml-impl]
M2_HOME: /opt/maven2
---------------------------------------------
[INFO] Scanning for projects...
[INFO] ------------------------------------------------------------------------
[INFO] Building Cocoon XML Implementation
[INFO]    task-segment: [install]
[INFO] ------------------------------------------------------------------------
[INFO] snapshot org.apache.cocoon:cocoon-xml-api:1.1.0-SNAPSHOT: checking for updates from apache.snapshots
Downloading: http://localhost:8192/maven2/xml-apis/xml-apis/1.3.02/xml-apis-1.3.02.pom
---------------------------------------------

To subscribe to this information via syndicated feeds:
- RSS: http://vmgump.apache.org/gump/public/cocoon/cocoon22-xml-impl/rss.xml
- Atom: http://vmgump.apache.org/gump/public/cocoon/cocoon22-xml-impl/atom.xml

============================== Gump Tracking Only ===
Produced by Apache Gump(TM) version 2.3.
Gump Run 20130125180006, vmgump.apache.org:vmgump:20130125180006
Gump E-mail Identifier (unique within run) #19.

*********************************************************** G U M P
[GUMP@vmgump]: Project axis2-resource-bundle (in module ws-axis2) failed
To whom it may engage...
        
This is an automated request, but not an unsolicited one. For 
more information please visit http://gump.apache.org/nagged.html, 
and/or contact the folk at general@gump.apache.org.

Project axis2-resource-bundle has an issue affecting its community integration.
This issue affects 2 projects.
The current state of this project is 'Failed', with reason 'Build Timed Out'.
For reference only, the following projects are affected by this:
    - axis2-mar-maven-plugin :  Apache Axis2 SOAP Stack
    - axis2-resource-bundle :  Apache Axis2 SOAP Stack


Full details are available at:
    http://vmgump.apache.org/gump/public/ws-axis2/axis2-resource-bundle/index.html

That said, some information snippets are provided here.

The following annotations (debug/informational/warning/error messages) were provided:
 -DEBUG- Sole jar output [axis2-resource-bundle-*[0-9T].jar] identifier set to project name
 -DEBUG- Sole pom output [pom.xml] identifier set to project name
 -DEBUG- (Apache Gump generated) Apache Maven Settings in: /srv/gump/public/workspace/ws-axis2/modules/resource-bundle/gump_mvn_settings.xml
 -INFO- Failed with reason build timed out
 -DEBUG- Maven POM in: /srv/gump/public/workspace/ws-axis2/modules/resource-bundle/pom.xml
 -DEBUG- Extracted fallback artifacts from Gump Repository



The following work was performed:
http://vmgump.apache.org/gump/public/ws-axis2/axis2-resource-bundle/gump_work/build_ws-axis2_axis2-resource-bundle.html
Work Name: build_ws-axis2_axis2-resource-bundle (Type: Build)
Work ended in a state of : Failed
Elapsed: 60 mins
Command Line: /opt/maven2/bin/mvn --batch-mode --settings /srv/gump/public/workspace/ws-axis2/modules/resource-bundle/gump_mvn_settings.xml install 
[Working Directory: /srv/gump/public/workspace/ws-axis2/modules/resource-bundle]
M2_HOME: /opt/maven2
---------------------------------------------
[INFO] Scanning for projects...
[INFO] ------------------------------------------------------------------------
[INFO] Building Apache Axis2 - Resource bundle
[INFO]    task-segment: [install]
[INFO] ------------------------------------------------------------------------
Downloading: http://localhost:8192/maven2/org/apache/maven/plugins/maven-resources-plugin/2.4.2/maven-resources-plugin-2.4.2.pom
---------------------------------------------

To subscribe to this information via syndicated feeds:
- RSS: http://vmgump.apache.org/gump/public/ws-axis2/axis2-resource-bundle/rss.xml
- Atom: http://vmgump.apache.org/gump/public/ws-axis2/axis2-resource-bundle/atom.xml

============================== Gump Tracking Only ===
Produced by Apache Gump(TM) version 2.3.
Gump Run 20130125180006, vmgump.apache.org:vmgump:20130125180006
Gump E-mail Identifier (unique within run) #22.

*********************************************************** G U M P
[GUMP@vmgump]: Project google-docbkx-maven-base (in module google-docbkx) failed
To whom it may engage...
        
This is an automated request, but not an unsolicited one. For 
more information please visit http://gump.apache.org/nagged.html, 
and/or contact the folk at general@gump.apache.org.

Project google-docbkx-maven-base has an issue affecting its community integration.
This issue affects 2 projects.
The current state of this project is 'Failed', with reason 'Build Timed Out'.
For reference only, the following projects are affected by this:
    - google-docbkx-maven-base :  A number of tools for handling DocBook XML transformations.
    - google-docbkx-maven-plugin :  A number of tools for handling DocBook XML transformations.


Full details are available at:
    http://vmgump.apache.org/gump/public/google-docbkx/google-docbkx-maven-base/index.html

That said, some information snippets are provided here.

The following annotations (debug/informational/warning/error messages) were provided:
 -INFO- Optional dependency javax.servlet prerequisite failed with reason build failed
 -INFO- Optional dependency javax.servlet.jsp prerequisite failed with reason build failed
 -DEBUG- (Apache Gump generated) Apache Maven Settings in: /srv/gump/public/workspace/google-docbkx/docbkx-maven-base/gump_mvn_settings.xml
 -INFO- Failed with reason build timed out
 -DEBUG- Maven POM in: /srv/gump/public/workspace/google-docbkx/docbkx-maven-base/pom.xml
 -DEBUG- Extracted fallback artifacts from Gump Repository



The following work was performed:
http://vmgump.apache.org/gump/public/google-docbkx/google-docbkx-maven-base/gump_work/build_google-docbkx_google-docbkx-maven-base.html
Work Name: build_google-docbkx_google-docbkx-maven-base (Type: Build)
Work ended in a state of : Failed
Elapsed: 60 mins
Command Line: /opt/maven2/bin/mvn --batch-mode --settings /srv/gump/public/workspace/google-docbkx/docbkx-maven-base/gump_mvn_settings.xml install 
[Working Directory: /srv/gump/public/workspace/google-docbkx/docbkx-maven-base]
M2_HOME: /opt/maven2
---------------------------------------------
[INFO] Scanning for projects...
[INFO] ------------------------------------------------------------------------
[INFO] Building Docbkx Maven Base
[INFO]    task-segment: [install]
[INFO] ------------------------------------------------------------------------
[INFO] [resources:resources {execution: default-resources}]
[WARNING] Using platform encoding (UTF-8 actually) to copy filtered resources, i.e. build is platform dependent!
[INFO] Copying 0 resource
Downloading: http://localhost:8192/maven2/commons-el/commons-el/1.0/commons-el-1.0.pom
---------------------------------------------

To subscribe to this information via syndicated feeds:
- RSS: http://vmgump.apache.org/gump/public/google-docbkx/google-docbkx-maven-base/rss.xml
- Atom: http://vmgump.apache.org/gump/public/google-docbkx/google-docbkx-maven-base/atom.xml

============================== Gump Tracking Only ===
Produced by Apache Gump(TM) version 2.3.
Gump Run 20130125180006, vmgump.apache.org:vmgump:20130125180006
Gump E-mail Identifier (unique within run) #23.

*********************************************************** G U M P
[GUMP@vmgump]: Project tika-core (in module tika) failed
To whom it may engage...
        
This is an automated request, but not an unsolicited one. For 
more information please visit http://gump.apache.org/nagged.html, 
and/or contact the folk at general@gump.apache.org.

Project tika-core has an issue affecting its community integration.
This issue affects 3 projects.
The current state of this project is 'Failed', with reason 'Build Timed Out'.
For reference only, the following projects are affected by this:
    - tika-core :  Apache Tika is a toolkit for detecting and extracting metada...
    - tika-parsers :  Apache Tika is a toolkit for detecting and extracting metada...
    - tika-parsers-test :  Apache Tika is a toolkit for detecting and extracting metada...


Full details are available at:
    http://vmgump.apache.org/gump/public/tika/tika-core/index.html

That said, some information snippets are provided here.

The following annotations (debug/informational/warning/error messages) were provided:
 -DEBUG- Sole jar output [tika-core-*[0-9T].jar] identifier set to project name
 -DEBUG- (Apache Gump generated) Apache Maven Settings in: /srv/gump/public/workspace/tika/tika-core/gump_mvn_settings.xml
 -INFO- Failed with reason build timed out
 -DEBUG- Maven POM in: /srv/gump/public/workspace/tika/tika-core/pom.xml
 -DEBUG- Extracted fallback artifacts from Gump Repository



The following work was performed:
http://vmgump.apache.org/gump/public/tika/tika-core/gump_work/build_tika_tika-core.html
Work Name: build_tika_tika-core (Type: Build)
Work ended in a state of : Failed
Elapsed: 60 mins
Command Line: /opt/maven2/bin/mvn --batch-mode --settings /srv/gump/public/workspace/tika/tika-core/gump_mvn_settings.xml package 
[Working Directory: /srv/gump/public/workspace/tika/tika-core]
M2_HOME: /opt/maven2
---------------------------------------------
[INFO] Scanning for projects...
[WARNING] POM for 'biz.aQute:bndlib:pom:1.15.0:runtime' is invalid.

Its dependencies (if any) will NOT be available to the current build.
[INFO] ------------------------------------------------------------------------
[INFO] Building Apache Tika core
[INFO]    task-segment: [package]
[INFO] ------------------------------------------------------------------------
Downloading: http://localhost:8192/maven2/org/codehaus/mojo/clirr-maven-plugin/2.3/clirr-maven-plugin-2.3.pom
---------------------------------------------

To subscribe to this information via syndicated feeds:
- RSS: http://vmgump.apache.org/gump/public/tika/tika-core/rss.xml
- Atom: http://vmgump.apache.org/gump/public/tika/tika-core/atom.xml

============================== Gump Tracking Only ===
Produced by Apache Gump(TM) version 2.3.
Gump Run 20130125180006, vmgump.apache.org:vmgump:20130125180006
Gump E-mail Identifier (unique within run) #26.

*********************************************************** G U M P
[GUMP@vmgump]: Project velocity-dvsl (in module velocity-dvsl) failed
To whom it may engage...
        
This is an automated request, but not an unsolicited one. For 
more information please visit http://gump.apache.org/nagged.html, 
and/or contact the folk at general@gump.apache.org.

Project velocity-dvsl has an issue affecting its community integration.
This issue affects 2 projects.
The current state of this project is 'Failed', with reason 'Build Timed Out'.
For reference only, the following projects are affected by this:
    - fulcrum-dvsl :  Services Framework
    - velocity-dvsl :  Template engine


Full details are available at:
    http://vmgump.apache.org/gump/public/velocity-dvsl/velocity-dvsl/index.html

That said, some information snippets are provided here.

The following annotations (debug/informational/warning/error messages) were provided:
 -DEBUG- (Apache Gump generated) Apache Maven Settings in: /srv/gump/public/workspace/velocity-dvsl/gump_mvn_settings.xml
 -INFO- Failed with reason build timed out
 -DEBUG- Maven POM in: /srv/gump/public/workspace/velocity-dvsl/pom.xml
 -DEBUG- Extracted fallback artifacts from Gump Repository



The following work was performed:
http://vmgump.apache.org/gump/public/velocity-dvsl/velocity-dvsl/gump_work/build_velocity-dvsl_velocity-dvsl.html
Work Name: build_velocity-dvsl_velocity-dvsl (Type: Build)
Work ended in a state of : Failed
Elapsed: 60 mins
Command Line: /opt/maven2/bin/mvn --batch-mode --settings /srv/gump/public/workspace/velocity-dvsl/gump_mvn_settings.xml package 
[Working Directory: /srv/gump/public/workspace/velocity-dvsl]
M2_HOME: /opt/maven2
---------------------------------------------
[INFO] Scanning for projects...
[INFO] Reactor build order: 
[INFO]   Apache Velocity DVSL
[INFO]   Apache Velocity DVSL - Core
[INFO]   Apache Velocity DVSL - Ant integration
[INFO]   Apache Velocity DVSL - Uberjar
[INFO]   Apache Velocity DVSL - Assembly
[INFO] ------------------------------------------------------------------------
[INFO] Building Apache Velocity DVSL
[INFO]    task-segment: [package]
[INFO] ------------------------------------------------------------------------
[INFO] [remote-resources:process {execution: default}]
[INFO] [site:attach-descriptor {execution: default-attach-descriptor}]
[INFO] ------------------------------------------------------------------------
[INFO] Building Apache Velocity DVSL - Core
[INFO]    task-segment: [package]
[INFO] ------------------------------------------------------------------------
[INFO] [remote-resources:process {execution: default}]
Downloading: http://localhost:8192/maven2/dom4j/dom4j/1.6.1/dom4j-1.6.1.pom
---------------------------------------------

To subscribe to this information via syndicated feeds:
- RSS: http://vmgump.apache.org/gump/public/velocity-dvsl/velocity-dvsl/rss.xml
- Atom: http://vmgump.apache.org/gump/public/velocity-dvsl/velocity-dvsl/atom.xml

============================== Gump Tracking Only ===
Produced by Apache Gump(TM) version 2.3.
Gump Run 20130125180006, vmgump.apache.org:vmgump:20130125180006
Gump E-mail Identifier (unique within run) #29.

*********************************************************** G U M P
[GUMP@vmgump]: Project jetty-io (in module jetty) failed
To whom it may engage...
        
This is an automated request, but not an unsolicited one. For 
more information please visit http://gump.apache.org/nagged.html, 
and/or contact the folk at general@gump.apache.org.

Project jetty-io has an issue affecting its community integration.
This issue affects 3 projects.
The current state of this project is 'Failed', with reason 'Build Timed Out'.
For reference only, the following projects are affected by this:
    - jetty-http :  Java HTTP Servlet Server
    - jetty-io :  Java HTTP Servlet Server
    - jetty-io-test :  Java HTTP Servlet Server


Full details are available at:
    http://vmgump.apache.org/gump/public/jetty/jetty-io/index.html

That said, some information snippets are provided here.

The following annotations (debug/informational/warning/error messages) were provided:
 -DEBUG- Sole jar output [jetty-io-*[0-9T].jar] identifier set to project name
 -INFO- Optional dependency jetty-util failed with reason build timed out
 -DEBUG- (Apache Gump generated) Apache Maven Settings in: /srv/gump/public/workspace/jetty/jetty-io/gump_mvn_settings.xml
 -INFO- Failed with reason build timed out
 -DEBUG- Maven POM in: /srv/gump/public/workspace/jetty/jetty-io/pom.xml
 -DEBUG- Extracted fallback artifacts from Gump Repository



The following work was performed:
http://vmgump.apache.org/gump/public/jetty/jetty-io/gump_work/build_jetty_jetty-io.html
Work Name: build_jetty_jetty-io (Type: Build)
Work ended in a state of : Failed
Elapsed: 60 mins
Command Line: /opt/maven2/bin/mvn --batch-mode -DskipTests=true --settings /srv/gump/public/workspace/jetty/jetty-io/gump_mvn_settings.xml install 
[Working Directory: /srv/gump/public/workspace/jetty/jetty-io]
M2_HOME: /opt/maven2
---------------------------------------------
[INFO] Scanning for projects...
[WARNING] POM for 'biz.aQute:bndlib:pom:1.15.0:runtime' is invalid.

Its dependencies (if any) will NOT be available to the current build.
[INFO] ------------------------------------------------------------------------
[INFO] Building Jetty :: IO Utility
[INFO]    task-segment: [install]
[INFO] ------------------------------------------------------------------------
Downloading: http://localhost:8192/maven2/org/apache/maven/plugins/maven-surefire-plugin/2.8.1/maven-surefire-plugin-2.8.1.pom
---------------------------------------------

To subscribe to this information via syndicated feeds:
- RSS: http://vmgump.apache.org/gump/public/jetty/jetty-io/rss.xml
- Atom: http://vmgump.apache.org/gump/public/jetty/jetty-io/atom.xml

============================== Gump Tracking Only ===
Produced by Apache Gump(TM) version 2.3.
Gump Run 20130125180006, vmgump.apache.org:vmgump:20130125180006
Gump E-mail Identifier (unique within run) #32.

*********************************************************** G U M P
[GUMP@vmgump]: Project castor-xml (in module castor) failed
To whom it may engage...
        
This is an automated request, but not an unsolicited one. For 
more information please visit http://gump.apache.org/nagged.html, 
and/or contact the folk at general@gump.apache.org.

Project castor-xml has an issue affecting its community integration.
This issue affects 2 projects.
The current state of this project is 'Failed', with reason 'Build Timed Out'.
For reference only, the following projects are affected by this:
    - castor-xml :  Java to XML, SQL, LDAP bindings
    - castor-xml-test :  Java to XML, SQL, LDAP bindings


Full details are available at:
    http://vmgump.apache.org/gump/public/castor/castor-xml/index.html

That said, some information snippets are provided here.

The following annotations (debug/informational/warning/error messages) were provided:
 -DEBUG- Sole jar output [castor-xml-*[0-9T].jar] identifier set to project name
 -INFO- Optional dependency commons-cli failed with reason build timed out
 -INFO- Optional dependency objenesis failed with reason build timed out
 -DEBUG- (Apache Gump generated) Apache Maven Settings in: /srv/gump/public/workspace/castor/xml/gump_mvn_settings.xml
 -INFO- Failed with reason build timed out
 -DEBUG- Maven POM in: /srv/gump/public/workspace/castor/xml/pom.xml
 -INFO- Failed to extract fallback artifacts from Gump Repository



The following work was performed:
http://vmgump.apache.org/gump/public/castor/castor-xml/gump_work/build_castor_castor-xml.html
Work Name: build_castor_castor-xml (Type: Build)
Work ended in a state of : Failed
Elapsed: 60 mins
Command Line: /opt/maven2/bin/mvn --batch-mode -DskipTests=true --settings /srv/gump/public/workspace/castor/xml/gump_mvn_settings.xml package 
[Working Directory: /srv/gump/public/workspace/castor/xml]
M2_HOME: /opt/maven2
---------------------------------------------
[INFO] Scanning for projects...
[INFO] ------------------------------------------------------------------------
[INFO] Building Castor XML - core
[INFO]    task-segment: [package]
[INFO] ------------------------------------------------------------------------
Downloading: http://localhost:8192/maven2/org/codehaus/mojo/castor-maven-plugin/2.1/castor-maven-plugin-2.1.pom
---------------------------------------------

To subscribe to this information via syndicated feeds:
- RSS: http://vmgump.apache.org/gump/public/castor/castor-xml/rss.xml
- Atom: http://vmgump.apache.org/gump/public/castor/castor-xml/atom.xml

============================== Gump Tracking Only ===
Produced by Apache Gump(TM) version 2.3.
Gump Run 20130125180006, vmgump.apache.org:vmgump:20130125180006
Gump E-mail Identifier (unique within run) #34.

*********************************************************** G U M P
[GUMP@vmgump]: Project cocoon22-spring-configurator (in module cocoon-subprojects) failed
To whom it may engage...
        
This is an automated request, but not an unsolicited one. For 
more information please visit http://gump.apache.org/nagged.html, 
and/or contact the folk at general@gump.apache.org.

Project cocoon22-spring-configurator has an issue affecting its community integration.
This issue affects 5 projects.
The current state of this project is 'Failed', with reason 'Build Timed Out'.
For reference only, the following projects are affected by this:
    - cocoon-all :  Java XML Framework
    - cocoon-monitoring :  Java XML Framework
    - cocoon-monitoring-test :  Java XML Framework
    - cocoon22-spring-configurator :  Java XML Framework
    - cocoon3-reactor :  Java XML Framework


Full details are available at:
    http://vmgump.apache.org/gump/public/cocoon-subprojects/cocoon22-spring-configurator/index.html

That said, some information snippets are provided here.

The following annotations (debug/informational/warning/error messages) were provided:
 -DEBUG- (Apache Gump generated) Apache Maven Settings in: /srv/gump/public/workspace/cocoon-subprojects/cocoon-spring-configurator/trunk/gump_mvn_settings.xml
 -INFO- Failed with reason build timed out
 -DEBUG- Maven POM in: /srv/gump/public/workspace/cocoon-subprojects/cocoon-spring-configurator/trunk/pom.xml
 -INFO- Failed to extract fallback artifacts from Gump Repository



The following work was performed:
http://vmgump.apache.org/gump/public/cocoon-subprojects/cocoon22-spring-configurator/gump_work/build_cocoon-subprojects_cocoon22-spring-configurator.html
Work Name: build_cocoon-subprojects_cocoon22-spring-configurator (Type: Build)
Work ended in a state of : Failed
Elapsed: 60 mins
Command Line: /opt/maven2/bin/mvn --batch-mode --settings /srv/gump/public/workspace/cocoon-subprojects/cocoon-spring-configurator/trunk/gump_mvn_settings.xml install 
[Working Directory: /srv/gump/public/workspace/cocoon-subprojects/cocoon-spring-configurator/trunk]
M2_HOME: /opt/maven2
---------------------------------------------
[INFO] Scanning for projects...
[INFO] ------------------------------------------------------------------------
[INFO] Building Cocoon Spring Configurator
[INFO]    task-segment: [install]
[INFO] ------------------------------------------------------------------------
Downloading: http://localhost:8192/maven2/org/apache/cocoon/cocoon-configuration-api/1.0.4/cocoon-configuration-api-1.0.4.pom
---------------------------------------------

To subscribe to this information via syndicated feeds:
- RSS: http://vmgump.apache.org/gump/public/cocoon-subprojects/cocoon22-spring-configurator/rss.xml
- Atom: http://vmgump.apache.org/gump/public/cocoon-subprojects/cocoon22-spring-configurator/atom.xml

============================== Gump Tracking Only ===
Produced by Apache Gump(TM) version 2.3.
Gump Run 20130125180006, vmgump.apache.org:vmgump:20130125180006
Gump E-mail Identifier (unique within run) #35.

*********************************************************** G U M P
[GUMP@vmgump]: Project cocoon22-util (in module cocoon) failed
To whom it may engage...
        
This is an automated request, but not an unsolicited one. For 
more information please visit http://gump.apache.org/nagged.html, 
and/or contact the folk at general@gump.apache.org.

Project cocoon22-util has an issue affecting its community integration.
This issue affects 1 projects.
The current state of this project is 'Failed', with reason 'Build Timed Out'.
For reference only, the following projects are affected by this:
    - cocoon22-util :  Java XML Framework


Full details are available at:
    http://vmgump.apache.org/gump/public/cocoon/cocoon22-util/index.html

That said, some information snippets are provided here.

The following annotations (debug/informational/warning/error messages) were provided:
 -DEBUG- (Apache Gump generated) Apache Maven Settings in: /srv/gump/public/workspace/cocoon/core/cocoon-util/gump_mvn_settings.xml
 -INFO- Failed with reason build timed out
 -DEBUG- Maven POM in: /srv/gump/public/workspace/cocoon/core/cocoon-util/pom.xml
 -DEBUG- Extracted fallback artifacts from Gump Repository



The following work was performed:
http://vmgump.apache.org/gump/public/cocoon/cocoon22-util/gump_work/build_cocoon_cocoon22-util.html
Work Name: build_cocoon_cocoon22-util (Type: Build)
Work ended in a state of : Failed
Elapsed: 60 mins
Command Line: /opt/maven2/bin/mvn --batch-mode --settings /srv/gump/public/workspace/cocoon/core/cocoon-util/gump_mvn_settings.xml install 
[Working Directory: /srv/gump/public/workspace/cocoon/core/cocoon-util]
M2_HOME: /opt/maven2
---------------------------------------------
[INFO] Scanning for projects...
[INFO] ------------------------------------------------------------------------
[INFO] Building Cocoon Util
[INFO]    task-segment: [install]
[INFO] ------------------------------------------------------------------------
Downloading: http://localhost:8192/maven2/jakarta-regexp/jakarta-regexp/1.4/jakarta-regexp-1.4.pom
---------------------------------------------

To subscribe to this information via syndicated feeds:
- RSS: http://vmgump.apache.org/gump/public/cocoon/cocoon22-util/rss.xml
- Atom: http://vmgump.apache.org/gump/public/cocoon/cocoon22-util/atom.xml

============================== Gump Tracking Only ===
Produced by Apache Gump(TM) version 2.3.
Gump Run 20130125180006, vmgump.apache.org:vmgump:20130125180006
Gump E-mail Identifier (unique within run) #36.

*********************************************************** G U M P
[GUMP@vmgump]: Project cocoon22-thread-impl (in module cocoon) failed
To whom it may engage...
        
This is an automated request, but not an unsolicited one. For 
more information please visit http://gump.apache.org/nagged.html, 
and/or contact the folk at general@gump.apache.org.

Project cocoon22-thread-impl has an issue affecting its community integration.
This issue affects 9 projects.
The current state of this project is 'Failed', with reason 'Build Timed Out'.
For reference only, the following projects are affected by this:
    - cocoon22-chaperon-impl :  Java XML Framework
    - cocoon22-chaperon-impl-test :  Java XML Framework
    - cocoon22-core :  Java XML Framework
    - cocoon22-core-test :  Java XML Framework
    - cocoon22-flowscript-impl :  Java XML Framework
    - cocoon22-serializers-impl :  Java XML Framework
    - cocoon22-thread-impl :  Java XML Framework
    - cocoon22-thread-impl-test :  Java XML Framework
    - cocoon22-validation-impl :  Java XML Framework


Full details are available at:
    http://vmgump.apache.org/gump/public/cocoon/cocoon22-thread-impl/index.html

That said, some information snippets are provided here.

The following annotations (debug/informational/warning/error messages) were provided:
 -DEBUG- (Apache Gump generated) Apache Maven Settings in: /srv/gump/public/workspace/cocoon/core/cocoon-thread/cocoon-thread-impl/gump_mvn_settings.xml
 -INFO- Failed with reason build timed out
 -DEBUG- Maven POM in: /srv/gump/public/workspace/cocoon/core/cocoon-thread/cocoon-thread-impl/pom.xml
 -DEBUG- Extracted fallback artifacts from Gump Repository



The following work was performed:
http://vmgump.apache.org/gump/public/cocoon/cocoon22-thread-impl/gump_work/build_cocoon_cocoon22-thread-impl.html
Work Name: build_cocoon_cocoon22-thread-impl (Type: Build)
Work ended in a state of : Failed
Elapsed: 60 mins
Command Line: /opt/maven2/bin/mvn --batch-mode -Dmaven.test.skip.exec=true --settings /srv/gump/public/workspace/cocoon/core/cocoon-thread/cocoon-thread-impl/gump_mvn_settings.xml install 
[Working Directory: /srv/gump/public/workspace/cocoon/core/cocoon-thread/cocoon-thread-impl]
M2_HOME: /opt/maven2
---------------------------------------------
[INFO] Scanning for projects...
[INFO] ------------------------------------------------------------------------
[INFO] Building Cocoon Thread Implementation
[INFO]    task-segment: [install]
[INFO] ------------------------------------------------------------------------
[INFO] snapshot org.apache.cocoon:cocoon-thread-api:1.1.0-SNAPSHOT: checking for updates from apache.snapshots
Downloading: http://localhost:8192/maven2/org/springframework/spring-test/2.5.5/spring-test-2.5.5.pom
---------------------------------------------

To subscribe to this information via syndicated feeds:
- RSS: http://vmgump.apache.org/gump/public/cocoon/cocoon22-thread-impl/rss.xml
- Atom: http://vmgump.apache.org/gump/public/cocoon/cocoon22-thread-impl/atom.xml

============================== Gump Tracking Only ===
Produced by Apache Gump(TM) version 2.3.
Gump Run 20130125180006, vmgump.apache.org:vmgump:20130125180006
Gump E-mail Identifier (unique within run) #37.

*********************************************************** G U M P
[GUMP@vmgump]: Project cocoon22-store-impl (in module cocoon) failed
To whom it may engage...
        
This is an automated request, but not an unsolicited one. For 
more information please visit http://gump.apache.org/nagged.html, 
and/or contact the folk at general@gump.apache.org.

Project cocoon22-store-impl has an issue affecting its community integration.
This issue affects 1 projects.
The current state of this project is 'Failed', with reason 'Build Timed Out'.
For reference only, the following projects are affected by this:
    - cocoon22-store-impl :  Java XML Framework


Full details are available at:
    http://vmgump.apache.org/gump/public/cocoon/cocoon22-store-impl/index.html

That said, some information snippets are provided here.

The following annotations (debug/informational/warning/error messages) were provided:
 -INFO- Optional dependency cocoon22-util failed with reason build timed out
 -DEBUG- (Apache Gump generated) Apache Maven Settings in: /srv/gump/public/workspace/cocoon/core/cocoon-store/cocoon-store-impl/gump_mvn_settings.xml
 -INFO- Failed with reason build timed out
 -DEBUG- Maven POM in: /srv/gump/public/workspace/cocoon/core/cocoon-store/cocoon-store-impl/pom.xml
 -DEBUG- Extracted fallback artifacts from Gump Repository



The following work was performed:
http://vmgump.apache.org/gump/public/cocoon/cocoon22-store-impl/gump_work/build_cocoon_cocoon22-store-impl.html
Work Name: build_cocoon_cocoon22-store-impl (Type: Build)
Work ended in a state of : Failed
Elapsed: 60 mins
Command Line: /opt/maven2/bin/mvn --batch-mode --settings /srv/gump/public/workspace/cocoon/core/cocoon-store/cocoon-store-impl/gump_mvn_settings.xml install 
[Working Directory: /srv/gump/public/workspace/cocoon/core/cocoon-store/cocoon-store-impl]
M2_HOME: /opt/maven2
---------------------------------------------
[INFO] Scanning for projects...
[INFO] ------------------------------------------------------------------------
[INFO] Building Cocoon Store Implementation
[INFO]    task-segment: [install]
[INFO] ------------------------------------------------------------------------
Downloading: http://localhost:8192/maven2/org/apache/cocoon/cocoon-configuration-api/1.0.2/cocoon-configuration-api-1.0.2.pom
---------------------------------------------

To subscribe to this information via syndicated feeds:
- RSS: http://vmgump.apache.org/gump/public/cocoon/cocoon22-store-impl/rss.xml
- Atom: http://vmgump.apache.org/gump/public/cocoon/cocoon22-store-impl/atom.xml

============================== Gump Tracking Only ===
Produced by Apache Gump(TM) version 2.3.
Gump Run 20130125180006, vmgump.apache.org:vmgump:20130125180006
Gump E-mail Identifier (unique within run) #38.

*********************************************************** G U M P
[GUMP@vmgump]: Project fontbox (in module pdfbox) failed
To whom it may engage...
        
This is an automated request, but not an unsolicited one. For 
more information please visit http://gump.apache.org/nagged.html, 
and/or contact the folk at general@gump.apache.org.

Project fontbox has an issue affecting its community integration.
This issue affects 3 projects.
The current state of this project is 'Failed', with reason 'Build Timed Out'.
For reference only, the following projects are affected by this:
    - fontbox :  Apache PDFBox is an open source Java PDF library for working...
    - pdfbox :  Apache PDFBox is an open source Java PDF library for working...
    - pdfbox-lucene :  Apache PDFBox is an open source Java PDF library for working...


Full details are available at:
    http://vmgump.apache.org/gump/public/pdfbox/fontbox/index.html

That said, some information snippets are provided here.

The following annotations (debug/informational/warning/error messages) were provided:
 -DEBUG- Sole jar output [fontbox-*[0-9T].jar] identifier set to project name
 -INFO- Optional dependency tika-core failed with reason build timed out
 -DEBUG- (Apache Gump generated) Apache Maven Settings in: /srv/gump/public/workspace/pdfbox/fontbox/gump_mvn_settings.xml
 -INFO- Failed with reason build timed out
 -DEBUG- Maven POM in: /srv/gump/public/workspace/pdfbox/fontbox/pom.xml
 -DEBUG- Extracted fallback artifacts from Gump Repository



The following work was performed:
http://vmgump.apache.org/gump/public/pdfbox/fontbox/gump_work/build_pdfbox_fontbox.html
Work Name: build_pdfbox_fontbox (Type: Build)
Work ended in a state of : Failed
Elapsed: 60 mins
Command Line: /opt/maven2/bin/mvn --batch-mode --settings /srv/gump/public/workspace/pdfbox/fontbox/gump_mvn_settings.xml package 
[Working Directory: /srv/gump/public/workspace/pdfbox/fontbox]
M2_HOME: /opt/maven2
---------------------------------------------
[INFO] Scanning for projects...
[WARNING] POM for 'biz.aQute:bndlib:pom:1.50.0:runtime' is invalid.

Its dependencies (if any) will NOT be available to the current build.
[INFO] ------------------------------------------------------------------------
[INFO] Building Apache FontBox
[INFO]    task-segment: [package]
[INFO] ------------------------------------------------------------------------
Downloading: http://localhost:8192/maven2/org/apache/maven/plugins/maven-surefire-plugin/2.9/maven-surefire-plugin-2.9.pom
---------------------------------------------

To subscribe to this information via syndicated feeds:
- RSS: http://vmgump.apache.org/gump/public/pdfbox/fontbox/rss.xml
- Atom: http://vmgump.apache.org/gump/public/pdfbox/fontbox/atom.xml

============================== Gump Tracking Only ===
Produced by Apache Gump(TM) version 2.3.
Gump Run 20130125180006, vmgump.apache.org:vmgump:20130125180006
Gump E-mail Identifier (unique within run) #39.

*********************************************************** G U M P
[GUMP@vmgump]: Project velocity-tools-generic (in module velocity-tools) failed
To whom it may engage...
        
This is an automated request, but not an unsolicited one. For 
more information please visit http://gump.apache.org/nagged.html, 
and/or contact the folk at general@gump.apache.org.

Project velocity-tools-generic has an issue affecting its community integration.
This issue affects 4 projects.
The current state of this project is 'Failed', with reason 'Build Timed Out'.
For reference only, the following projects are affected by this:
    - velocity-tools-generic :  VelocityTools project
    - velocity-tools-generic-test :  VelocityTools project
    - velocity-tools-reactor :  VelocityTools project
    - velocity-tools-view :  VelocityTools project


Full details are available at:
    http://vmgump.apache.org/gump/public/velocity-tools/velocity-tools-generic/index.html

That said, some information snippets are provided here.

The following annotations (debug/informational/warning/error messages) were provided:
 -DEBUG- Sole jar output [velocity-tools-generic-*[0-9T].jar] identifier set to project name
 -DEBUG- (Apache Gump generated) Apache Maven Settings in: /srv/gump/public/workspace/velocity-tools/velocity-tools-generic/gump_mvn_settings.xml
 -INFO- Failed with reason build timed out
 -DEBUG- Maven POM in: /srv/gump/public/workspace/velocity-tools/velocity-tools-generic/pom.xml
 -INFO- Failed to extract fallback artifacts from Gump Repository



The following work was performed:
http://vmgump.apache.org/gump/public/velocity-tools/velocity-tools-generic/gump_work/build_velocity-tools_velocity-tools-generic.html
Work Name: build_velocity-tools_velocity-tools-generic (Type: Build)
Work ended in a state of : Failed
Elapsed: 60 mins
Command Line: /opt/maven2/bin/mvn --batch-mode -DskipTests=true --settings /srv/gump/public/workspace/velocity-tools/velocity-tools-generic/gump_mvn_settings.xml install 
[Working Directory: /srv/gump/public/workspace/velocity-tools/velocity-tools-generic]
M2_HOME: /opt/maven2
---------------------------------------------
[INFO] Scanning for projects...
[INFO] ------------------------------------------------------------------------
[INFO] Building Apache Velocity Tools - Generic tools
[INFO]    task-segment: [install]
[INFO] ------------------------------------------------------------------------
[INFO] [remote-resources:process {execution: default}]
[INFO] snapshot org.apache.velocity:velocity-engine-core:2.0.0-SNAPSHOT: checking for updates from apache.snapshots
[INFO] snapshot org.apache.velocity:velocity-engine-parent:2.0.0-SNAPSHOT: checking for updates from apache.snapshots
Downloading: http://localhost:8192/maven2/commons-beanutils/commons-beanutils/1.8.3/commons-beanutils-1.8.3.pom
10K downloaded  (commons-beanutils-1.8.3.pom)
Downloading: http://localhost:8192/maven2/commons-digester/commons-digester/1.8.1/commons-digester-1.8.1.pom
---------------------------------------------

To subscribe to this information via syndicated feeds:
- RSS: http://vmgump.apache.org/gump/public/velocity-tools/velocity-tools-generic/rss.xml
- Atom: http://vmgump.apache.org/gump/public/velocity-tools/velocity-tools-generic/atom.xml

============================== Gump Tracking Only ===
Produced by Apache Gump(TM) version 2.3.
Gump Run 20130125180006, vmgump.apache.org:vmgump:20130125180006
Gump E-mail Identifier (unique within run) #40.

*********************************************************** G U M P
[GUMP@vmgump]: Project portals-bridges-common (in module portals-bridges) failed
To whom it may engage...
        
This is an automated request, but not an unsolicited one. For 
more information please visit http://gump.apache.org/nagged.html, 
and/or contact the folk at general@gump.apache.org.

Project portals-bridges-common has an issue affecting its community integration.
This issue affects 1 projects.
The current state of this project is 'Failed', with reason 'Build Timed Out'.
For reference only, the following projects are affected by this:
    - portals-bridges-common :  Support for JSR168 compliant Portlet development


Full details are available at:
    http://vmgump.apache.org/gump/public/portals-bridges/portals-bridges-common/index.html

That said, some information snippets are provided here.

The following annotations (debug/informational/warning/error messages) were provided:
 -DEBUG- Sole jar output [portals-bridges-common-*[0-9T].jar] identifier set to project name
 -DEBUG- (Apache Gump generated) Apache Maven Settings in: /srv/gump/public/workspace/portals-bridges/bridges-common/trunk/gump_mvn_settings.xml
 -INFO- Failed with reason build timed out
 -DEBUG- Maven POM in: /srv/gump/public/workspace/portals-bridges/bridges-common/trunk/pom.xml
 -DEBUG- Extracted fallback artifacts from Gump Repository



The following work was performed:
http://vmgump.apache.org/gump/public/portals-bridges/portals-bridges-common/gump_work/build_portals-bridges_portals-bridges-common.html
Work Name: build_portals-bridges_portals-bridges-common (Type: Build)
Work ended in a state of : Failed
Elapsed: 60 mins
Command Line: /opt/maven2/bin/mvn --batch-mode --settings /srv/gump/public/workspace/portals-bridges/bridges-common/trunk/gump_mvn_settings.xml install 
[Working Directory: /srv/gump/public/workspace/portals-bridges/bridges-common/trunk]
M2_HOME: /opt/maven2
---------------------------------------------
[INFO] Scanning for projects...
Downloading: http://localhost:8192/maven2/org/apache/portals/bridges-pom/1.0/bridges-pom-1.0.pom
3K downloaded  (bridges-pom-1.0.pom)
Downloading: http://localhost:8192/maven2/org/apache/portals/portals-pom/1.3/portals-pom-1.3.pom
4K downloaded  (portals-pom-1.3.pom)
[INFO] ------------------------------------------------------------------------
[INFO] Building Apache Portals Bridges Common
[INFO]    task-segment: [install]
[INFO] ------------------------------------------------------------------------
Downloading: http://localhost:8192/maven2/org/apache/maven/plugins/maven-resources-plugin/2.4/maven-resources-plugin-2.4.pom
---------------------------------------------

To subscribe to this information via syndicated feeds:
- RSS: http://vmgump.apache.org/gump/public/portals-bridges/portals-bridges-common/rss.xml
- Atom: http://vmgump.apache.org/gump/public/portals-bridges/portals-bridges-common/atom.xml

============================== Gump Tracking Only ===
Produced by Apache Gump(TM) version 2.3.
Gump Run 20130125180006, vmgump.apache.org:vmgump:20130125180006
Gump E-mail Identifier (unique within run) #41.

*********************************************************** G U M P
[GUMP@vmgump]: Project velocity-engine2-test (in module velocity-engine2) failed
To whom it may engage...
        
This is an automated request, but not an unsolicited one. For 
more information please visit http://gump.apache.org/nagged.html, 
and/or contact the folk at general@gump.apache.org.

Project velocity-engine2-test has an issue affecting its community integration.
This issue affects 1 projects.
The current state of this project is 'Failed', with reason 'Build Timed Out'.
For reference only, the following projects are affected by this:
    - velocity-engine2-test :  Velocity Templating engine


Full details are available at:
    http://vmgump.apache.org/gump/public/velocity-engine2/velocity-engine2-test/index.html

That said, some information snippets are provided here.

The following annotations (debug/informational/warning/error messages) were provided:
 -WARNING- Overriding Maven settings: [/srv/gump/public/workspace/velocity-engine2/gump_mvn_settings.xml]
 -DEBUG- (Apache Gump generated) Apache Maven Settings in: /srv/gump/public/workspace/velocity-engine2/gump_mvn_settings.xml
 -INFO- Failed with reason build timed out
 -DEBUG- Maven POM in: /srv/gump/public/workspace/velocity-engine2/pom.xml



The following work was performed:
http://vmgump.apache.org/gump/public/velocity-engine2/velocity-engine2-test/gump_work/build_velocity-engine2_velocity-engine2-test.html
Work Name: build_velocity-engine2_velocity-engine2-test (Type: Build)
Work ended in a state of : Failed
Elapsed: 60 mins
Command Line: /opt/maven2/bin/mvn --batch-mode --settings /srv/gump/public/workspace/velocity-engine2/gump_mvn_settings.xml install 
[Working Directory: /srv/gump/public/workspace/velocity-engine2]
M2_HOME: /opt/maven2
---------------------------------------------
[INFO] [resources:resources {execution: default-resources}]
[INFO] Using 'UTF-8' encoding to copy filtered resources.
[INFO] Copying 0 resource
[INFO] Copying 3 resources
[INFO] [compiler:compile {execution: default-compile}]
[INFO] Nothing to compile - all classes are up to date
[debug] execute contextualize
[INFO] [resources:testResources {execution: default-testResources}]
[INFO] Using 'UTF-8' encoding to copy filtered resources.
[INFO] Copying 0 resource
[INFO] Copying 3 resources
[INFO] [compiler:testCompile {execution: default-testCompile}]
[INFO] Nothing to compile - all classes are up to date
[INFO] [surefire:test {execution: default-test}]
[INFO] Surefire report directory: /srv/gump/public/workspace/velocity-engine2/velocity-engine-servlet/target/surefire-reports

-------------------------------------------------------
 T E S T S
-------------------------------------------------------

Results :

Tests run: 0, Failures: 0, Errors: 0, Skipped: 0

[INFO] [jar:jar {execution: default-jar}]
[INFO] Building jar: /srv/gump/public/workspace/velocity-engine2/velocity-engine-servlet/target/velocity-engine-servlet-2.0.0-SNAPSHOT.jar
[INFO] [install:install {execution: default-install}]
[INFO] Installing /srv/gump/public/workspace/velocity-engine2/velocity-engine-servlet/target/velocity-engine-servlet-2.0.0-SNAPSHOT.jar to /srv/gump/public/workspace/mvnlocalrepo/velocity/org/apache/velocity/velocity-engine-servlet/2.0.0-SNAPSHOT/velocity-engine-servlet-2.0.0-SNAPSHOT.jar
[INFO] ------------------------------------------------------------------------
[INFO] Building Apache Velocity Engine - SLF4J support
[INFO]    task-segment: [install]
[INFO] ------------------------------------------------------------------------
[INFO] [remote-resources:process {execution: default}]
[debug] execute contextualize
[INFO] [resources:resources {execution: default-resources}]
[INFO] Using 'UTF-8' encoding to copy filtered resources.
[INFO] skip non existing resourceDirectory /srv/gump/public/workspace/velocity-engine2/velocity-engine-slf4j/src/main/resources
[INFO] Copying 3 resources
[INFO] [compiler:compile {execution: default-compile}]
[INFO] Nothing to compile - all classes are up to date
[debug] execute contextualize
[INFO] [resources:testResources {execution: default-testResources}]
[INFO] Using 'UTF-8' encoding to copy filtered resources.
[INFO] skip non existing resourceDirectory /srv/gump/public/workspace/velocity-engine2/velocity-engine-slf4j/src/test/resources
[INFO] Copying 3 resources
[INFO] [compiler:testCompile {execution: default-testCompile}]
[INFO] Compiling 1 source file to /srv/gump/public/workspace/velocity-engine2/velocity-engine-slf4j/target/test-classes
[INFO] [surefire:test {execution: default-test}]
[INFO] Surefire report directory: /srv/gump/public/workspace/velocity-engine2/velocity-engine-slf4j/target/surefire-reports
Downloading: http://localhost:8192/maven2/org/apache/maven/surefire/surefire-junit4/2.9/surefire-junit4-2.9.pom
---------------------------------------------

To subscribe to this information via syndicated feeds:
- RSS: http://vmgump.apache.org/gump/public/velocity-engine2/velocity-engine2-test/rss.xml
- Atom: http://vmgump.apache.org/gump/public/velocity-engine2/velocity-engine2-test/atom.xml

============================== Gump Tracking Only ===
Produced by Apache Gump(TM) version 2.3.
Gump Run 20130125180006, vmgump.apache.org:vmgump:20130125180006
Gump E-mail Identifier (unique within run) #42.

*********************************************************** G U M P
[GUMP@vmgump]: Project directory-junit-addons (in module directory-junit-addons) failed
To whom it may engage...
        
This is an automated request, but not an unsolicited one. For 
more information please visit http://gump.apache.org/nagged.html, 
and/or contact the folk at general@gump.apache.org.

Project directory-junit-addons has an issue affecting its community integration.
This issue affects 102 projects.
The current state of this project is 'Failed', with reason 'Build Timed Out'.
For reference only, the following projects are affected by this:
    - apacheds-all :  Apache Directory Server
    - apacheds-core :  Apache Directory Server
    - apacheds-core-annotations :  Apache Directory Server
    - apacheds-core-annotations-test :  Apache Directory Server
    - apacheds-core-api :  Apache Directory Server
    - apacheds-core-api-test :  Apache Directory Server
    - apacheds-core-avl :  Apache Directory Server
    - apacheds-core-integ :  Apache Directory Server
    - apacheds-core-integ-test :  Apache Directory Server
    - apacheds-core-jndi :  Apache Directory Server
    - apacheds-core-shared :  Apache Directory Server
    - apacheds-core-test :  Apache Directory Server
    - apacheds-http-directory-bridge :  Apache Directory Server
    - apacheds-http-integration :  Apache Directory Server
    - apacheds-i18n :  Apache Directory Server
    - apacheds-interceptor-kerberos :  Apache Directory Server
    - apacheds-interceptors-admin :  Apache Directory Server
    - apacheds-interceptors-admin-test :  Apache Directory Server
    - apacheds-interceptors-authn :  Apache Directory Server
    - apacheds-interceptors-authn-test :  Apache Directory Server
    - apacheds-interceptors-authz :  Apache Directory Server
    - apacheds-interceptors-authz-test :  Apache Directory Server
    - apacheds-interceptors-changelog :  Apache Directory Server
    - apacheds-interceptors-changelog-test :  Apache Directory Server
    - apacheds-interceptors-collective :  Apache Directory Server
    - apacheds-interceptors-collective-test :  Apache Directory Server
    - apacheds-interceptors-event :  Apache Directory Server
    - apacheds-interceptors-event-test :  Apache Directory Server
    - apacheds-interceptors-exception :  Apache Directory Server
    - apacheds-interceptors-exception-test :  Apache Directory Server
    - apacheds-interceptors-hash :  Apache Directory Server
    - apacheds-interceptors-hash-test :  Apache Directory Server
    - apacheds-interceptors-journal :  Apache Directory Server
    - apacheds-interceptors-journal-test :  Apache Directory Server
    - apacheds-interceptors-logger :  Apache Directory Server
    - apacheds-interceptors-logger-test :  Apache Directory Server
    - apacheds-interceptors-normalization :  Apache Directory Server
    - apacheds-interceptors-normalization-test :  Apache Directory Server
    - apacheds-interceptors-operational :  Apache Directory Server
    - apacheds-interceptors-operational-test :  Apache Directory Server
    - apacheds-interceptors-referral :  Apache Directory Server
    - apacheds-interceptors-referral-test :  Apache Directory Server
    - apacheds-interceptors-schema :  Apache Directory Server
    - apacheds-interceptors-schema-test :  Apache Directory Server
    - apacheds-interceptors-subtree :  Apache Directory Server
    - apacheds-interceptors-subtree-test :  Apache Directory Server
    - apacheds-interceptors-trigger :  Apache Directory Server
    - apacheds-interceptors-trigger-test :  Apache Directory Server
    - apacheds-jdbm-partition :  Apache Directory Server
    - apacheds-jdbm-partition-test :  Apache Directory Server
    - apacheds-jdbm1 :  Apache Directory JDBM
    - apacheds-jdbm2 :  Apache Directory JDBM
    - apacheds-kerberos-codec :  Apache Directory Server
    - apacheds-kerberos-test :  Apache Directory Server
    - apacheds-ldap-client-test :  Apache Directory Server
    - apacheds-ldif-partition :  Apache Directory Server
    - apacheds-ldif-partition-test :  Apache Directory Server
    - apacheds-protocol-changepw :  Apache Directory Server
    - apacheds-protocol-dns :  Apache Directory Server
    - apacheds-protocol-kerberos :  Apache Directory Server
    - apacheds-protocol-kerberos-test :  Apache Directory Server
    - apacheds-protocol-ldap :  Apache Directory Server
    - apacheds-protocol-ldap-test :  Apache Directory Server
    - apacheds-protocol-ntp :  Apache Directory Server
    - apacheds-protocol-ntp-test :  Apache Directory Server
    - apacheds-protocol-shared :  Apache Directory Server
    - apacheds-server-annotations :  Apache Directory Server
    - apacheds-server-config :  Apache Directory Server
    - apacheds-server-integ :  Apache Directory Server
    - apacheds-server-integ-test :  Apache Directory Server
    - apacheds-server-jndi :  Apache Directory Server
    - apacheds-service :  Apache Directory Server
    - apacheds-service-builder :  Apache Directory Server
    - apacheds-test-framework :  Apache Directory Server
    - apacheds-wrapper :  Apache Directory Server
    - apacheds-xdbm-partition :  Apache Directory Server
    - apacheds-xdbm-partition-test :  Apache Directory Server
    - api-all :  Shared Apache Directory Libraries
    - api-asn1-api :  Shared Apache Directory Libraries
    - api-asn1-ber :  Shared Apache Directory Libraries
    - api-dsml-engine :  Shared Apache Directory Libraries
    - api-dsml-parser :  Shared Apache Directory Libraries
    - api-i18n :  Shared Apache Directory Libraries
    - api-integ :  Shared Apache Directory Libraries
    - api-ldap-client-all :  Shared Apache Directory Libraries
    - api-ldap-client-api :  Shared Apache Directory Libraries
    - api-ldap-codec-core :  Shared Apache Directory Libraries
    - api-ldap-codec-standalone :  Shared Apache Directory Libraries
    - api-ldap-extras-aci :  Shared Apache Directory Libraries
    - api-ldap-extras-codec :  Shared Apache Directory Libraries
    - api-ldap-extras-codec-api :  Shared Apache Directory Libraries
    - api-ldap-extras-sp :  Shared Apache Directory Libraries
    - api-ldap-extras-trigger :  Shared Apache Directory Libraries
    - api-ldap-extras-util :  Shared Apache Directory Libraries
    - api-ldap-model :  Shared Apache Directory Libraries
    - api-ldap-net-mina :  Shared Apache Directory Libraries
    - api-ldap-schema :  Shared Apache Directory Libraries
    - api-ldap-schema-converter :  Shared Apache Directory Libraries
    - api-ldap-schema-data :  Shared Apache Directory Libraries
    - api-util :  Shared Apache Directory Libraries
    - directory-junit-addons :  Junit Apache Directory Libraries
    - syncrepl :  Apache Directory Server


Full details are available at:
    http://vmgump.apache.org/gump/public/directory-junit-addons/directory-junit-addons/index.html

That said, some information snippets are provided here.

The following annotations (debug/informational/warning/error messages) were provided:
 -INFO- Optional dependency commons-cli failed with reason build timed out
 -INFO- Optional dependency commons-compress failed with reason build timed out
 -WARNING- Overriding Maven settings: [/srv/gump/public/workspace/directory-junit-addons/gump_mvn_settings.xml]
 -DEBUG- (Apache Gump generated) Apache Maven Settings in: /srv/gump/public/workspace/directory-junit-addons/gump_mvn_settings.xml
 -INFO- Failed with reason build timed out
 -DEBUG- Maven POM in: /srv/gump/public/workspace/directory-junit-addons/pom.xml
 -DEBUG- Extracted fallback artifacts from Gump Repository



The following work was performed:
http://vmgump.apache.org/gump/public/directory-junit-addons/directory-junit-addons/gump_work/build_directory-junit-addons_directory-junit-addons.html
Work Name: build_directory-junit-addons_directory-junit-addons (Type: Build)
Work ended in a state of : Failed
Elapsed: 60 mins
Command Line: /opt/maven3/bin/mvn --batch-mode --settings /srv/gump/public/workspace/directory-junit-addons/gump_mvn_settings.xml install 
[Working Directory: /srv/gump/public/workspace/directory-junit-addons]
M2_HOME: /opt/maven3
---------------------------------------------
[INFO] Scanning for projects...
[INFO]                                                                         
[INFO] ------------------------------------------------------------------------
[INFO] Building Apache Directory JUnit Add-ons 0.2-SNAPSHOT
[INFO] ------------------------------------------------------------------------
Downloading: http://localhost:8192/maven2/org/apache/maven/plugins/maven-surefire-plugin/2.12.2/maven-surefire-plugin-2.12.2.pom
---------------------------------------------

To subscribe to this information via syndicated feeds:
- RSS: http://vmgump.apache.org/gump/public/directory-junit-addons/directory-junit-addons/rss.xml
- Atom: http://vmgump.apache.org/gump/public/directory-junit-addons/directory-junit-addons/atom.xml

============================== Gump Tracking Only ===
Produced by Apache Gump(TM) version 2.3.
Gump Run 20130125180006, vmgump.apache.org:vmgump:20130125180006
Gump E-mail Identifier (unique within run) #43.

*********************************************************** G U M P
[GUMP@vmgump]: Project doxia-core (in module doxia) failed
To whom it may engage...
        
This is an automated request, but not an unsolicited one. For 
more information please visit http://gump.apache.org/nagged.html, 
and/or contact the folk at general@gump.apache.org.

Project doxia-core has an issue affecting its community integration.
This issue affects 1 projects.
The current state of this project is 'Failed', with reason 'Build Timed Out'.
For reference only, the following projects are affected by this:
    - doxia-core :  A content generation framework which aims to provide its use...


Full details are available at:
    http://vmgump.apache.org/gump/public/doxia/doxia-core/index.html

That said, some information snippets are provided here.

The following annotations (debug/informational/warning/error messages) were provided:
 -DEBUG- Sole jar output [doxia-core-*[0-9T].jar] identifier set to project name
 -DEBUG- Sole testsjar output [doxia-core-*[0-9T]-tests.jar] identifier set to project name
 -INFO- Optional dependency doxia-logging-api failed with reason build timed out
 -INFO- Optional dependency doxia-sink-api prerequisite failed with reason build timed out
 -DEBUG- (Apache Gump generated) Apache Maven Settings in: /srv/gump/public/workspace/doxia/doxia/doxia-core/gump_mvn_settings.xml
 -INFO- Failed with reason build timed out
 -DEBUG- Maven POM in: /srv/gump/public/workspace/doxia/doxia/doxia-core/pom.xml
 -DEBUG- Extracted fallback artifacts from Gump Repository



The following work was performed:
http://vmgump.apache.org/gump/public/doxia/doxia-core/gump_work/build_doxia_doxia-core.html
Work Name: build_doxia_doxia-core (Type: Build)
Work ended in a state of : Failed
Elapsed: 60 mins
Command Line: /opt/maven2/bin/mvn --batch-mode --settings /srv/gump/public/workspace/doxia/doxia/doxia-core/gump_mvn_settings.xml install 
[Working Directory: /srv/gump/public/workspace/doxia/doxia/doxia-core]
M2_HOME: /opt/maven2
---------------------------------------------
[INFO] Scanning for projects...
[INFO] ------------------------------------------------------------------------
[INFO] Building Doxia :: Core
[INFO]    task-segment: [install]
[INFO] ------------------------------------------------------------------------
Downloading: http://localhost:8192/maven2/org/apache/maven/plugins/maven-resources-plugin/2.6/maven-resources-plugin-2.6.pom
---------------------------------------------

To subscribe to this information via syndicated feeds:
- RSS: http://vmgump.apache.org/gump/public/doxia/doxia-core/rss.xml
- Atom: http://vmgump.apache.org/gump/public/doxia/doxia-core/atom.xml

============================== Gump Tracking Only ===
Produced by Apache Gump(TM) version 2.3.
Gump Run 20130125180006, vmgump.apache.org:vmgump:20130125180006
Gump E-mail Identifier (unique within run) #44.

*********************************************************** G U M P
[GUMP@vmgump]: Project google-guava (in module google-guava) failed
To whom it may engage...
        
This is an automated request, but not an unsolicited one. For 
more information please visit http://gump.apache.org/nagged.html, 
and/or contact the folk at general@gump.apache.org.

Project google-guava has an issue affecting its community integration.
This issue affects 4 projects.
The current state of this project is 'Failed', with reason 'Build Timed Out'.
For reference only, the following projects are affected by this:
    - google-guava :  Guava is a suite of core and expanded libraries that include...
    - google-guava-reactor :  Guava is a suite of core and expanded libraries that include...
    - jython :  Java Python
    - jython-in-jython :  Java Python


Full details are available at:
    http://vmgump.apache.org/gump/public/google-guava/google-guava/index.html

That said, some information snippets are provided here.

The following annotations (debug/informational/warning/error messages) were provided:
 -DEBUG- (Apache Gump generated) Apache Maven Settings in: /srv/gump/public/workspace/google-guava/guava/gump_mvn_settings.xml
 -INFO- Failed with reason build timed out
 -DEBUG- Maven POM in: /srv/gump/public/workspace/google-guava/guava/pom.xml
 -DEBUG- Extracted fallback artifacts from Gump Repository



The following work was performed:
http://vmgump.apache.org/gump/public/google-guava/google-guava/gump_work/build_google-guava_google-guava.html
Work Name: build_google-guava_google-guava (Type: Build)
Work ended in a state of : Failed
Elapsed: 60 mins
Command Line: /opt/maven3/bin/mvn --batch-mode --settings /srv/gump/public/workspace/google-guava/guava/gump_mvn_settings.xml package 
[Working Directory: /srv/gump/public/workspace/google-guava/guava]
M2_HOME: /opt/maven3
---------------------------------------------
[INFO] Scanning for projects...
[WARNING] 
[WARNING] Some problems were encountered while building the effective model for com.google.guava:guava:bundle:14.0-SNAPSHOT
[WARNING] 'build.plugins.plugin.(groupId:artifactId)' must be unique but found duplicate declaration of plugin org.apache.maven.plugins:maven-javadoc-plugin @ line 113, column 15
[WARNING] 
[WARNING] It is highly recommended to fix these problems because they threaten the stability of your build.
[WARNING] 
[WARNING] For this reason, future Maven versions might no longer support building such malformed projects.
[WARNING] 
[INFO]                                                                         
[INFO] ------------------------------------------------------------------------
[INFO] Building Guava: Google Core Libraries for Java 14.0-SNAPSHOT
[INFO] ------------------------------------------------------------------------
Downloading: http://localhost:8192/maven2/org/apache/maven/plugins/maven-resources-plugin/maven-metadata.xml
---------------------------------------------

To subscribe to this information via syndicated feeds:
- RSS: http://vmgump.apache.org/gump/public/google-guava/google-guava/rss.xml
- Atom: http://vmgump.apache.org/gump/public/google-guava/google-guava/atom.xml

============================== Gump Tracking Only ===
Produced by Apache Gump(TM) version 2.3.
Gump Run 20130125180006, vmgump.apache.org:vmgump:20130125180006
Gump E-mail Identifier (unique within run) #45.

*********************************************************** G U M P
[GUMP@vmgump]: Project doxia-decoration-model (in module doxia) failed
To whom it may engage...
        
This is an automated request, but not an unsolicited one. For 
more information please visit http://gump.apache.org/nagged.html, 
and/or contact the folk at general@gump.apache.org.

Project doxia-decoration-model has an issue affecting its community integration.
This issue affects 1 projects.
The current state of this project is 'Failed', with reason 'Build Timed Out'.
For reference only, the following projects are affected by this:
    - doxia-decoration-model :  A content generation framework which aims to provide its use...


Full details are available at:
    http://vmgump.apache.org/gump/public/doxia/doxia-decoration-model/index.html

That said, some information snippets are provided here.

The following annotations (debug/informational/warning/error messages) were provided:
 -DEBUG- Sole jar output [doxia-decoration-model-*[0-9T].jar] identifier set to project name
 -INFO- Optional dependency doxia-core failed with reason build timed out
 -DEBUG- (Apache Gump generated) Apache Maven Settings in: /srv/gump/public/workspace/doxia/doxia-sitetools/doxia-decoration-model/gump_mvn_settings.xml
 -INFO- Failed with reason build timed out
 -DEBUG- Maven POM in: /srv/gump/public/workspace/doxia/doxia-sitetools/doxia-decoration-model/pom.xml
 -DEBUG- Extracted fallback artifacts from Gump Repository



The following work was performed:
http://vmgump.apache.org/gump/public/doxia/doxia-decoration-model/gump_work/build_doxia_doxia-decoration-model.html
Work Name: build_doxia_doxia-decoration-model (Type: Build)
Work ended in a state of : Failed
Elapsed: 60 mins
Command Line: /opt/maven2/bin/mvn --batch-mode --settings /srv/gump/public/workspace/doxia/doxia-sitetools/doxia-decoration-model/gump_mvn_settings.xml install 
[Working Directory: /srv/gump/public/workspace/doxia/doxia-sitetools/doxia-decoration-model]
M2_HOME: /opt/maven2
---------------------------------------------
[INFO] Scanning for projects...
[INFO] ------------------------------------------------------------------------
[INFO] Building Doxia :: Decoration Model
[INFO]    task-segment: [install]
[INFO] ------------------------------------------------------------------------
Downloading: http://localhost:8192/maven2/org/apache/maven/plugins/maven-resources-plugin/2.6/maven-resources-plugin-2.6.pom
---------------------------------------------

To subscribe to this information via syndicated feeds:
- RSS: http://vmgump.apache.org/gump/public/doxia/doxia-decoration-model/rss.xml
- Atom: http://vmgump.apache.org/gump/public/doxia/doxia-decoration-model/atom.xml

============================== Gump Tracking Only ===
Produced by Apache Gump(TM) version 2.3.
Gump Run 20130125180006, vmgump.apache.org:vmgump:20130125180006
Gump E-mail Identifier (unique within run) #46.

*********************************************************** G U M P
[GUMP@vmgump]: Project doxia-module-docbook-simple (in module doxia) failed
To whom it may engage...
        
This is an automated request, but not an unsolicited one. For 
more information please visit http://gump.apache.org/nagged.html, 
and/or contact the folk at general@gump.apache.org.

Project doxia-module-docbook-simple has an issue affecting its community integration.
This issue affects 1 projects.
The current state of this project is 'Failed', with reason 'Build Timed Out'.
For reference only, the following projects are affected by this:
    - doxia-module-docbook-simple :  A content generation framework which aims to provide its use...


Full details are available at:
    http://vmgump.apache.org/gump/public/doxia/doxia-module-docbook-simple/index.html

That said, some information snippets are provided here.

The following annotations (debug/informational/warning/error messages) were provided:
 -DEBUG- Sole jar output [doxia-module-docbook-simple-*[0-9T].jar] identifier set to project name
 -DEBUG- (Apache Gump generated) Apache Maven Settings in: /srv/gump/public/workspace/doxia/doxia/doxia-modules/doxia-module-docbook-simple/gump_mvn_settings.xml
 -INFO- Failed with reason build timed out
 -DEBUG- Maven POM in: /srv/gump/public/workspace/doxia/doxia/doxia-modules/doxia-module-docbook-simple/pom.xml
 -INFO- Failed to extract fallback artifacts from Gump Repository



The following work was performed:
http://vmgump.apache.org/gump/public/doxia/doxia-module-docbook-simple/gump_work/build_doxia_doxia-module-docbook-simple.html
Work Name: build_doxia_doxia-module-docbook-simple (Type: Build)
Work ended in a state of : Failed
Elapsed: 60 mins
Command Line: /opt/maven2/bin/mvn --batch-mode --settings /srv/gump/public/workspace/doxia/doxia/doxia-modules/doxia-module-docbook-simple/gump_mvn_settings.xml install 
[Working Directory: /srv/gump/public/workspace/doxia/doxia/doxia-modules/doxia-module-docbook-simple]
M2_HOME: /opt/maven2
---------------------------------------------
[INFO] Scanning for projects...
[INFO] ------------------------------------------------------------------------
[INFO] Building Doxia :: Simplified DocBook Module
[INFO]    task-segment: [install]
[INFO] ------------------------------------------------------------------------
Downloading: http://localhost:8192/maven2/org/apache/maven/plugins/maven-resources-plugin/2.6/maven-resources-plugin-2.6.pom
---------------------------------------------

To subscribe to this information via syndicated feeds:
- RSS: http://vmgump.apache.org/gump/public/doxia/doxia-module-docbook-simple/rss.xml
- Atom: http://vmgump.apache.org/gump/public/doxia/doxia-module-docbook-simple/atom.xml

============================== Gump Tracking Only ===
Produced by Apache Gump(TM) version 2.3.
Gump Run 20130125180006, vmgump.apache.org:vmgump:20130125180006
Gump E-mail Identifier (unique within run) #47.

*********************************************************** G U M P
[GUMP@vmgump]: Project doxia-test-docs (in module doxia) failed
To whom it may engage...
        
This is an automated request, but not an unsolicited one. For 
more information please visit http://gump.apache.org/nagged.html, 
and/or contact the folk at general@gump.apache.org.

Project doxia-test-docs has an issue affecting its community integration.
This issue affects 1 projects.
The current state of this project is 'Failed', with reason 'Build Timed Out'.
For reference only, the following projects are affected by this:
    - doxia-test-docs :  A content generation framework which aims to provide its use...


Full details are available at:
    http://vmgump.apache.org/gump/public/doxia/doxia-test-docs/index.html

That said, some information snippets are provided here.

The following annotations (debug/informational/warning/error messages) were provided:
 -DEBUG- Sole jar output [doxia-test-docs-*[0-9T].jar] identifier set to project name
 -INFO- Optional dependency doxia-core failed with reason build timed out
 -DEBUG- (Apache Gump generated) Apache Maven Settings in: /srv/gump/public/workspace/doxia/doxia/doxia-test-docs/gump_mvn_settings.xml
 -INFO- Failed with reason build timed out
 -DEBUG- Maven POM in: /srv/gump/public/workspace/doxia/doxia/doxia-test-docs/pom.xml
 -DEBUG- Extracted fallback artifacts from Gump Repository



The following work was performed:
http://vmgump.apache.org/gump/public/doxia/doxia-test-docs/gump_work/build_doxia_doxia-test-docs.html
Work Name: build_doxia_doxia-test-docs (Type: Build)
Work ended in a state of : Failed
Elapsed: 60 mins
Command Line: /opt/maven2/bin/mvn --batch-mode --settings /srv/gump/public/workspace/doxia/doxia/doxia-test-docs/gump_mvn_settings.xml install 
[Working Directory: /srv/gump/public/workspace/doxia/doxia/doxia-test-docs]
M2_HOME: /opt/maven2
---------------------------------------------
[INFO] Scanning for projects...
[INFO] ------------------------------------------------------------------------
[INFO] Building Doxia :: Test Documents
[INFO]    task-segment: [install]
[INFO] ------------------------------------------------------------------------
Downloading: http://localhost:8192/maven2/org/apache/maven/plugins/maven-resources-plugin/2.6/maven-resources-plugin-2.6.pom
---------------------------------------------

To subscribe to this information via syndicated feeds:
- RSS: http://vmgump.apache.org/gump/public/doxia/doxia-test-docs/rss.xml
- Atom: http://vmgump.apache.org/gump/public/doxia/doxia-test-docs/atom.xml

============================== Gump Tracking Only ===
Produced by Apache Gump(TM) version 2.3.
Gump Run 20130125180006, vmgump.apache.org:vmgump:20130125180006
Gump E-mail Identifier (unique within run) #48.

*********************************************************** G U M P
[GUMP@vmgump]: Project doxia-module-xhtml (in module doxia) failed
To whom it may engage...
        
This is an automated request, but not an unsolicited one. For 
more information please visit http://gump.apache.org/nagged.html, 
and/or contact the folk at general@gump.apache.org.

Project doxia-module-xhtml has an issue affecting its community integration.
This issue affects 1 projects.
The current state of this project is 'Failed', with reason 'Build Timed Out'.
For reference only, the following projects are affected by this:
    - doxia-module-xhtml :  A content generation framework which aims to provide its use...


Full details are available at:
    http://vmgump.apache.org/gump/public/doxia/doxia-module-xhtml/index.html

That said, some information snippets are provided here.

The following annotations (debug/informational/warning/error messages) were provided:
 -DEBUG- Sole jar output [doxia-module-xhtml-*[0-9T].jar] identifier set to project name
 -DEBUG- (Apache Gump generated) Apache Maven Settings in: /srv/gump/public/workspace/doxia/doxia/doxia-modules/doxia-module-xhtml/gump_mvn_settings.xml
 -INFO- Failed with reason build timed out
 -DEBUG- Maven POM in: /srv/gump/public/workspace/doxia/doxia/doxia-modules/doxia-module-xhtml/pom.xml
 -INFO- Failed to extract fallback artifacts from Gump Repository



The following work was performed:
http://vmgump.apache.org/gump/public/doxia/doxia-module-xhtml/gump_work/build_doxia_doxia-module-xhtml.html
Work Name: build_doxia_doxia-module-xhtml (Type: Build)
Work ended in a state of : Failed
Elapsed: 60 mins
Command Line: /opt/maven2/bin/mvn --batch-mode --settings /srv/gump/public/workspace/doxia/doxia/doxia-modules/doxia-module-xhtml/gump_mvn_settings.xml install 
[Working Directory: /srv/gump/public/workspace/doxia/doxia/doxia-modules/doxia-module-xhtml]
M2_HOME: /opt/maven2
---------------------------------------------
[INFO] Scanning for projects...
[INFO] ------------------------------------------------------------------------
[INFO] Building Doxia :: XHTML Module
[INFO]    task-segment: [install]
[INFO] ------------------------------------------------------------------------
Downloading: http://localhost:8192/maven2/org/apache/maven/plugins/maven-resources-plugin/2.6/maven-resources-plugin-2.6.pom
---------------------------------------------

To subscribe to this information via syndicated feeds:
- RSS: http://vmgump.apache.org/gump/public/doxia/doxia-module-xhtml/rss.xml
- Atom: http://vmgump.apache.org/gump/public/doxia/doxia-module-xhtml/atom.xml

============================== Gump Tracking Only ===
Produced by Apache Gump(TM) version 2.3.
Gump Run 20130125180006, vmgump.apache.org:vmgump:20130125180006
Gump E-mail Identifier (unique within run) #49.

*********************************************************** G U M P
[GUMP@vmgump]: Project cocoon22-pipeline-impl (in module cocoon) failed
To whom it may engage...
        
This is an automated request, but not an unsolicited one. For 
more information please visit http://gump.apache.org/nagged.html, 
and/or contact the folk at general@gump.apache.org.

Project cocoon22-pipeline-impl has an issue affecting its community integration.
This issue affects 5 projects.
The current state of this project is 'Failed', with reason 'Build Timed Out'.
For reference only, the following projects are affected by this:
    - cocoon22-pipeline-components :  Java XML Framework
    - cocoon22-pipeline-impl :  Java XML Framework
    - cocoon22-pipeline-impl-test :  Java XML Framework
    - cocoon22-sitemap-components :  Java XML Framework
    - cocoon22-sitemap-impl :  Java XML Framework


Full details are available at:
    http://vmgump.apache.org/gump/public/cocoon/cocoon22-pipeline-impl/index.html

That said, some information snippets are provided here.

The following annotations (debug/informational/warning/error messages) were provided:
 -INFO- Optional dependency cocoon22-pipeline-api failed with reason build timed out
 -INFO- Optional dependency cocoon22-util failed with reason build timed out
 -DEBUG- (Apache Gump generated) Apache Maven Settings in: /srv/gump/public/workspace/cocoon/core/cocoon-pipeline/cocoon-pipeline-impl/gump_mvn_settings.xml
 -INFO- Failed with reason build timed out
 -DEBUG- Maven POM in: /srv/gump/public/workspace/cocoon/core/cocoon-pipeline/cocoon-pipeline-impl/pom.xml
 -DEBUG- Extracted fallback artifacts from Gump Repository



The following work was performed:
http://vmgump.apache.org/gump/public/cocoon/cocoon22-pipeline-impl/gump_work/build_cocoon_cocoon22-pipeline-impl.html
Work Name: build_cocoon_cocoon22-pipeline-impl (Type: Build)
Work ended in a state of : Failed
Elapsed: 1 hour 2 secs
Command Line: /opt/maven2/bin/mvn --batch-mode -Dmaven.test.skip.exec=true --settings /srv/gump/public/workspace/cocoon/core/cocoon-pipeline/cocoon-pipeline-impl/gump_mvn_settings.xml install 
[Working Directory: /srv/gump/public/workspace/cocoon/core/cocoon-pipeline/cocoon-pipeline-impl]
M2_HOME: /opt/maven2
---------------------------------------------
[INFO] Scanning for projects...
[INFO] ------------------------------------------------------------------------
[INFO] Building Cocoon Pipeline Implementation
[INFO]    task-segment: [install]
[INFO] ------------------------------------------------------------------------
[INFO] snapshot org.apache.cocoon:cocoon-pipeline-api:1.1.0-SNAPSHOT: checking for updates from apache.snapshots
Downloading: http://localhost:8192/repo/m2-snapshot-repository/org/apache/cocoon/cocoon-pipeline-api/1.1.0-SNAPSHOT/cocoon-pipeline-api-1.1.0-SNAPSHOT.pom
[INFO] Unable to find resource 'org.apache.cocoon:cocoon-pipeline-api:pom:1.1.0-SNAPSHOT' in repository apache.snapshots (http://repository.apache.org/snapshots)
Downloading: http://localhost:8192/maven2/org/apache/cocoon/cocoon-configuration-api/1.0.2/cocoon-configuration-api-1.0.2.pom
---------------------------------------------

To subscribe to this information via syndicated feeds:
- RSS: http://vmgump.apache.org/gump/public/cocoon/cocoon22-pipeline-impl/rss.xml
- Atom: http://vmgump.apache.org/gump/public/cocoon/cocoon22-pipeline-impl/atom.xml

============================== Gump Tracking Only ===
Produced by Apache Gump(TM) version 2.3.
Gump Run 20130125180006, vmgump.apache.org:vmgump:20130125180006
Gump E-mail Identifier (unique within run) #50.

*********************************************************** G U M P
[GUMP@vmgump]: Project cocoon22-xml-resolver (in module cocoon) failed
To whom it may engage...
        
This is an automated request, but not an unsolicited one. For 
more information please visit http://gump.apache.org/nagged.html, 
and/or contact the folk at general@gump.apache.org.

Project cocoon22-xml-resolver has an issue affecting its community integration.
This issue affects 1 projects.
The current state of this project is 'Failed', with reason 'Build Timed Out'.
For reference only, the following projects are affected by this:
    - cocoon22-xml-resolver :  Java XML Framework


Full details are available at:
    http://vmgump.apache.org/gump/public/cocoon/cocoon22-xml-resolver/index.html

That said, some information snippets are provided here.

The following annotations (debug/informational/warning/error messages) were provided:
 -INFO- Optional dependency cocoon22-xml-impl failed with reason build timed out
 -INFO- Optional dependency cocoon22-spring-configurator failed with reason build timed out
 -DEBUG- (Apache Gump generated) Apache Maven Settings in: /srv/gump/public/workspace/cocoon/core/cocoon-xml/cocoon-xml-resolver/gump_mvn_settings.xml
 -INFO- Failed with reason build timed out
 -DEBUG- Maven POM in: /srv/gump/public/workspace/cocoon/core/cocoon-xml/cocoon-xml-resolver/pom.xml
 -DEBUG- Extracted fallback artifacts from Gump Repository



The following work was performed:
http://vmgump.apache.org/gump/public/cocoon/cocoon22-xml-resolver/gump_work/build_cocoon_cocoon22-xml-resolver.html
Work Name: build_cocoon_cocoon22-xml-resolver (Type: Build)
Work ended in a state of : Failed
Elapsed: 1 hour 1 sec
Command Line: /opt/maven2/bin/mvn --batch-mode --settings /srv/gump/public/workspace/cocoon/core/cocoon-xml/cocoon-xml-resolver/gump_mvn_settings.xml install 
[Working Directory: /srv/gump/public/workspace/cocoon/core/cocoon-xml/cocoon-xml-resolver]
M2_HOME: /opt/maven2
---------------------------------------------
[INFO] Scanning for projects...
[INFO] ------------------------------------------------------------------------
[INFO] Building Cocoon XML Resolver
[INFO]    task-segment: [install]
[INFO] ------------------------------------------------------------------------
Downloading: http://localhost:8192/maven2/org/apache/cocoon/cocoon-spring-configurator/2.1.0/cocoon-spring-configurator-2.1.0.pom
---------------------------------------------

To subscribe to this information via syndicated feeds:
- RSS: http://vmgump.apache.org/gump/public/cocoon/cocoon22-xml-resolver/rss.xml
- Atom: http://vmgump.apache.org/gump/public/cocoon/cocoon22-xml-resolver/atom.xml

============================== Gump Tracking Only ===
Produced by Apache Gump(TM) version 2.3.
Gump Run 20130125180006, vmgump.apache.org:vmgump:20130125180006
Gump E-mail Identifier (unique within run) #51.

*********************************************************** G U M P
[GUMP@vmgump]: Project checkstyle (in module checkstyle) failed
To whom it may engage...
        
This is an automated request, but not an unsolicited one. For 
more information please visit http://gump.apache.org/nagged.html, 
and/or contact the folk at general@gump.apache.org.

Project checkstyle has an issue affecting its community integration.
This issue affects 4 projects.
The current state of this project is 'Failed', with reason 'Build Timed Out'.
For reference only, the following projects are affected by this:
    - checkstyle :  Java style checker
    - checkstyle-test :  Java style checker
    - tomcat-tc7.0.x-validate :  Tomcat 7.x, a web server implementing Java Servlet 3.0,
    ...
    - tomcat-trunk-validate :  Tomcat 8.x, a web server implementing Java Servlet 3.1,
    ...


Full details are available at:
    http://vmgump.apache.org/gump/public/checkstyle/checkstyle/index.html

That said, some information snippets are provided here.

The following annotations (debug/informational/warning/error messages) were provided:
 -INFO- Optional dependency commons-cli failed with reason build timed out
 -INFO- Optional dependency google-guava failed with reason build timed out
 -DEBUG- (Apache Gump generated) Apache Maven Settings in: /srv/gump/public/workspace/checkstyle/gump_mvn_settings.xml
 -INFO- Failed with reason build timed out
 -DEBUG- Maven POM in: /srv/gump/public/workspace/checkstyle/pom.xml
 -INFO- Failed to extract fallback artifacts from Gump Repository



The following work was performed:
http://vmgump.apache.org/gump/public/checkstyle/checkstyle/gump_work/build_checkstyle_checkstyle.html
Work Name: build_checkstyle_checkstyle (Type: Build)
Work ended in a state of : Failed
Elapsed: 60 mins
Command Line: /opt/maven3/bin/mvn --batch-mode -DskipTests=true --settings /srv/gump/public/workspace/checkstyle/gump_mvn_settings.xml install 
[Working Directory: /srv/gump/public/workspace/checkstyle]
M2_HOME: /opt/maven3
---------------------------------------------
[INFO] Scanning for projects...
[INFO]                                                                         
[INFO] ------------------------------------------------------------------------
[INFO] Building checkstyle 5.7-SNAPSHOT
[INFO] ------------------------------------------------------------------------
Downloading: http://localhost:8192/maven2/org/codehaus/mojo/antlr-maven-plugin/2.2/antlr-maven-plugin-2.2.pom
---------------------------------------------

To subscribe to this information via syndicated feeds:
- RSS: http://vmgump.apache.org/gump/public/checkstyle/checkstyle/rss.xml
- Atom: http://vmgump.apache.org/gump/public/checkstyle/checkstyle/atom.xml

============================== Gump Tracking Only ===
Produced by Apache Gump(TM) version 2.3.
Gump Run 20130125180006, vmgump.apache.org:vmgump:20130125180006
Gump E-mail Identifier (unique within run) #52.

*********************************************************** G U M P
[GUMP@vmgump]: Project jempbox (in module pdfbox) failed
To whom it may engage...
        
This is an automated request, but not an unsolicited one. For 
more information please visit http://gump.apache.org/nagged.html, 
and/or contact the folk at general@gump.apache.org.

Project jempbox has an issue affecting its community integration.
This issue affects 1 projects.
The current state of this project is 'Failed', with reason 'Build Timed Out'.
For reference only, the following projects are affected by this:
    - jempbox :  Apache PDFBox is an open source Java PDF library for working...


Full details are available at:
    http://vmgump.apache.org/gump/public/pdfbox/jempbox/index.html

That said, some information snippets are provided here.

The following annotations (debug/informational/warning/error messages) were provided:
 -DEBUG- Sole jar output [jempbox-*[0-9T].jar] identifier set to project name
 -DEBUG- (Apache Gump generated) Apache Maven Settings in: /srv/gump/public/workspace/pdfbox/jempbox/gump_mvn_settings.xml
 -INFO- Failed with reason build timed out
 -DEBUG- Maven POM in: /srv/gump/public/workspace/pdfbox/jempbox/pom.xml
 -DEBUG- Extracted fallback artifacts from Gump Repository



The following work was performed:
http://vmgump.apache.org/gump/public/pdfbox/jempbox/gump_work/build_pdfbox_jempbox.html
Work Name: build_pdfbox_jempbox (Type: Build)
Work ended in a state of : Failed
Elapsed: 60 mins
Command Line: /opt/maven2/bin/mvn --batch-mode --settings /srv/gump/public/workspace/pdfbox/jempbox/gump_mvn_settings.xml package 
[Working Directory: /srv/gump/public/workspace/pdfbox/jempbox]
M2_HOME: /opt/maven2
---------------------------------------------
[INFO] Scanning for projects...
[WARNING] POM for 'biz.aQute:bndlib:pom:1.50.0:runtime' is invalid.

Its dependencies (if any) will NOT be available to the current build.
[INFO] ------------------------------------------------------------------------
[INFO] Building Apache JempBox
[INFO]    task-segment: [package]
[INFO] ------------------------------------------------------------------------
Downloading: http://localhost:8192/maven2/org/apache/maven/plugins/maven-surefire-plugin/2.9/maven-surefire-plugin-2.9.pom
---------------------------------------------

To subscribe to this information via syndicated feeds:
- RSS: http://vmgump.apache.org/gump/public/pdfbox/jempbox/rss.xml
- Atom: http://vmgump.apache.org/gump/public/pdfbox/jempbox/atom.xml

============================== Gump Tracking Only ===
Produced by Apache Gump(TM) version 2.3.
Gump Run 20130125180006, vmgump.apache.org:vmgump:20130125180006
Gump E-mail Identifier (unique within run) #53.

*********************************************************** G U M P
[GUMP@vmgump]: Project msv-core (in module msv) failed
To whom it may engage...
        
This is an automated request, but not an unsolicited one. For 
more information please visit http://gump.apache.org/nagged.html, 
and/or contact the folk at general@gump.apache.org.

Project msv-core has an issue affecting its community integration.
This issue affects 2 projects.
The current state of this project is 'Failed', with reason 'Build Timed Out'.
For reference only, the following projects are affected by this:
    - msv-core :  Sun Multi-Schema XML Validator
    - msv_msv :  Sun Multi-Schema XML Validator


Full details are available at:
    http://vmgump.apache.org/gump/public/msv/msv-core/index.html

That said, some information snippets are provided here.

The following annotations (debug/informational/warning/error messages) were provided:
 -DEBUG- Sole jar output [msv-core-*[0-9T].jar] identifier set to project name
 -DEBUG- (Apache Gump generated) Apache Maven Settings in: /srv/gump/public/workspace/msv/msv/gump_mvn_settings.xml
 -INFO- Failed with reason build timed out
 -DEBUG- Maven POM in: /srv/gump/public/workspace/msv/msv/pom.xml
 -INFO- Failed to extract fallback artifacts from Gump Repository



The following work was performed:
http://vmgump.apache.org/gump/public/msv/msv-core/gump_work/build_msv_msv-core.html
Work Name: build_msv_msv-core (Type: Build)
Work ended in a state of : Failed
Elapsed: 60 mins
Command Line: /opt/maven3/bin/mvn --batch-mode --settings /srv/gump/public/workspace/msv/msv/gump_mvn_settings.xml install 
[Working Directory: /srv/gump/public/workspace/msv/msv]
M2_HOME: /opt/maven3
---------------------------------------------
[INFO] Scanning for projects...
[INFO]                                                                         
[INFO] ------------------------------------------------------------------------
[INFO] Building MSV Core 2011.2-SNAPSHOT
[INFO] ------------------------------------------------------------------------
Downloading: http://localhost:8192/content/repositories/snapshots/com/sun/msv/datatype/xsd/xsdlib/2011.2-SNAPSHOT/maven-metadata.xml
Downloading: http://localhost:8192/content/repositories/snapshots/net/java/dev/msv/msv/2011.2-SNAPSHOT/maven-metadata.xml
Downloading: http://localhost:8192/content/repositories/snapshots/net/java/dev/msv/msv-testharness/2011.2-SNAPSHOT/maven-metadata.xml
Downloading: http://localhost:8192/maven2/xml-resolver/xml-resolver/1.2/xml-resolver-1.2.pom
---------------------------------------------

To subscribe to this information via syndicated feeds:
- RSS: http://vmgump.apache.org/gump/public/msv/msv-core/rss.xml
- Atom: http://vmgump.apache.org/gump/public/msv/msv-core/atom.xml

============================== Gump Tracking Only ===
Produced by Apache Gump(TM) version 2.3.
Gump Run 20130125180006, vmgump.apache.org:vmgump:20130125180006
Gump E-mail Identifier (unique within run) #56.

*********************************************************** G U M P
[GUMP@vmgump]: Project doxia-module-apt (in module doxia) failed
To whom it may engage...
        
This is an automated request, but not an unsolicited one. For 
more information please visit http://gump.apache.org/nagged.html, 
and/or contact the folk at general@gump.apache.org.

Project doxia-module-apt has an issue affecting its community integration.
This issue affects 1 projects.
The current state of this project is 'Failed', with reason 'Build Timed Out'.
For reference only, the following projects are affected by this:
    - doxia-module-apt :  A content generation framework which aims to provide its use...


Full details are available at:
    http://vmgump.apache.org/gump/public/doxia/doxia-module-apt/index.html

That said, some information snippets are provided here.

The following annotations (debug/informational/warning/error messages) were provided:
 -DEBUG- Sole jar output [doxia-module-apt-*[0-9T].jar] identifier set to project name
 -DEBUG- (Apache Gump generated) Apache Maven Settings in: /srv/gump/public/workspace/doxia/doxia/doxia-modules/doxia-module-apt/gump_mvn_settings.xml
 -INFO- Failed with reason build timed out
 -DEBUG- Maven POM in: /srv/gump/public/workspace/doxia/doxia/doxia-modules/doxia-module-apt/pom.xml
 -INFO- Failed to extract fallback artifacts from Gump Repository



The following work was performed:
http://vmgump.apache.org/gump/public/doxia/doxia-module-apt/gump_work/build_doxia_doxia-module-apt.html
Work Name: build_doxia_doxia-module-apt (Type: Build)
Work ended in a state of : Failed
Elapsed: 60 mins
Command Line: /opt/maven2/bin/mvn --batch-mode --settings /srv/gump/public/workspace/doxia/doxia/doxia-modules/doxia-module-apt/gump_mvn_settings.xml install 
[Working Directory: /srv/gump/public/workspace/doxia/doxia/doxia-modules/doxia-module-apt]
M2_HOME: /opt/maven2
---------------------------------------------
[INFO] Scanning for projects...
[INFO] ------------------------------------------------------------------------
[INFO] Building Doxia :: APT Module
[INFO]    task-segment: [install]
[INFO] ------------------------------------------------------------------------
Downloading: http://localhost:8192/maven2/org/apache/maven/plugins/maven-resources-plugin/2.6/maven-resources-plugin-2.6.pom
---------------------------------------------

To subscribe to this information via syndicated feeds:
- RSS: http://vmgump.apache.org/gump/public/doxia/doxia-module-apt/rss.xml
- Atom: http://vmgump.apache.org/gump/public/doxia/doxia-module-apt/atom.xml

============================== Gump Tracking Only ===
Produced by Apache Gump(TM) version 2.3.
Gump Run 20130125180006, vmgump.apache.org:vmgump:20130125180006
Gump E-mail Identifier (unique within run) #57.

*********************************************************** G U M P
[GUMP@vmgump]: Project doxia-module-fml (in module doxia) failed
To whom it may engage...
        
This is an automated request, but not an unsolicited one. For 
more information please visit http://gump.apache.org/nagged.html, 
and/or contact the folk at general@gump.apache.org.

Project doxia-module-fml has an issue affecting its community integration.
This issue affects 1 projects.
The current state of this project is 'Failed', with reason 'Build Timed Out'.
For reference only, the following projects are affected by this:
    - doxia-module-fml :  A content generation framework which aims to provide its use...


Full details are available at:
    http://vmgump.apache.org/gump/public/doxia/doxia-module-fml/index.html

That said, some information snippets are provided here.

The following annotations (debug/informational/warning/error messages) were provided:
 -DEBUG- Sole jar output [doxia-module-fml-*[0-9T].jar] identifier set to project name
 -INFO- Optional dependency doxia-test-docs failed with reason build timed out
 -DEBUG- (Apache Gump generated) Apache Maven Settings in: /srv/gump/public/workspace/doxia/doxia/doxia-modules/doxia-module-fml/gump_mvn_settings.xml
 -INFO- Failed with reason build timed out
 -DEBUG- Maven POM in: /srv/gump/public/workspace/doxia/doxia/doxia-modules/doxia-module-fml/pom.xml
 -INFO- Failed to extract fallback artifacts from Gump Repository



The following work was performed:
http://vmgump.apache.org/gump/public/doxia/doxia-module-fml/gump_work/build_doxia_doxia-module-fml.html
Work Name: build_doxia_doxia-module-fml (Type: Build)
Work ended in a state of : Failed
Elapsed: 60 mins
Command Line: /opt/maven2/bin/mvn --batch-mode --settings /srv/gump/public/workspace/doxia/doxia/doxia-modules/doxia-module-fml/gump_mvn_settings.xml install 
[Working Directory: /srv/gump/public/workspace/doxia/doxia/doxia-modules/doxia-module-fml]
M2_HOME: /opt/maven2
---------------------------------------------
[INFO] Scanning for projects...
[INFO] ------------------------------------------------------------------------
[INFO] Building Doxia :: FML Module
[INFO]    task-segment: [install]
[INFO] ------------------------------------------------------------------------
Downloading: http://localhost:8192/maven2/org/apache/maven/plugins/maven-resources-plugin/2.6/maven-resources-plugin-2.6.pom
---------------------------------------------

To subscribe to this information via syndicated feeds:
- RSS: http://vmgump.apache.org/gump/public/doxia/doxia-module-fml/rss.xml
- Atom: http://vmgump.apache.org/gump/public/doxia/doxia-module-fml/atom.xml

============================== Gump Tracking Only ===
Produced by Apache Gump(TM) version 2.3.
Gump Run 20130125180006, vmgump.apache.org:vmgump:20130125180006
Gump E-mail Identifier (unique within run) #58.

*********************************************************** G U M P
[GUMP@vmgump]: Project cocoon22-sitemap-api (in module cocoon) failed
To whom it may engage...
        
This is an automated request, but not an unsolicited one. For 
more information please visit http://gump.apache.org/nagged.html, 
and/or contact the folk at general@gump.apache.org.

Project cocoon22-sitemap-api has an issue affecting its community integration.
This issue affects 1 projects.
The current state of this project is 'Failed', with reason 'Build Failed'.
For reference only, the following projects are affected by this:
    - cocoon22-sitemap-api :  Java XML Framework


Full details are available at:
    http://vmgump.apache.org/gump/public/cocoon/cocoon22-sitemap-api/index.html

That said, some information snippets are provided here.

The following annotations (debug/informational/warning/error messages) were provided:
 -INFO- Optional dependency cocoon22-pipeline-api failed with reason build timed out
 -DEBUG- (Apache Gump generated) Apache Maven Settings in: /srv/gump/public/workspace/cocoon/core/cocoon-sitemap/cocoon-sitemap-api/gump_mvn_settings.xml
 -INFO- Failed with reason build failed
 -DEBUG- Maven POM in: /srv/gump/public/workspace/cocoon/core/cocoon-sitemap/cocoon-sitemap-api/pom.xml
 -DEBUG- Extracted fallback artifacts from Gump Repository



The following work was performed:
http://vmgump.apache.org/gump/public/cocoon/cocoon22-sitemap-api/gump_work/build_cocoon_cocoon22-sitemap-api.html
Work Name: build_cocoon_cocoon22-sitemap-api (Type: Build)
Work ended in a state of : Failed
Elapsed: 7 secs
Command Line: /opt/maven2/bin/mvn --batch-mode --settings /srv/gump/public/workspace/cocoon/core/cocoon-sitemap/cocoon-sitemap-api/gump_mvn_settings.xml install 
[Working Directory: /srv/gump/public/workspace/cocoon/core/cocoon-sitemap/cocoon-sitemap-api]
M2_HOME: /opt/maven2
---------------------------------------------
[INFO] Scanning for projects...
[INFO] ------------------------------------------------------------------------
[INFO] Building Cocoon Sitemap API
[INFO]    task-segment: [install]
[INFO] ------------------------------------------------------------------------
Downloading: http://localhost:8192/repo/m2-snapshot-repository/org/apache/cocoon/cocoon-pipeline-api/1.1.0-SNAPSHOT/cocoon-pipeline-api-1.1.0-SNAPSHOT.pom
[INFO] Unable to find resource 'org.apache.cocoon:cocoon-pipeline-api:pom:1.1.0-SNAPSHOT' in repository apache.snapshots (http://repository.apache.org/snapshots)
Downloading: http://localhost:8192/repo/m2-snapshot-repository/org/apache/cocoon/cocoon-pipeline-api/1.1.0-SNAPSHOT/cocoon-pipeline-api-1.1.0-SNAPSHOT.jar
[INFO] Unable to find resource 'org.apache.cocoon:cocoon-pipeline-api:jar:1.1.0-SNAPSHOT' in repository apache.snapshots (http://repository.apache.org/snapshots)
[INFO] ------------------------------------------------------------------------
[ERROR] BUILD ERROR
[INFO] ------------------------------------------------------------------------
[INFO] Failed to resolve artifact.

Missing:
----------
1) org.apache.cocoon:cocoon-pipeline-api:jar:1.1.0-SNAPSHOT

  Try downloading the file manually from the project website.

  Then, install it using the command: 
      mvn install:install-file -DgroupId=org.apache.cocoon -DartifactId=cocoon-pipeline-api -Dversion=1.1.0-SNAPSHOT -Dpackaging=jar -Dfile=/path/to/file

  Alternatively, if you host your own repository you can deploy the file there: 
      mvn deploy:deploy-file -DgroupId=org.apache.cocoon -DartifactId=cocoon-pipeline-api -Dversion=1.1.0-SNAPSHOT -Dpackaging=jar -Dfile=/path/to/file -Durl=[url] -DrepositoryId=[id]

  Path to dependency: 
  	1) org.apache.cocoon:cocoon-sitemap-api:jar:1.1.0-SNAPSHOT
  	2) org.apache.cocoon:cocoon-pipeline-api:jar:1.1.0-SNAPSHOT

----------
1 required artifact is missing.

for artifact: 
  org.apache.cocoon:cocoon-sitemap-api:jar:1.1.0-SNAPSHOT

from the specified remote repositories:
  gump-central (http://localhost:8192/maven2),
  gump-apache.snapshots (http://localhost:8192/repo/m2-snapshot-repository)



[INFO] ------------------------------------------------------------------------
[INFO] For more information, run Maven with the -e switch
[INFO] ------------------------------------------------------------------------
[INFO] Total time: 6 seconds
[INFO] Finished at: Mon Jan 28 18:15:07 UTC 2013
[INFO] Final Memory: 19M/48M
[INFO] ------------------------------------------------------------------------
---------------------------------------------

To subscribe to this information via syndicated feeds:
- RSS: http://vmgump.apache.org/gump/public/cocoon/cocoon22-sitemap-api/rss.xml
- Atom: http://vmgump.apache.org/gump/public/cocoon/cocoon22-sitemap-api/atom.xml

============================== Gump Tracking Only ===
Produced by Apache Gump(TM) version 2.3.
Gump Run 20130125180006, vmgump.apache.org:vmgump:20130125180006
Gump E-mail Identifier (unique within run) #59.

*********************************************************** G U M P
[GUMP@vmgump]: Project jetty-nested (in module jetty) failed
To whom it may engage...
        
This is an automated request, but not an unsolicited one. For 
more information please visit http://gump.apache.org/nagged.html, 
and/or contact the folk at general@gump.apache.org.

Project jetty-nested has an issue affecting its community integration.
This issue affects 1 projects.
The current state of this project is 'Failed', with reason 'Build Timed Out'.
For reference only, the following projects are affected by this:
    - jetty-nested :  Java HTTP Servlet Server


Full details are available at:
    http://vmgump.apache.org/gump/public/jetty/jetty-nested/index.html

That said, some information snippets are provided here.

The following annotations (debug/informational/warning/error messages) were provided:
 -DEBUG- Sole jar output [jetty-nested-*[0-9T].jar] identifier set to project name
 -INFO- Optional dependency jetty-server prerequisite failed with reason build timed out
 -DEBUG- (Apache Gump generated) Apache Maven Settings in: /srv/gump/public/workspace/jetty/jetty-nested/gump_mvn_settings.xml
 -INFO- Failed with reason build timed out
 -DEBUG- Maven POM in: /srv/gump/public/workspace/jetty/jetty-nested/pom.xml
 -DEBUG- Extracted fallback artifacts from Gump Repository



The following work was performed:
http://vmgump.apache.org/gump/public/jetty/jetty-nested/gump_work/build_jetty_jetty-nested.html
Work Name: build_jetty_jetty-nested (Type: Build)
Work ended in a state of : Failed
Elapsed: 60 mins
Command Line: /opt/maven2/bin/mvn --batch-mode --settings /srv/gump/public/workspace/jetty/jetty-nested/gump_mvn_settings.xml install 
[Working Directory: /srv/gump/public/workspace/jetty/jetty-nested]
M2_HOME: /opt/maven2
---------------------------------------------
[INFO] Scanning for projects...
[WARNING] POM for 'biz.aQute:bndlib:pom:1.15.0:runtime' is invalid.

Its dependencies (if any) will NOT be available to the current build.
[INFO] ------------------------------------------------------------------------
[INFO] Building Jetty :: Nested
[INFO]    task-segment: [install]
[INFO] ------------------------------------------------------------------------
Downloading: http://localhost:8192/maven2/org/apache/maven/plugins/maven-surefire-plugin/2.8.1/maven-surefire-plugin-2.8.1.pom
---------------------------------------------

To subscribe to this information via syndicated feeds:
- RSS: http://vmgump.apache.org/gump/public/jetty/jetty-nested/rss.xml
- Atom: http://vmgump.apache.org/gump/public/jetty/jetty-nested/atom.xml

============================== Gump Tracking Only ===
Produced by Apache Gump(TM) version 2.3.
Gump Run 20130125180006, vmgump.apache.org:vmgump:20130125180006
Gump E-mail Identifier (unique within run) #60.

*********************************************************** G U M P
[GUMP@vmgump]: Project mina-core (in module mina) failed
To whom it may engage...
        
This is an automated request, but not an unsolicited one. For 
more information please visit http://gump.apache.org/nagged.html, 
and/or contact the folk at general@gump.apache.org.

Project mina-core has an issue affecting its community integration.
This issue affects 2 projects.
The current state of this project is 'Failed', with reason 'Build Timed Out'.
For reference only, the following projects are affected by this:
    - mina :  A Multipurpose Infrastrusture for Network Applications
    - mina-core :  A Multipurpose Infrastrusture for Network Applications


Full details are available at:
    http://vmgump.apache.org/gump/public/mina/mina-core/index.html

That said, some information snippets are provided here.

The following annotations (debug/informational/warning/error messages) were provided:
 -DEBUG- Sole jar output [mina-core-*[0-9T].jar] identifier set to project name
 -WARNING- Bad *Optional* Dependency. Project: logging-log4j : unknown to *this* workspace
 -INFO- Optional dependency mockito prerequisite failed with reason build timed out
 -INFO- Optional dependency doxia-core failed with reason build timed out
 -DEBUG- (Apache Gump generated) Apache Maven Settings in: /srv/gump/public/workspace/mina/core/gump_mvn_settings.xml
 -INFO- Failed with reason build timed out
 -DEBUG- Maven POM in: /srv/gump/public/workspace/mina/core/pom.xml
 -DEBUG- Extracted fallback artifacts from Gump Repository



The following work was performed:
http://vmgump.apache.org/gump/public/mina/mina-core/gump_work/build_mina_mina-core.html
Work Name: build_mina_mina-core (Type: Build)
Work ended in a state of : Failed
Elapsed: 60 mins
Command Line: /opt/maven2/bin/mvn --batch-mode -Dmaven.test.skip.exec=true --settings /srv/gump/public/workspace/mina/core/gump_mvn_settings.xml package 
[Working Directory: /srv/gump/public/workspace/mina/core]
M2_HOME: /opt/maven2
---------------------------------------------
[INFO] Scanning for projects...
Downloading: http://localhost:8192/maven2/org/apache/apache/9/apache-9.pom
---------------------------------------------

To subscribe to this information via syndicated feeds:
- RSS: http://vmgump.apache.org/gump/public/mina/mina-core/rss.xml
- Atom: http://vmgump.apache.org/gump/public/mina/mina-core/atom.xml

============================== Gump Tracking Only ===
Produced by Apache Gump(TM) version 2.3.
Gump Run 20130125180006, vmgump.apache.org:vmgump:20130125180006
Gump E-mail Identifier (unique within run) #61.

*********************************************************** G U M P
[GUMP@vmgump]: Project doxia-module-confluence (in module doxia) failed
To whom it may engage...
        
This is an automated request, but not an unsolicited one. For 
more information please visit http://gump.apache.org/nagged.html, 
and/or contact the folk at general@gump.apache.org.

Project doxia-module-confluence has an issue affecting its community integration.
This issue affects 1 projects.
The current state of this project is 'Failed', with reason 'Build Timed Out'.
For reference only, the following projects are affected by this:
    - doxia-module-confluence :  A content generation framework which aims to provide its use...


Full details are available at:
    http://vmgump.apache.org/gump/public/doxia/doxia-module-confluence/index.html

That said, some information snippets are provided here.

The following annotations (debug/informational/warning/error messages) were provided:
 -DEBUG- Sole jar output [doxia-module-confluence-*[0-9T].jar] identifier set to project name
 -DEBUG- (Apache Gump generated) Apache Maven Settings in: /srv/gump/public/workspace/doxia/doxia/doxia-modules/doxia-module-confluence/gump_mvn_settings.xml
 -INFO- Failed with reason build timed out
 -DEBUG- Maven POM in: /srv/gump/public/workspace/doxia/doxia/doxia-modules/doxia-module-confluence/pom.xml
 -INFO- Failed to extract fallback artifacts from Gump Repository



The following work was performed:
http://vmgump.apache.org/gump/public/doxia/doxia-module-confluence/gump_work/build_doxia_doxia-module-confluence.html
Work Name: build_doxia_doxia-module-confluence (Type: Build)
Work ended in a state of : Failed
Elapsed: 60 mins
Command Line: /opt/maven2/bin/mvn --batch-mode --settings /srv/gump/public/workspace/doxia/doxia/doxia-modules/doxia-module-confluence/gump_mvn_settings.xml install 
[Working Directory: /srv/gump/public/workspace/doxia/doxia/doxia-modules/doxia-module-confluence]
M2_HOME: /opt/maven2
---------------------------------------------
[INFO] Scanning for projects...
[INFO] ------------------------------------------------------------------------
[INFO] Building Doxia :: Confluence Module
[INFO]    task-segment: [install]
[INFO] ------------------------------------------------------------------------
Downloading: http://localhost:8192/maven2/org/apache/maven/plugins/maven-resources-plugin/2.6/maven-resources-plugin-2.6.pom
---------------------------------------------

To subscribe to this information via syndicated feeds:
- RSS: http://vmgump.apache.org/gump/public/doxia/doxia-module-confluence/rss.xml
- Atom: http://vmgump.apache.org/gump/public/doxia/doxia-module-confluence/atom.xml

============================== Gump Tracking Only ===
Produced by Apache Gump(TM) version 2.3.
Gump Run 20130125180006, vmgump.apache.org:vmgump:20130125180006
Gump E-mail Identifier (unique within run) #62.

*********************************************************** G U M P
[GUMP@vmgump]: Project doxia-module-xdoc (in module doxia) failed
To whom it may engage...
        
This is an automated request, but not an unsolicited one. For 
more information please visit http://gump.apache.org/nagged.html, 
and/or contact the folk at general@gump.apache.org.

Project doxia-module-xdoc has an issue affecting its community integration.
This issue affects 1 projects.
The current state of this project is 'Failed', with reason 'Build Timed Out'.
For reference only, the following projects are affected by this:
    - doxia-module-xdoc :  A content generation framework which aims to provide its use...


Full details are available at:
    http://vmgump.apache.org/gump/public/doxia/doxia-module-xdoc/index.html

That said, some information snippets are provided here.

The following annotations (debug/informational/warning/error messages) were provided:
 -DEBUG- Sole jar output [doxia-module-xdoc-*[0-9T].jar] identifier set to project name
 -INFO- Optional dependency doxia-test-docs failed with reason build timed out
 -DEBUG- (Apache Gump generated) Apache Maven Settings in: /srv/gump/public/workspace/doxia/doxia/doxia-modules/doxia-module-xdoc/gump_mvn_settings.xml
 -INFO- Failed with reason build timed out
 -DEBUG- Maven POM in: /srv/gump/public/workspace/doxia/doxia/doxia-modules/doxia-module-xdoc/pom.xml
 -INFO- Failed to extract fallback artifacts from Gump Repository



The following work was performed:
http://vmgump.apache.org/gump/public/doxia/doxia-module-xdoc/gump_work/build_doxia_doxia-module-xdoc.html
Work Name: build_doxia_doxia-module-xdoc (Type: Build)
Work ended in a state of : Failed
Elapsed: 60 mins
Command Line: /opt/maven2/bin/mvn --batch-mode --settings /srv/gump/public/workspace/doxia/doxia/doxia-modules/doxia-module-xdoc/gump_mvn_settings.xml install 
[Working Directory: /srv/gump/public/workspace/doxia/doxia/doxia-modules/doxia-module-xdoc]
M2_HOME: /opt/maven2
---------------------------------------------
[INFO] Scanning for projects...
[INFO] ------------------------------------------------------------------------
[INFO] Building Doxia :: XDoc Module
[INFO]    task-segment: [install]
[INFO] ------------------------------------------------------------------------
Downloading: http://localhost:8192/maven2/org/apache/maven/plugins/maven-resources-plugin/2.6/maven-resources-plugin-2.6.pom
---------------------------------------------

To subscribe to this information via syndicated feeds:
- RSS: http://vmgump.apache.org/gump/public/doxia/doxia-module-xdoc/rss.xml
- Atom: http://vmgump.apache.org/gump/public/doxia/doxia-module-xdoc/atom.xml

============================== Gump Tracking Only ===
Produced by Apache Gump(TM) version 2.3.
Gump Run 20130125180006, vmgump.apache.org:vmgump:20130125180006
Gump E-mail Identifier (unique within run) #63.

*********************************************************** G U M P
[GUMP@vmgump]: Project doxia-site-renderer (in module doxia) failed
To whom it may engage...
        
This is an automated request, but not an unsolicited one. For 
more information please visit http://gump.apache.org/nagged.html, 
and/or contact the folk at general@gump.apache.org.

Project doxia-site-renderer has an issue affecting its community integration.
This issue affects 2 projects.
The current state of this project is 'Failed', with reason 'Build Timed Out'.
For reference only, the following projects are affected by this:
    - doxia-site-renderer :  A content generation framework which aims to provide its use...
    - doxia-site-renderer-test :  A content generation framework which aims to provide its use...


Full details are available at:
    http://vmgump.apache.org/gump/public/doxia/doxia-site-renderer/index.html

That said, some information snippets are provided here.

The following annotations (debug/informational/warning/error messages) were provided:
 -DEBUG- Sole jar output [doxia-site-renderer-*[0-9T].jar] identifier set to project name
 -INFO- Optional dependency doxia-logging-api failed with reason build timed out
 -INFO- Optional dependency doxia-sink-api prerequisite failed with reason build timed out
 -INFO- Optional dependency doxia-core failed with reason build timed out
 -INFO- Optional dependency doxia-decoration-model failed with reason build timed out
 -INFO- Optional dependency doxia-module-docbook-simple failed with reason build timed out
 -INFO- Optional dependency doxia-module-xhtml failed with reason build timed out
 -INFO- Optional dependency doxia-module-apt failed with reason build timed out
 -INFO- Optional dependency doxia-module-fml failed with reason build timed out
 -INFO- Optional dependency doxia-module-confluence failed with reason build timed out
 -INFO- Optional dependency doxia-module-xdoc failed with reason build timed out
 -DEBUG- (Apache Gump generated) Apache Maven Settings in: /srv/gump/public/workspace/doxia/doxia-sitetools/doxia-site-renderer/gump_mvn_settings.xml
 -INFO- Failed with reason build timed out
 -DEBUG- Maven POM in: /srv/gump/public/workspace/doxia/doxia-sitetools/doxia-site-renderer/pom.xml
 -INFO- Failed to extract fallback artifacts from Gump Repository



The following work was performed:
http://vmgump.apache.org/gump/public/doxia/doxia-site-renderer/gump_work/build_doxia_doxia-site-renderer.html
Work Name: build_doxia_doxia-site-renderer (Type: Build)
Work ended in a state of : Failed
Elapsed: 60 mins
Command Line: /opt/maven2/bin/mvn --batch-mode -DskipTests=true --settings /srv/gump/public/workspace/doxia/doxia-sitetools/doxia-site-renderer/gump_mvn_settings.xml install 
[Working Directory: /srv/gump/public/workspace/doxia/doxia-sitetools/doxia-site-renderer]
M2_HOME: /opt/maven2
---------------------------------------------
[INFO] Scanning for projects...
[INFO] ------------------------------------------------------------------------
[INFO] Building Doxia :: Site Renderer
[INFO]    task-segment: [install]
[INFO] ------------------------------------------------------------------------
Downloading: http://localhost:8192/maven2/org/apache/maven/plugins/maven-resources-plugin/2.6/maven-resources-plugin-2.6.pom
---------------------------------------------

To subscribe to this information via syndicated feeds:
- RSS: http://vmgump.apache.org/gump/public/doxia/doxia-site-renderer/rss.xml
- Atom: http://vmgump.apache.org/gump/public/doxia/doxia-site-renderer/atom.xml

============================== Gump Tracking Only ===
Produced by Apache Gump(TM) version 2.3.
Gump Run 20130125180006, vmgump.apache.org:vmgump:20130125180006
Gump E-mail Identifier (unique within run) #64.

*********************************************************** G U M P
[GUMP@vmgump]: Project apache-mailet-base-testjar (in module apache-mailet) failed
To whom it may engage...
        
This is an automated request, but not an unsolicited one. For 
more information please visit http://gump.apache.org/nagged.html, 
and/or contact the folk at general@gump.apache.org.

Project apache-mailet-base-testjar has an issue affecting its community integration.
This issue affects 1 projects.
The current state of this project is 'Failed', with reason 'Build Timed Out'.
For reference only, the following projects are affected by this:
    - apache-mailet-base-testjar :  Apache Mailet API


Full details are available at:
    http://vmgump.apache.org/gump/public/apache-mailet/apache-mailet-base-testjar/index.html

That said, some information snippets are provided here.

The following annotations (debug/informational/warning/error messages) were provided:
 -WARNING- Overriding Maven settings: [/srv/gump/public/workspace/apache-mailet/base/gump_mvn_settings.xml]
 -DEBUG- (Apache Gump generated) Apache Maven Settings in: /srv/gump/public/workspace/apache-mailet/base/gump_mvn_settings.xml
 -INFO- Failed with reason build timed out
 -DEBUG- Maven POM in: /srv/gump/public/workspace/apache-mailet/base/pom.xml
 -INFO- Failed to extract fallback artifacts from Gump Repository



The following work was performed:
http://vmgump.apache.org/gump/public/apache-mailet/apache-mailet-base-testjar/gump_work/build_apache-mailet_apache-mailet-base-testjar.html
Work Name: build_apache-mailet_apache-mailet-base-testjar (Type: Build)
Work ended in a state of : Failed
Elapsed: 60 mins
Command Line: /opt/maven3/bin/mvn --batch-mode --settings /srv/gump/public/workspace/apache-mailet/base/gump_mvn_settings.xml jar:test-jar 
[Working Directory: /srv/gump/public/workspace/apache-mailet/base]
M2_HOME: /opt/maven3
---------------------------------------------
[INFO] Scanning for projects...
Downloading: http://localhost:8192/maven2/org/apache/james/maven-mailetdocs-plugin/0.1/maven-mailetdocs-plugin-0.1.pom
---------------------------------------------

To subscribe to this information via syndicated feeds:
- RSS: http://vmgump.apache.org/gump/public/apache-mailet/apache-mailet-base-testjar/rss.xml
- Atom: http://vmgump.apache.org/gump/public/apache-mailet/apache-mailet-base-testjar/atom.xml

============================== Gump Tracking Only ===
Produced by Apache Gump(TM) version 2.3.
Gump Run 20130125180006, vmgump.apache.org:vmgump:20130125180006
Gump E-mail Identifier (unique within run) #67.

*********************************************************** G U M P
[GUMP@vmgump]: Project apache-standard-mailets (in module apache-mailet) failed
To whom it may engage...
        
This is an automated request, but not an unsolicited one. For 
more information please visit http://gump.apache.org/nagged.html, 
and/or contact the folk at general@gump.apache.org.

Project apache-standard-mailets has an issue affecting its community integration.
This issue affects 2 projects.
The current state of this project is 'Failed', with reason 'Build Timed Out'.
For reference only, the following projects are affected by this:
    - apache-standard-mailets :  Apache Mailet API
    - apache-standard-mailets-test :  Apache Mailet API


Full details are available at:
    http://vmgump.apache.org/gump/public/apache-mailet/apache-standard-mailets/index.html

That said, some information snippets are provided here.

The following annotations (debug/informational/warning/error messages) were provided:
 -DEBUG- Sole jar output [apache-standard-mailets-*[0-9T].jar] identifier set to project name
 -INFO- Optional dependency apache-mailet-base-testjar failed with reason build timed out
 -DEBUG- (Apache Gump generated) Apache Maven Settings in: /srv/gump/public/workspace/apache-mailet/standard/gump_mvn_settings.xml
 -INFO- Failed with reason build timed out
 -DEBUG- Maven POM in: /srv/gump/public/workspace/apache-mailet/standard/pom.xml
 -INFO- Failed to extract fallback artifacts from Gump Repository



The following work was performed:
http://vmgump.apache.org/gump/public/apache-mailet/apache-standard-mailets/gump_work/build_apache-mailet_apache-standard-mailets.html
Work Name: build_apache-mailet_apache-standard-mailets (Type: Build)
Work ended in a state of : Failed
Elapsed: 60 mins
Command Line: /opt/maven3/bin/mvn --batch-mode -Dmaven.test.skip=true --settings /srv/gump/public/workspace/apache-mailet/standard/gump_mvn_settings.xml install 
[Working Directory: /srv/gump/public/workspace/apache-mailet/standard]
M2_HOME: /opt/maven3
---------------------------------------------
[INFO] Scanning for projects...
[INFO]                                                                         
[INFO] ------------------------------------------------------------------------
[INFO] Building Apache James :: Standard Mailets 2.5.1-SNAPSHOT
[INFO] ------------------------------------------------------------------------
Downloading: http://localhost:8192/maven2/org/apache/httpcomponents/httpclient-osgi/4.2.2/httpclient-osgi-4.2.2.pom
---------------------------------------------

To subscribe to this information via syndicated feeds:
- RSS: http://vmgump.apache.org/gump/public/apache-mailet/apache-standard-mailets/rss.xml
- Atom: http://vmgump.apache.org/gump/public/apache-mailet/apache-standard-mailets/atom.xml

============================== Gump Tracking Only ===
Produced by Apache Gump(TM) version 2.3.
Gump Run 20130125180006, vmgump.apache.org:vmgump:20130125180006
Gump E-mail Identifier (unique within run) #68.

*********************************************************** G U M P
[GUMP@vmgump]: Project commons-jci (in module apache-commons) failed
To whom it may engage...
        
This is an automated request, but not an unsolicited one. For 
more information please visit http://gump.apache.org/nagged.html, 
and/or contact the folk at general@gump.apache.org.

Project commons-jci has an issue affecting its community integration.
This issue affects 4 projects.
The current state of this project is 'Failed', with reason 'Build Timed Out'.
For reference only, the following projects are affected by this:
    - commons-jci :  Commons JCI
    - commons-jci-core :  Apache Commons
    - commons-jci-fam :  Apache Commons
    - commons-jci-reactor :  Apache Commons


Full details are available at:
    http://vmgump.apache.org/gump/public/apache-commons/commons-jci/index.html

That said, some information snippets are provided here.

The following annotations (debug/informational/warning/error messages) were provided:
 -DEBUG- Sole pom output [pom.xml] identifier set to project name
 -INFO- Optional dependency doxia-site-renderer failed with reason build timed out
 -DEBUG- (Apache Gump generated) Apache Maven Settings in: /srv/gump/public/workspace/apache-commons/jci/gump_mvn_settings.xml
 -INFO- Failed with reason build timed out
 -DEBUG- Maven POM in: /srv/gump/public/workspace/apache-commons/jci/pom.xml
 -DEBUG- Extracted fallback artifacts from Gump Repository



The following work was performed:
http://vmgump.apache.org/gump/public/apache-commons/commons-jci/gump_work/build_apache-commons_commons-jci.html
Work Name: build_apache-commons_commons-jci (Type: Build)
Work ended in a state of : Failed
Elapsed: 60 mins
Command Line: /opt/maven2/bin/mvn --batch-mode -Dpackaging=pom -DgroupId=org.apache.commons -Dfile=pom.xml -DartifactId=commons-jci -Dversion=1.1-SNAPSHOT --settings /srv/gump/public/workspace/apache-commons/jci/gump_mvn_settings.xml install:install-file 
[Working Directory: /srv/gump/public/workspace/apache-commons/jci]
M2_HOME: /opt/maven2
---------------------------------------------
[INFO] Scanning for projects...
[INFO] Reactor build order: 
[INFO]   Commons JCI
[INFO]   core
[INFO]   compiler-eclipse
[INFO]   compiler-janino
[INFO]   compiler-groovy
[INFO]   compiler-rhino
Downloading: http://localhost:8192/maven2/org/codehaus/mojo/cobertura-maven-plugin/2.2/cobertura-maven-plugin-2.2.pom
---------------------------------------------

To subscribe to this information via syndicated feeds:
- RSS: http://vmgump.apache.org/gump/public/apache-commons/commons-jci/rss.xml
- Atom: http://vmgump.apache.org/gump/public/apache-commons/commons-jci/atom.xml

============================== Gump Tracking Only ===
Produced by Apache Gump(TM) version 2.3.
Gump Run 20130125180006, vmgump.apache.org:vmgump:20130125180006
Gump E-mail Identifier (unique within run) #69.

*********************************************************** G U M P
[GUMP@vmgump]: Project ws-commons-xmlschema (in module ws-commons-xmlschema) failed
To whom it may engage...
        
This is an automated request, but not an unsolicited one. For 
more information please visit http://gump.apache.org/nagged.html, 
and/or contact the folk at general@gump.apache.org.

Project ws-commons-xmlschema has an issue affecting its community integration.
This issue affects 1 projects.
The current state of this project is 'Failed', with reason 'Build Timed Out'.
For reference only, the following projects are affected by this:
    - ws-commons-xmlschema :  Commons XMLSchema is a light weight schema object model that...


Full details are available at:
    http://vmgump.apache.org/gump/public/ws-commons-xmlschema/ws-commons-xmlschema/index.html

That said, some information snippets are provided here.

The following annotations (debug/informational/warning/error messages) were provided:
 -INFO- Optional dependency checkstyle failed with reason build timed out
 -INFO- Optional dependency doxia-site-renderer failed with reason build timed out
 -DEBUG- (Apache Gump generated) Apache Maven Settings in: /srv/gump/public/workspace/ws-commons-xmlschema/gump_mvn_settings.xml
 -INFO- Failed with reason build timed out
 -DEBUG- Maven POM in: /srv/gump/public/workspace/ws-commons-xmlschema/pom.xml
 -DEBUG- Extracted fallback artifacts from Gump Repository



The following work was performed:
http://vmgump.apache.org/gump/public/ws-commons-xmlschema/ws-commons-xmlschema/gump_work/build_ws-commons-xmlschema_ws-commons-xmlschema.html
Work Name: build_ws-commons-xmlschema_ws-commons-xmlschema (Type: Build)
Work ended in a state of : Failed
Elapsed: 60 mins
Command Line: /opt/maven2/bin/mvn --batch-mode --settings /srv/gump/public/workspace/ws-commons-xmlschema/gump_mvn_settings.xml install 
[Working Directory: /srv/gump/public/workspace/ws-commons-xmlschema]
M2_HOME: /opt/maven2
---------------------------------------------
[INFO] Scanning for projects...
[INFO] ------------------------------------------------------------------------
[INFO] Building XmlSchema
[INFO]    task-segment: [install]
[INFO] ------------------------------------------------------------------------
Downloading: http://localhost:8192/maven2/org/apache/ws/commons/ws-commons-java5/1.0.1/ws-commons-java5-1.0.1.pom
---------------------------------------------

To subscribe to this information via syndicated feeds:
- RSS: http://vmgump.apache.org/gump/public/ws-commons-xmlschema/ws-commons-xmlschema/rss.xml
- Atom: http://vmgump.apache.org/gump/public/ws-commons-xmlschema/ws-commons-xmlschema/atom.xml

============================== Gump Tracking Only ===
Produced by Apache Gump(TM) version 2.3.
Gump Run 20130125180006, vmgump.apache.org:vmgump:20130125180006
Gump E-mail Identifier (unique within run) #72.

*********************************************************** G U M P
[GUMP@vmgump]: Project cocoon22-expression-language-impl (in module cocoon) failed
To whom it may engage...
        
This is an automated request, but not an unsolicited one. For 
more information please visit http://gump.apache.org/nagged.html, 
and/or contact the folk at general@gump.apache.org.

Project cocoon22-expression-language-impl has an issue affecting its community integration.
This issue affects 1 projects.
The current state of this project is 'Failed', with reason 'Build Timed Out'.
For reference only, the following projects are affected by this:
    - cocoon22-expression-language-impl :  Java XML Framework


Full details are available at:
    http://vmgump.apache.org/gump/public/cocoon/cocoon22-expression-language-impl/index.html

That said, some information snippets are provided here.

The following annotations (debug/informational/warning/error messages) were provided:
 -INFO- Optional dependency cocoon22-xml-util failed with reason build timed out
 -INFO- Optional dependency commons-jxpath failed with reason build timed out
 -INFO- Optional dependency cocoon22-spring-configurator failed with reason build timed out
 -INFO- Optional dependency commons-jexl3 failed with reason build timed out
 -DEBUG- (Apache Gump generated) Apache Maven Settings in: /srv/gump/public/workspace/cocoon/core/cocoon-expression-language/cocoon-expression-language-impl/gump_mvn_settings.xml
 -INFO- Failed with reason build timed out
 -DEBUG- Maven POM in: /srv/gump/public/workspace/cocoon/core/cocoon-expression-language/cocoon-expression-language-impl/pom.xml
 -DEBUG- Extracted fallback artifacts from Gump Repository



The following work was performed:
http://vmgump.apache.org/gump/public/cocoon/cocoon22-expression-language-impl/gump_work/build_cocoon_cocoon22-expression-language-impl.html
Work Name: build_cocoon_cocoon22-expression-language-impl (Type: Build)
Work ended in a state of : Failed
Elapsed: 60 mins
Command Line: /opt/maven2/bin/mvn --batch-mode --settings /srv/gump/public/workspace/cocoon/core/cocoon-expression-language/cocoon-expression-language-impl/gump_mvn_settings.xml install 
[Working Directory: /srv/gump/public/workspace/cocoon/core/cocoon-expression-language/cocoon-expression-language-impl]
M2_HOME: /opt/maven2
---------------------------------------------
[INFO] Scanning for projects...
[INFO] ------------------------------------------------------------------------
[INFO] Building Cocoon Expression Language Implementation.
[INFO]    task-segment: [install]
[INFO] ------------------------------------------------------------------------
[INFO] snapshot org.apache.cocoon:cocoon-expression-language-api:1.1.0-SNAPSHOT: checking for updates from apache.snapshots
[INFO] snapshot org.apache.cocoon:cocoon-xml-util:1.1.0-SNAPSHOT: checking for updates from apache.snapshots
Downloading: http://localhost:8192/repo/m2-snapshot-repository/org/apache/cocoon/cocoon-xml-util/1.1.0-SNAPSHOT/cocoon-xml-util-1.1.0-SNAPSHOT.pom
[INFO] Unable to find resource 'org.apache.cocoon:cocoon-xml-util:pom:1.1.0-SNAPSHOT' in repository apache.snapshots (http://repository.apache.org/snapshots)
Downloading: http://localhost:8192/maven2/org/apache/cocoon/cocoon-spring-configurator/2.1.0/cocoon-spring-configurator-2.1.0.pom
---------------------------------------------

To subscribe to this information via syndicated feeds:
- RSS: http://vmgump.apache.org/gump/public/cocoon/cocoon22-expression-language-impl/rss.xml
- Atom: http://vmgump.apache.org/gump/public/cocoon/cocoon22-expression-language-impl/atom.xml

============================== Gump Tracking Only ===
Produced by Apache Gump(TM) version 2.3.
Gump Run 20130125180006, vmgump.apache.org:vmgump:20130125180006
Gump E-mail Identifier (unique within run) #73.

*********************************************************** G U M P
[GUMP@vmgump]: Project apache-mime4j-dom (in module james-mime4j) failed
To whom it may engage...
        
This is an automated request, but not an unsolicited one. For 
more information please visit http://gump.apache.org/nagged.html, 
and/or contact the folk at general@gump.apache.org.

Project apache-mime4j-dom has an issue affecting its community integration.
This issue affects 3 projects.
The current state of this project is 'Failed', with reason 'Build Timed Out'.
For reference only, the following projects are affected by this:
    - apache-mime4j-dom :  Java stream based MIME message parser
    - apache-mime4j-dom-test :  Java stream based MIME message parser
    - apache-mime4j-reactor :  Java stream based MIME message parser


Full details are available at:
    http://vmgump.apache.org/gump/public/james-mime4j/apache-mime4j-dom/index.html

That said, some information snippets are provided here.

The following annotations (debug/informational/warning/error messages) were provided:
 -DEBUG- (Apache Gump generated) Apache Maven Settings in: /srv/gump/public/workspace/james-mime4j/dom/gump_mvn_settings.xml
 -INFO- Failed with reason build timed out
 -DEBUG- Maven POM in: /srv/gump/public/workspace/james-mime4j/dom/pom.xml
 -INFO- Failed to extract fallback artifacts from Gump Repository



The following work was performed:
http://vmgump.apache.org/gump/public/james-mime4j/apache-mime4j-dom/gump_work/build_james-mime4j_apache-mime4j-dom.html
Work Name: build_james-mime4j_apache-mime4j-dom (Type: Build)
Work ended in a state of : Failed
Elapsed: 60 mins
Command Line: /opt/maven3/bin/mvn --batch-mode -DskipTests=true --settings /srv/gump/public/workspace/james-mime4j/dom/gump_mvn_settings.xml package 
[Working Directory: /srv/gump/public/workspace/james-mime4j/dom]
M2_HOME: /opt/maven3
---------------------------------------------
[INFO] Scanning for projects...
[INFO]                                                                         
[INFO] ------------------------------------------------------------------------
[INFO] Building Apache JAMES Mime4j (DOM) 0.8-SNAPSHOT
[INFO] ------------------------------------------------------------------------
Downloading: http://localhost:8192/maven2/org/codehaus/mojo/javacc-maven-plugin/2.6/javacc-maven-plugin-2.6.pom
---------------------------------------------

To subscribe to this information via syndicated feeds:
- RSS: http://vmgump.apache.org/gump/public/james-mime4j/apache-mime4j-dom/rss.xml
- Atom: http://vmgump.apache.org/gump/public/james-mime4j/apache-mime4j-dom/atom.xml

============================== Gump Tracking Only ===
Produced by Apache Gump(TM) version 2.3.
Gump Run 20130125180006, vmgump.apache.org:vmgump:20130125180006
Gump E-mail Identifier (unique within run) #74.

*********************************************************** G U M P
[GUMP@vmgump]: Project woden-parent (in module woden) failed
To whom it may engage...
        
This is an automated request, but not an unsolicited one. For 
more information please visit http://gump.apache.org/nagged.html, 
and/or contact the folk at general@gump.apache.org.

Project woden-parent has an issue affecting its community integration.
This issue affects 2 projects.
The current state of this project is 'Failed', with reason 'Build Timed Out'.
For reference only, the following projects are affected by this:
    - woden-core :  A Java class library for reading, manipulating, creating and...
    - woden-parent :  A Java class library for reading, manipulating, creating and...


Full details are available at:
    http://vmgump.apache.org/gump/public/woden/woden-parent/index.html

That said, some information snippets are provided here.

The following annotations (debug/informational/warning/error messages) were provided:
 -INFO- Optional dependency wsdl4j failed with reason build failed
 -INFO- Optional dependency ws-commons-xmlschema failed with reason build timed out
 -DEBUG- (Apache Gump generated) Apache Maven Settings in: /srv/gump/public/workspace/woden/gump_mvn_settings.xml
 -INFO- Failed with reason build timed out
 -DEBUG- Maven POM in: /srv/gump/public/workspace/woden/pom.xml
 -DEBUG- Extracted fallback artifacts from Gump Repository



The following work was performed:
http://vmgump.apache.org/gump/public/woden/woden-parent/gump_work/build_woden_woden-parent.html
Work Name: build_woden_woden-parent (Type: Build)
Work ended in a state of : Failed
Elapsed: 1 hour 4 secs
Command Line: /opt/maven2/bin/mvn --batch-mode -Dpackaging=pom -DgroupId=org.apache.woden -Dfile=pom.xml -DartifactId=woden-parent -Dversion=1.0-SNAPSHOT --settings /srv/gump/public/workspace/woden/gump_mvn_settings.xml install:install-file 
[Working Directory: /srv/gump/public/workspace/woden]
M2_HOME: /opt/maven2
---------------------------------------------
[INFO] Scanning for projects...
[INFO] Reactor build order: 
[INFO]   Woden
[INFO]   Woden - Core
[INFO]   Woden - Tests
[INFO]   Woden - Tool
[INFO]   Woden - converter Maven plugin
[INFO]   Woden - Ant
Downloading: http://localhost:8192/maven2/org/apache/rat/apache-rat-plugin/0.6/apache-rat-plugin-0.6.pom
---------------------------------------------

To subscribe to this information via syndicated feeds:
- RSS: http://vmgump.apache.org/gump/public/woden/woden-parent/rss.xml
- Atom: http://vmgump.apache.org/gump/public/woden/woden-parent/atom.xml

============================== Gump Tracking Only ===
Produced by Apache Gump(TM) version 2.3.
Gump Run 20130125180006, vmgump.apache.org:vmgump:20130125180006
Gump E-mail Identifier (unique within run) #80.

*********************************************************** G U M P
[GUMP@vmgump]: Project xmlschema-core (in module ws-xmlschema) failed
To whom it may engage...
        
This is an automated request, but not an unsolicited one. For 
more information please visit http://gump.apache.org/nagged.html, 
and/or contact the folk at general@gump.apache.org.

Project xmlschema-core has an issue affecting its community integration.
This issue affects 2 projects.
The current state of this project is 'Failed', with reason 'Build Timed Out'.
For reference only, the following projects are affected by this:
    - xmlschema-core :  Commons XMLSchema is a light weight schema object model that...
    - xmlschema-core-test :  Commons XMLSchema is a light weight schema object model that...


Full details are available at:
    http://vmgump.apache.org/gump/public/ws-xmlschema/xmlschema-core/index.html

That said, some information snippets are provided here.

The following annotations (debug/informational/warning/error messages) were provided:
 -DEBUG- Sole jar output [xmlschema-core-*[0-9T].jar] identifier set to project name
 -INFO- Optional dependency checkstyle failed with reason build timed out
 -INFO- Optional dependency doxia-site-renderer failed with reason build timed out
 -DEBUG- (Apache Gump generated) Apache Maven Settings in: /srv/gump/public/workspace/ws-xmlschema/gump_mvn_settings.xml
 -INFO- Failed with reason build timed out
 -DEBUG- Maven POM in: /srv/gump/public/workspace/ws-xmlschema/pom.xml
 -DEBUG- Extracted fallback artifacts from Gump Repository



The following work was performed:
http://vmgump.apache.org/gump/public/ws-xmlschema/xmlschema-core/gump_work/build_ws-xmlschema_xmlschema-core.html
Work Name: build_ws-xmlschema_xmlschema-core (Type: Build)
Work ended in a state of : Failed
Elapsed: 60 mins
Command Line: /opt/maven3/bin/mvn --batch-mode -DskipTests=true --settings /srv/gump/public/workspace/ws-xmlschema/gump_mvn_settings.xml -P!sourcecheck package 
[Working Directory: /srv/gump/public/workspace/ws-xmlschema]
M2_HOME: /opt/maven3
---------------------------------------------
[INFO] Scanning for projects...
[INFO] ------------------------------------------------------------------------
[INFO] Reactor Build Order:
[INFO] 
[INFO] XmlSchema
[INFO] XmlSchema Core
[INFO] XmlSchema OSGi bundle test
[INFO] XmlSchema W3C tests
[INFO]                                                                         
[INFO] ------------------------------------------------------------------------
[INFO] Building XmlSchema 2.0.4-SNAPSHOT
[INFO] ------------------------------------------------------------------------
[INFO] 
[INFO] --- maven-remote-resources-plugin:1.1:process (default) @ xmlschema ---
Downloading: http://localhost:8192/maven2/org/apache/maven/reporting/maven-reporting-api/2.0.5/maven-reporting-api-2.0.5.jar
---------------------------------------------

To subscribe to this information via syndicated feeds:
- RSS: http://vmgump.apache.org/gump/public/ws-xmlschema/xmlschema-core/rss.xml
- Atom: http://vmgump.apache.org/gump/public/ws-xmlschema/xmlschema-core/atom.xml

============================== Gump Tracking Only ===
Produced by Apache Gump(TM) version 2.3.
Gump Run 20130125180006, vmgump.apache.org:vmgump:20130125180006
Gump E-mail Identifier (unique within run) #81.

*********************************************************** G U M P
[GUMP@vmgump]: Project cocoon22-rcl-webapp-wrapper (in module cocoon-subprojects) failed
To whom it may engage...
        
This is an automated request, but not an unsolicited one. For 
more information please visit http://gump.apache.org/nagged.html, 
and/or contact the folk at general@gump.apache.org.

Project cocoon22-rcl-webapp-wrapper has an issue affecting its community integration.
This issue affects 1 projects.
The current state of this project is 'Failed', with reason 'Build Timed Out'.
For reference only, the following projects are affected by this:
    - cocoon22-rcl-webapp-wrapper :  Java XML Framework


Full details are available at:
    http://vmgump.apache.org/gump/public/cocoon-subprojects/cocoon22-rcl-webapp-wrapper/index.html

That said, some information snippets are provided here.

The following annotations (debug/informational/warning/error messages) were provided:
 -INFO- Optional dependency commons-jci-core prerequisite failed with reason build timed out
 -DEBUG- (Apache Gump generated) Apache Maven Settings in: /srv/gump/public/workspace/cocoon-subprojects/cocoon-rcl-webapp-wrapper/trunk/gump_mvn_settings.xml
 -INFO- Failed with reason build timed out
 -DEBUG- Maven POM in: /srv/gump/public/workspace/cocoon-subprojects/cocoon-rcl-webapp-wrapper/trunk/pom.xml
 -DEBUG- Extracted fallback artifacts from Gump Repository



The following work was performed:
http://vmgump.apache.org/gump/public/cocoon-subprojects/cocoon22-rcl-webapp-wrapper/gump_work/build_cocoon-subprojects_cocoon22-rcl-webapp-wrapper.html
Work Name: build_cocoon-subprojects_cocoon22-rcl-webapp-wrapper (Type: Build)
Work ended in a state of : Failed
Elapsed: 1 hour 21 secs
Command Line: /opt/maven2/bin/mvn --batch-mode --settings /srv/gump/public/workspace/cocoon-subprojects/cocoon-rcl-webapp-wrapper/trunk/gump_mvn_settings.xml install 
[Working Directory: /srv/gump/public/workspace/cocoon-subprojects/cocoon-rcl-webapp-wrapper/trunk]
M2_HOME: /opt/maven2
---------------------------------------------
[INFO] Scanning for projects...
[INFO] ------------------------------------------------------------------------
[INFO] Building Cocoon Reloading ClassLoader - Webapp Wrapper
[INFO]    task-segment: [install]
[INFO] ------------------------------------------------------------------------
Downloading: http://localhost:8192/maven2/org/apache/commons/commons-jci-core/1.0/commons-jci-core-1.0.pom
---------------------------------------------

To subscribe to this information via syndicated feeds:
- RSS: http://vmgump.apache.org/gump/public/cocoon-subprojects/cocoon22-rcl-webapp-wrapper/rss.xml
- Atom: http://vmgump.apache.org/gump/public/cocoon-subprojects/cocoon22-rcl-webapp-wrapper/atom.xml

============================== Gump Tracking Only ===
Produced by Apache Gump(TM) version 2.3.
Gump Run 20130125180006, vmgump.apache.org:vmgump:20130125180006
Gump E-mail Identifier (unique within run) #83.

*********************************************************** G U M P
[GUMP@vmgump]: Project portals-bridges-velocity (in module portals-bridges) failed
To whom it may engage...
        
This is an automated request, but not an unsolicited one. For 
more information please visit http://gump.apache.org/nagged.html, 
and/or contact the folk at general@gump.apache.org.

Project portals-bridges-velocity has an issue affecting its community integration.
This issue affects 1 projects.
The current state of this project is 'Failed', with reason 'Build Timed Out'.
For reference only, the following projects are affected by this:
    - portals-bridges-velocity :  Support for JSR168 compliant Portlet development


Full details are available at:
    http://vmgump.apache.org/gump/public/portals-bridges/portals-bridges-velocity/index.html

That said, some information snippets are provided here.

The following annotations (debug/informational/warning/error messages) were provided:
 -DEBUG- Sole jar output [portals-bridges-velocity-*[0-9T].jar] identifier set to project name
 -INFO- Optional dependency velocity-tools-reactor prerequisite failed with reason build timed out
 -INFO- Optional dependency portals-bridges-common failed with reason build timed out
 -DEBUG- (Apache Gump generated) Apache Maven Settings in: /srv/gump/public/workspace/portals-bridges/bridges-velocity/trunk/gump_mvn_settings.xml
 -INFO- Failed with reason build timed out
 -DEBUG- Maven POM in: /srv/gump/public/workspace/portals-bridges/bridges-velocity/trunk/pom.xml
 -INFO- Failed to extract fallback artifacts from Gump Repository



The following work was performed:
http://vmgump.apache.org/gump/public/portals-bridges/portals-bridges-velocity/gump_work/build_portals-bridges_portals-bridges-velocity.html
Work Name: build_portals-bridges_portals-bridges-velocity (Type: Build)
Work ended in a state of : Failed
Elapsed: 60 mins
Command Line: /opt/maven2/bin/mvn --batch-mode --settings /srv/gump/public/workspace/portals-bridges/bridges-velocity/trunk/gump_mvn_settings.xml install 
[Working Directory: /srv/gump/public/workspace/portals-bridges/bridges-velocity/trunk]
M2_HOME: /opt/maven2
---------------------------------------------
[INFO] Scanning for projects...
[INFO] ------------------------------------------------------------------------
[INFO] Building Apache Portals Bridges Velocity Bridge
[INFO]    task-segment: [install]
[INFO] ------------------------------------------------------------------------
Downloading: http://localhost:8192/maven2/org/apache/maven/plugins/maven-resources-plugin/2.4/maven-resources-plugin-2.4.pom
---------------------------------------------

To subscribe to this information via syndicated feeds:
- RSS: http://vmgump.apache.org/gump/public/portals-bridges/portals-bridges-velocity/rss.xml
- Atom: http://vmgump.apache.org/gump/public/portals-bridges/portals-bridges-velocity/atom.xml

============================== Gump Tracking Only ===
Produced by Apache Gump(TM) version 2.3.
Gump Run 20130125180006, vmgump.apache.org:vmgump:20130125180006
Gump E-mail Identifier (unique within run) #85.

*********************************************************** G U M P
[GUMP@vmgump]: Project apacheds-protocol-dhcp (in module apacheds) failed
To whom it may engage...
        
This is an automated request, but not an unsolicited one. For 
more information please visit http://gump.apache.org/nagged.html, 
and/or contact the folk at general@gump.apache.org.

Project apacheds-protocol-dhcp has an issue affecting its community integration.
This issue affects 1 projects.
The current state of this project is 'Failed', with reason 'Build Failed'.
For reference only, the following projects are affected by this:
    - apacheds-protocol-dhcp :  Apache Directory Server


Full details are available at:
    http://vmgump.apache.org/gump/public/apacheds/apacheds-protocol-dhcp/index.html

That said, some information snippets are provided here.

The following annotations (debug/informational/warning/error messages) were provided:
 -DEBUG- Sole jar output [apacheds-protocol-dhcp-*[0-9T].jar] identifier set to project name
 -INFO- Optional dependency apacheds-protocol-shared prerequisite failed with reason build timed out
 -DEBUG- (Apache Gump generated) Apache Maven Settings in: /srv/gump/public/workspace/apacheds/protocol-dhcp/gump_mvn_settings.xml
 -INFO- Failed with reason build failed
 -DEBUG- Maven POM in: /srv/gump/public/workspace/apacheds/protocol-dhcp/pom.xml
 -DEBUG- Extracted fallback artifacts from Gump Repository



The following work was performed:
http://vmgump.apache.org/gump/public/apacheds/apacheds-protocol-dhcp/gump_work/build_apacheds_apacheds-protocol-dhcp.html
Work Name: build_apacheds_apacheds-protocol-dhcp (Type: Build)
Work ended in a state of : Failed
Elapsed: 7 secs
Command Line: /opt/maven3/bin/mvn --batch-mode --settings /srv/gump/public/workspace/apacheds/protocol-dhcp/gump_mvn_settings.xml install 
[Working Directory: /srv/gump/public/workspace/apacheds/protocol-dhcp]
M2_HOME: /opt/maven3
---------------------------------------------
[INFO] Scanning for projects...
[INFO]                                                                         
[INFO] ------------------------------------------------------------------------
[INFO] Building ApacheDS Protocol Dhcp 2.0.0-M11-SNAPSHOT
[INFO] ------------------------------------------------------------------------
Downloading: http://localhost:8192/maven2/org/apache/directory/junit/junit-addons/0.1/junit-addons-0.1.pom
Downloaded: http://localhost:8192/maven2/org/apache/directory/junit/junit-addons/0.1/junit-addons-0.1.pom (3 KB at 3.3 KB/sec)
Downloading: http://localhost:8192/maven2/org/apache/directory/project/project/20/project-20.pom
Downloaded: http://localhost:8192/maven2/org/apache/directory/project/project/20/project-20.pom (27 KB at 281.2 KB/sec)
Downloading: http://localhost:8192/repo/m2-snapshot-repository/org/apache/directory/api/api-ldap-model/1.0.0-M16-SNAPSHOT/maven-metadata.xml
Downloading: http://localhost:8192/repo/m2-snapshot-repository/org/apache/directory/api/api-ldap-model/1.0.0-M16-SNAPSHOT/api-ldap-model-1.0.0-M16-SNAPSHOT.pom
[WARNING] The POM for org.apache.directory.api:api-ldap-model:jar:1.0.0-M16-SNAPSHOT is missing, no dependency information available
Downloading: http://localhost:8192/repo/m2-snapshot-repository/org/apache/directory/server/apacheds-i18n/2.0.0-M11-SNAPSHOT/maven-metadata.xml
Downloading: http://localhost:8192/repo/m2-snapshot-repository/org/apache/directory/server/apacheds-i18n/2.0.0-M11-SNAPSHOT/apacheds-i18n-2.0.0-M11-SNAPSHOT.pom
[WARNING] The POM for org.apache.directory.server:apacheds-i18n:jar:2.0.0-M11-SNAPSHOT is missing, no dependency information available
Downloading: http://localhost:8192/maven2/org/apache/mina/mina-core/2.0.7/mina-core-2.0.7.pom
Downloaded: http://localhost:8192/maven2/org/apache/mina/mina-core/2.0.7/mina-core-2.0.7.pom (2 KB at 17.0 KB/sec)
Downloading: http://localhost:8192/maven2/org/apache/mina/mina-parent/2.0.7/mina-parent-2.0.7.pom
Downloaded: http://localhost:8192/maven2/org/apache/mina/mina-parent/2.0.7/mina-parent-2.0.7.pom (30 KB at 258.9 KB/sec)
Downloading: http://localhost:8192/maven2/org/apache/directory/junit/junit-addons/0.1/junit-addons-0.1.jar
Downloading: http://localhost:8192/maven2/org/apache/mina/mina-core/2.0.7/mina-core-2.0.7.jar
Downloaded: http://localhost:8192/maven2/org/apache/mina/mina-core/2.0.7/mina-core-2.0.7.jar (630 KB at 2450.1 KB/sec)
Downloaded: http://localhost:8192/maven2/org/apache/directory/junit/junit-addons/0.1/junit-addons-0.1.jar (24 KB at 62.8 KB/sec)
Downloading: http://localhost:8192/repo/m2-snapshot-repository/org/apache/directory/api/api-ldap-model/1.0.0-M16-SNAPSHOT/api-ldap-model-1.0.0-M16-SNAPSHOT.jar
Downloading: http://localhost:8192/repo/m2-snapshot-repository/org/apache/directory/server/apacheds-i18n/2.0.0-M11-SNAPSHOT/apacheds-i18n-2.0.0-M11-SNAPSHOT.jar
[INFO] ------------------------------------------------------------------------
[INFO] BUILD FAILURE
[INFO] ------------------------------------------------------------------------
[INFO] Total time: 5.449s
[INFO] Finished at: Wed Jan 30 17:54:08 UTC 2013
[INFO] Final Memory: 7M/17M
[INFO] ------------------------------------------------------------------------
[ERROR] Failed to execute goal on project apacheds-protocol-dhcp: Could not resolve dependencies for project org.apache.directory.server:apacheds-protocol-dhcp:bundle:2.0.0-M11-SNAPSHOT: The following artifacts could not be resolved: org.apache.directory.api:api-ldap-model:jar:1.0.0-M16-SNAPSHOT, org.apache.directory.server:apacheds-i18n:jar:2.0.0-M11-SNAPSHOT: Could not find artifact org.apache.directory.api:api-ldap-model:jar:1.0.0-M16-SNAPSHOT in gump-apache.snapshots (http://localhost:8192/repo/m2-snapshot-repository) -> [Help 1]
[ERROR] 
[ERROR] To see the full stack trace of the errors, re-run Maven with the -e switch.
[ERROR] Re-run Maven using the -X switch to enable full debug logging.
[ERROR] 
[ERROR] For more information about the errors and possible solutions, please read the following articles:
[ERROR] [Help 1] http://cwiki.apache.org/confluence/display/MAVEN/DependencyResolutionException
---------------------------------------------

To subscribe to this information via syndicated feeds:
- RSS: http://vmgump.apache.org/gump/public/apacheds/apacheds-protocol-dhcp/rss.xml
- Atom: http://vmgump.apache.org/gump/public/apacheds/apacheds-protocol-dhcp/atom.xml

============================== Gump Tracking Only ===
Produced by Apache Gump(TM) version 2.3.
Gump Run 20130125180006, vmgump.apache.org:vmgump:20130125180006
Gump E-mail Identifier (unique within run) #87.


--
Apache Gump
http://gump.apache.org/ [Instance: vmgump]

---------------------------------------------------------------------
To unsubscribe, e-mail: general-unsubscribe@gump.apache.org
For additional commands, e-mail: general-help@gump.apache.org


Mime
View raw message