gump-general mailing list archives

Site index · List index
Message view « Date » · « Thread »
Top « Date » · « Thread »
From g...@vmgump.apache.org
Subject BATCH: All dressed up, with nowhere to go...
Date Tue, 22 Jan 2013 21:12:45 GMT
Dear Gumpmeisters,
            
The following 14 notifys should have been sent

*********************************************************** G U M P
[GUMP@vmgump]: Project cocoon22-block-deployment (in module cocoon-subprojects) failed
[GUMP@vmgump]: Project camel-parent (in module camel) failed
[GUMP@vmgump]: Project cocoon22-spring-configurator (in module cocoon-subprojects) failed
[GUMP@vmgump]: Project cocoon22-jnet (in module cocoon-subprojects) failed
[GUMP@vmgump]: Project doxia-module-docbook-simple (in module doxia) failed
[GUMP@vmgump]: Project doxia-module-xhtml (in module doxia) failed
[GUMP@vmgump]: Project cocoon22-servlet-service-impl (in module cocoon-subprojects) failed
[GUMP@vmgump]: Project doxia-module-apt (in module doxia) failed
[GUMP@vmgump]: Project doxia-module-fml (in module doxia) failed
[GUMP@vmgump]: Project doxia-module-confluence (in module doxia) failed
[GUMP@vmgump]: Project doxia-module-xdoc (in module doxia) failed
[GUMP@vmgump]: Project doxia-site-renderer (in module doxia) failed
[GUMP@vmgump]: Project openjpa-lib (in module openjpa) failed
[GUMP@vmgump]: Project groovy (in module groovy) failed
*********************************************************** G U M P
[GUMP@vmgump]: Project cocoon22-block-deployment (in module cocoon-subprojects) failed
To whom it may engage...
        
This is an automated request, but not an unsolicited one. For 
more information please visit http://gump.apache.org/nagged.html, 
and/or contact the folk at general@gump.apache.org.

Project cocoon22-block-deployment has an issue affecting its community integration.
This issue affects 1 projects.
The current state of this project is 'Failed', with reason 'Build Failed'.
For reference only, the following projects are affected by this:
    - cocoon22-block-deployment :  Java XML Framework


Full details are available at:
    http://vmgump.apache.org/gump/public/cocoon-subprojects/cocoon22-block-deployment/index.html

That said, some information snippets are provided here.

The following annotations (debug/informational/warning/error messages) were provided:
 -INFO- Optional dependency commons-logging prerequisite failed with reason build failed
 -DEBUG- (Apache Gump generated) Apache Maven Settings in: /srv/gump/public/workspace/cocoon-subprojects/cocoon-block-deployment/trunk/gump_mvn_settings.xml
 -INFO- Failed with reason build failed
 -DEBUG- Maven POM in: /srv/gump/public/workspace/cocoon-subprojects/cocoon-block-deployment/trunk/pom.xml
 -INFO- Failed to extract fallback artifacts from Gump Repository



The following work was performed:
http://vmgump.apache.org/gump/public/cocoon-subprojects/cocoon22-block-deployment/gump_work/build_cocoon-subprojects_cocoon22-block-deployment.html
Work Name: build_cocoon-subprojects_cocoon22-block-deployment (Type: Build)
Work ended in a state of : Failed
Elapsed: 39 secs
Command Line: /opt/maven2/bin/mvn --batch-mode --settings /srv/gump/public/workspace/cocoon-subprojects/cocoon-block-deployment/trunk/gump_mvn_settings.xml install 
[Working Directory: /srv/gump/public/workspace/cocoon-subprojects/cocoon-block-deployment/trunk]
M2_HOME: /opt/maven2
---------------------------------------------
Downloading: http://localhost:8192/maven2/org/apache/maven/reporting/maven-reporting-exec/1.0.2/maven-reporting-exec-1.0.2.pom
8K downloaded  (maven-reporting-exec-1.0.2.pom)
Downloading: http://localhost:8192/maven2/org/apache/maven/maven-archiver/2.4.2/maven-archiver-2.4.2.pom
3K downloaded  (maven-archiver-2.4.2.pom)
Downloading: http://localhost:8192/maven2/org/codehaus/plexus/plexus-archiver/2.0.1/plexus-archiver-2.0.1.pom
2K downloaded  (plexus-archiver-2.0.1.pom)
Downloading: http://localhost:8192/maven2/org/codehaus/plexus/plexus-io/2.0.1/plexus-io-2.0.1.pom
1K downloaded  (plexus-io-2.0.1.pom)
Downloading: http://localhost:8192/maven2/org/apache/maven/doxia/doxia-sink-api/1.3/doxia-sink-api-1.3.pom
1K downloaded  (doxia-sink-api-1.3.pom)
Downloading: http://localhost:8192/maven2/org/apache/maven/doxia/doxia/1.3/doxia-1.3.pom
17K downloaded  (doxia-1.3.pom)
Downloading: http://localhost:8192/maven2/org/apache/maven/doxia/doxia-logging-api/1.3/doxia-logging-api-1.3.pom
1K downloaded  (doxia-logging-api-1.3.pom)
Downloading: http://localhost:8192/maven2/org/apache/maven/doxia/doxia-core/1.3/doxia-core-1.3.pom
4K downloaded  (doxia-core-1.3.pom)
Downloading: http://localhost:8192/maven2/org/apache/maven/doxia/doxia-module-xhtml/1.3/doxia-module-xhtml-1.3.pom
1K downloaded  (doxia-module-xhtml-1.3.pom)
Downloading: http://localhost:8192/maven2/org/apache/maven/doxia/doxia-modules/1.3/doxia-modules-1.3.pom
2K downloaded  (doxia-modules-1.3.pom)
[WARNING] *** CHECKSUM FAILED - Checksum failed on download: local = 'da39a3ee5e6b4b0d3255bfef95601890afd80709'; remote = '0a8852b90bf09d5e216167a45c4f8ecb0a9d82c1' - RETRYING
Downloading: http://localhost:8192/maven2/org/apache/maven/doxia/doxia-modules/1.3/doxia-modules-1.3.pom
2K downloaded  (doxia-modules-1.3.pom)
[WARNING] *** CHECKSUM FAILED - Checksum failed on download: local = 'da39a3ee5e6b4b0d3255bfef95601890afd80709'; remote = '0a8852b90bf09d5e216167a45c4f8ecb0a9d82c1' - IGNORING
[INFO] Unable to find resource 'org.apache.maven.doxia:doxia-modules:pom:1.3' in repository central (http://repo1.maven.org/maven2)
Downloading: http://localhost:8192/maven2/org/apache/maven/doxia/doxia-modules/1.3/doxia-modules-1.3.pom
2K downloaded  (doxia-modules-1.3.pom)
[WARNING] *** CHECKSUM FAILED - Checksum failed on download: local = 'da39a3ee5e6b4b0d3255bfef95601890afd80709'; remote = '0a8852b90bf09d5e216167a45c4f8ecb0a9d82c1' - RETRYING
Downloading: http://localhost:8192/maven2/org/apache/maven/doxia/doxia-modules/1.3/doxia-modules-1.3.pom
2K downloaded  (doxia-modules-1.3.pom)
[WARNING] *** CHECKSUM FAILED - Checksum failed on download: local = 'da39a3ee5e6b4b0d3255bfef95601890afd80709'; remote = '0a8852b90bf09d5e216167a45c4f8ecb0a9d82c1' - IGNORING
[INFO] Unable to find resource 'org.apache.maven.doxia:doxia-modules:pom:1.3' in repository central (http://repo1.maven.org/maven2)
[INFO] ------------------------------------------------------------------------
[ERROR] BUILD ERROR
[INFO] ------------------------------------------------------------------------
[INFO] Error building POM (may not be this project's POM).


Project ID: null:doxia-module-xhtml:jar:null

Reason: Cannot find parent: org.apache.maven.doxia:doxia-modules for project: null:doxia-module-xhtml:jar:null for project null:doxia-module-xhtml:jar:null


[INFO] ------------------------------------------------------------------------
[INFO] For more information, run Maven with the -e switch
[INFO] ------------------------------------------------------------------------
[INFO] Total time: 38 seconds
[INFO] Finished at: Tue Jan 22 14:53:38 UTC 2013
[INFO] Final Memory: 48M/114M
[INFO] ------------------------------------------------------------------------
---------------------------------------------

To subscribe to this information via syndicated feeds:
- RSS: http://vmgump.apache.org/gump/public/cocoon-subprojects/cocoon22-block-deployment/rss.xml
- Atom: http://vmgump.apache.org/gump/public/cocoon-subprojects/cocoon22-block-deployment/atom.xml

============================== Gump Tracking Only ===
Produced by Apache Gump(TM) version 2.3.
Gump Run 10001222012013, vmgump.apache.org:vmgump:10001222012013
Gump E-mail Identifier (unique within run) #2.

*********************************************************** G U M P
[GUMP@vmgump]: Project camel-parent (in module camel) failed
To whom it may engage...
        
This is an automated request, but not an unsolicited one. For 
more information please visit http://gump.apache.org/nagged.html, 
and/or contact the folk at general@gump.apache.org.

Project camel-parent has an issue affecting its community integration.
This issue affects 11 projects.
The current state of this project is 'Failed', with reason 'Build Failed'.
For reference only, the following projects are affected by this:
    - camel-core :  Camel :: Core
    - camel-core-osgi :  Camel :: Core OSGI
    - camel-core-osgi-test :  Integration framework based on known Enterprise Integration
...
    - camel-core-xml :  Camel :: Core XML
    - camel-jms :  Camel :: JMS
    - camel-jms-test :  Integration framework based on known Enterprise Integration
...
    - camel-parent :  Integration framework based on known Enterprise Integration
...
    - camel-spring :  Camel :: Spring
    - camel-spring-test :  Integration framework based on known Enterprise Integration
...
    - camel-test :  Camel :: Test
    - camel-test-spring :  Camel :: Test Spring


Full details are available at:
    http://vmgump.apache.org/gump/public/camel/camel-parent/index.html

That said, some information snippets are provided here.

The following annotations (debug/informational/warning/error messages) were provided:
 -DEBUG- Sole pom output [pom.xml] identifier set to project name
 -INFO- Optional dependency velocity-engine prerequisite failed with reason build failed
 -INFO- Optional dependency commons-logging prerequisite failed with reason build failed
 -DEBUG- (Apache Gump generated) Apache Maven Settings in: /srv/gump/public/workspace/camel/parent/gump_mvn_settings.xml
 -INFO- Failed with reason build failed
 -DEBUG- Maven POM in: /srv/gump/public/workspace/camel/parent/pom.xml
 -INFO- Failed to extract fallback artifacts from Gump Repository



The following work was performed:
http://vmgump.apache.org/gump/public/camel/camel-parent/gump_work/build_camel_camel-parent.html
Work Name: build_camel_camel-parent (Type: Build)
Work ended in a state of : Failed
Elapsed: 34 secs
Command Line: /opt/maven2/bin/mvn --batch-mode --settings /srv/gump/public/workspace/camel/parent/gump_mvn_settings.xml install 
[Working Directory: /srv/gump/public/workspace/camel/parent]
M2_HOME: /opt/maven2
---------------------------------------------
[INFO] Scanning for projects...
[WARNING] POM for 'biz.aQute:bndlib:pom:1.50.0:runtime' is invalid.

Its dependencies (if any) will NOT be available to the current build.
[INFO] ------------------------------------------------------------------------
[INFO] Building Camel :: Parent
[INFO]    task-segment: [install]
[INFO] ------------------------------------------------------------------------
[INFO] [bundle:cleanVersions {execution: versions}]
[INFO] [remote-resources:process {execution: default}]
Downloading: http://localhost:8192/maven2/com/sun/xml/bind/jaxb-impl/2.2.6/jaxb-impl-2.2.6.pom
4K downloaded  (jaxb-impl-2.2.6.pom)
Downloading: http://localhost:8192/maven2/com/sun/xml/bind/jaxb-impl/2.2.6/jaxb-impl-2.2.6.jar
1086K downloaded  (jaxb-impl-2.2.6.jar)
Downloading: http://localhost:8192/maven2/org/apache/maven/doxia/doxia-modules/1.3/doxia-modules-1.3.pom
2K downloaded  (doxia-modules-1.3.pom)
[WARNING] *** CHECKSUM FAILED - Checksum failed on download: local = 'da39a3ee5e6b4b0d3255bfef95601890afd80709'; remote = '0a8852b90bf09d5e216167a45c4f8ecb0a9d82c1' - RETRYING
Downloading: http://localhost:8192/maven2/org/apache/maven/doxia/doxia-modules/1.3/doxia-modules-1.3.pom
2K downloaded  (doxia-modules-1.3.pom)
[WARNING] *** CHECKSUM FAILED - Checksum failed on download: local = 'da39a3ee5e6b4b0d3255bfef95601890afd80709'; remote = '0a8852b90bf09d5e216167a45c4f8ecb0a9d82c1' - IGNORING
[INFO] Unable to find resource 'org.apache.maven.doxia:doxia-modules:pom:1.3' in repository central (http://repo1.maven.org/maven2)
Downloading: http://localhost:8192/maven2/org/apache/maven/doxia/doxia-modules/1.3/doxia-modules-1.3.pom
2K downloaded  (doxia-modules-1.3.pom)
[WARNING] *** CHECKSUM FAILED - Checksum failed on download: local = 'da39a3ee5e6b4b0d3255bfef95601890afd80709'; remote = '0a8852b90bf09d5e216167a45c4f8ecb0a9d82c1' - RETRYING
Downloading: http://localhost:8192/maven2/org/apache/maven/doxia/doxia-modules/1.3/doxia-modules-1.3.pom
2K downloaded  (doxia-modules-1.3.pom)
[WARNING] *** CHECKSUM FAILED - Checksum failed on download: local = 'da39a3ee5e6b4b0d3255bfef95601890afd80709'; remote = '0a8852b90bf09d5e216167a45c4f8ecb0a9d82c1' - IGNORING
[INFO] Unable to find resource 'org.apache.maven.doxia:doxia-modules:pom:1.3' in repository central (http://repo1.maven.org/maven2)
[INFO] ------------------------------------------------------------------------
[ERROR] BUILD ERROR
[INFO] ------------------------------------------------------------------------
[INFO] Error building POM (may not be this project's POM).


Project ID: null:doxia-module-xhtml:jar:null

Reason: Cannot find parent: org.apache.maven.doxia:doxia-modules for project: null:doxia-module-xhtml:jar:null for project null:doxia-module-xhtml:jar:null


[INFO] ------------------------------------------------------------------------
[INFO] For more information, run Maven with the -e switch
[INFO] ------------------------------------------------------------------------
[INFO] Total time: 33 seconds
[INFO] Finished at: Tue Jan 22 14:54:55 UTC 2013
[INFO] Final Memory: 26M/64M
[INFO] ------------------------------------------------------------------------
---------------------------------------------

To subscribe to this information via syndicated feeds:
- RSS: http://vmgump.apache.org/gump/public/camel/camel-parent/rss.xml
- Atom: http://vmgump.apache.org/gump/public/camel/camel-parent/atom.xml

============================== Gump Tracking Only ===
Produced by Apache Gump(TM) version 2.3.
Gump Run 10001222012013, vmgump.apache.org:vmgump:10001222012013
Gump E-mail Identifier (unique within run) #3.

*********************************************************** G U M P
[GUMP@vmgump]: Project cocoon22-spring-configurator (in module cocoon-subprojects) failed
To whom it may engage...
        
This is an automated request, but not an unsolicited one. For 
more information please visit http://gump.apache.org/nagged.html, 
and/or contact the folk at general@gump.apache.org.

Project cocoon22-spring-configurator has an issue affecting its community integration.
This issue affects 5 projects.
The current state of this project is 'Failed', with reason 'Build Failed'.
For reference only, the following projects are affected by this:
    - cocoon-all :  Java XML Framework
    - cocoon-monitoring :  Java XML Framework
    - cocoon-monitoring-test :  Java XML Framework
    - cocoon22-spring-configurator :  Java XML Framework
    - cocoon3-reactor :  Java XML Framework


Full details are available at:
    http://vmgump.apache.org/gump/public/cocoon-subprojects/cocoon22-spring-configurator/index.html

That said, some information snippets are provided here.

The following annotations (debug/informational/warning/error messages) were provided:
 -INFO- Optional dependency commons-logging prerequisite failed with reason build failed
 -INFO- Optional dependency logging-log4j-12 failed with reason build failed
 -DEBUG- (Apache Gump generated) Apache Maven Settings in: /srv/gump/public/workspace/cocoon-subprojects/cocoon-spring-configurator/trunk/gump_mvn_settings.xml
 -INFO- Failed with reason build failed
 -DEBUG- Maven POM in: /srv/gump/public/workspace/cocoon-subprojects/cocoon-spring-configurator/trunk/pom.xml
 -INFO- Failed to extract fallback artifacts from Gump Repository



The following work was performed:
http://vmgump.apache.org/gump/public/cocoon-subprojects/cocoon22-spring-configurator/gump_work/build_cocoon-subprojects_cocoon22-spring-configurator.html
Work Name: build_cocoon-subprojects_cocoon22-spring-configurator (Type: Build)
Work ended in a state of : Failed
Elapsed: 41 secs
Command Line: /opt/maven2/bin/mvn --batch-mode --settings /srv/gump/public/workspace/cocoon-subprojects/cocoon-spring-configurator/trunk/gump_mvn_settings.xml install 
[Working Directory: /srv/gump/public/workspace/cocoon-subprojects/cocoon-spring-configurator/trunk]
M2_HOME: /opt/maven2
---------------------------------------------
[INFO] Using 'UTF-8' encoding to copy filtered resources.
[INFO] skip non existing resourceDirectory /srv/gump/public/workspace/cocoon-subprojects/cocoon-spring-configurator/trunk/src/test/resources
[INFO] Copying 3 resources
[INFO] [compiler:testCompile {execution: default-testCompile}]
[INFO] No sources to compile
[INFO] [surefire:test {execution: default-test}]
[INFO] Surefire report directory: /srv/gump/public/workspace/cocoon-subprojects/cocoon-spring-configurator/trunk/target/surefire-reports

-------------------------------------------------------
 T E S T S
-------------------------------------------------------

Results :

Tests run: 0, Failures: 0, Errors: 0, Skipped: 0

[INFO] [jar:jar {execution: default-jar}]
[INFO] Building jar: /srv/gump/public/workspace/cocoon-subprojects/cocoon-spring-configurator/trunk/target/cocoon-spring-configurator-2.2.2-SNAPSHOT.jar
Downloading: http://localhost:8192/maven2/org/apache/maven/doxia/doxia-modules/1.3/doxia-modules-1.3.pom
2K downloaded  (doxia-modules-1.3.pom)
[WARNING] *** CHECKSUM FAILED - Checksum failed on download: local = 'da39a3ee5e6b4b0d3255bfef95601890afd80709'; remote = '0a8852b90bf09d5e216167a45c4f8ecb0a9d82c1' - RETRYING
Downloading: http://localhost:8192/maven2/org/apache/maven/doxia/doxia-modules/1.3/doxia-modules-1.3.pom
2K downloaded  (doxia-modules-1.3.pom)
[WARNING] *** CHECKSUM FAILED - Checksum failed on download: local = 'da39a3ee5e6b4b0d3255bfef95601890afd80709'; remote = '0a8852b90bf09d5e216167a45c4f8ecb0a9d82c1' - IGNORING
[INFO] Unable to find resource 'org.apache.maven.doxia:doxia-modules:pom:1.3' in repository central (http://repo1.maven.org/maven2)
Downloading: http://localhost:8192/maven2/org/apache/maven/doxia/doxia-modules/1.3/doxia-modules-1.3.pom
2K downloaded  (doxia-modules-1.3.pom)
[WARNING] *** CHECKSUM FAILED - Checksum failed on download: local = 'da39a3ee5e6b4b0d3255bfef95601890afd80709'; remote = '0a8852b90bf09d5e216167a45c4f8ecb0a9d82c1' - RETRYING
Downloading: http://localhost:8192/maven2/org/apache/maven/doxia/doxia-modules/1.3/doxia-modules-1.3.pom
2K downloaded  (doxia-modules-1.3.pom)
[WARNING] *** CHECKSUM FAILED - Checksum failed on download: local = 'da39a3ee5e6b4b0d3255bfef95601890afd80709'; remote = '0a8852b90bf09d5e216167a45c4f8ecb0a9d82c1' - IGNORING
[INFO] Unable to find resource 'org.apache.maven.doxia:doxia-modules:pom:1.3' in repository central (http://repo1.maven.org/maven2)
[INFO] ------------------------------------------------------------------------
[ERROR] BUILD ERROR
[INFO] ------------------------------------------------------------------------
[INFO] Error building POM (may not be this project's POM).


Project ID: null:doxia-module-xhtml:jar:null

Reason: Cannot find parent: org.apache.maven.doxia:doxia-modules for project: null:doxia-module-xhtml:jar:null for project null:doxia-module-xhtml:jar:null


[INFO] ------------------------------------------------------------------------
[INFO] For more information, run Maven with the -e switch
[INFO] ------------------------------------------------------------------------
[INFO] Total time: 40 seconds
[INFO] Finished at: Tue Jan 22 16:50:22 UTC 2013
[INFO] Final Memory: 50M/120M
[INFO] ------------------------------------------------------------------------
---------------------------------------------

To subscribe to this information via syndicated feeds:
- RSS: http://vmgump.apache.org/gump/public/cocoon-subprojects/cocoon22-spring-configurator/rss.xml
- Atom: http://vmgump.apache.org/gump/public/cocoon-subprojects/cocoon22-spring-configurator/atom.xml

============================== Gump Tracking Only ===
Produced by Apache Gump(TM) version 2.3.
Gump Run 10001222012013, vmgump.apache.org:vmgump:10001222012013
Gump E-mail Identifier (unique within run) #5.

*********************************************************** G U M P
[GUMP@vmgump]: Project cocoon22-jnet (in module cocoon-subprojects) failed
To whom it may engage...
        
This is an automated request, but not an unsolicited one. For 
more information please visit http://gump.apache.org/nagged.html, 
and/or contact the folk at general@gump.apache.org.

Project cocoon22-jnet has an issue affecting its community integration.
This issue affects 1 projects.
The current state of this project is 'Failed', with reason 'Build Failed'.
For reference only, the following projects are affected by this:
    - cocoon22-jnet :  Java XML Framework


Full details are available at:
    http://vmgump.apache.org/gump/public/cocoon-subprojects/cocoon22-jnet/index.html

That said, some information snippets are provided here.

The following annotations (debug/informational/warning/error messages) were provided:
 -INFO- Optional dependency cocoon22-spring-configurator failed with reason build failed
 -DEBUG- (Apache Gump generated) Apache Maven Settings in: /srv/gump/public/workspace/cocoon-subprojects/cocoon-jnet/trunk/gump_mvn_settings.xml
 -INFO- Failed with reason build failed
 -DEBUG- Maven POM in: /srv/gump/public/workspace/cocoon-subprojects/cocoon-jnet/trunk/pom.xml
 -INFO- Failed to extract fallback artifacts from Gump Repository



The following work was performed:
http://vmgump.apache.org/gump/public/cocoon-subprojects/cocoon22-jnet/gump_work/build_cocoon-subprojects_cocoon22-jnet.html
Work Name: build_cocoon-subprojects_cocoon22-jnet (Type: Build)
Work ended in a state of : Failed
Elapsed: 39 secs
Command Line: /opt/maven2/bin/mvn --batch-mode --settings /srv/gump/public/workspace/cocoon-subprojects/cocoon-jnet/trunk/gump_mvn_settings.xml install 
[Working Directory: /srv/gump/public/workspace/cocoon-subprojects/cocoon-jnet/trunk]
M2_HOME: /opt/maven2
---------------------------------------------
[INFO] Using 'UTF-8' encoding to copy filtered resources.
[INFO] Copying 0 resource
[INFO] Copying 3 resources
[INFO] [compiler:testCompile {execution: default-testCompile}]
[INFO] Nothing to compile - all classes are up to date
[INFO] [surefire:test {execution: default-test}]
[INFO] Surefire report directory: /srv/gump/public/workspace/cocoon-subprojects/cocoon-jnet/trunk/target/surefire-reports

-------------------------------------------------------
 T E S T S
-------------------------------------------------------

Results :

Tests run: 0, Failures: 0, Errors: 0, Skipped: 0

[INFO] [jar:jar {execution: default-jar}]
[INFO] Building jar: /srv/gump/public/workspace/cocoon-subprojects/cocoon-jnet/trunk/target/cocoon-jnet-1.2.3-SNAPSHOT.jar
Downloading: http://localhost:8192/maven2/org/apache/maven/doxia/doxia-modules/1.3/doxia-modules-1.3.pom
2K downloaded  (doxia-modules-1.3.pom)
[WARNING] *** CHECKSUM FAILED - Checksum failed on download: local = 'da39a3ee5e6b4b0d3255bfef95601890afd80709'; remote = '0a8852b90bf09d5e216167a45c4f8ecb0a9d82c1' - RETRYING
Downloading: http://localhost:8192/maven2/org/apache/maven/doxia/doxia-modules/1.3/doxia-modules-1.3.pom
2K downloaded  (doxia-modules-1.3.pom)
[WARNING] *** CHECKSUM FAILED - Checksum failed on download: local = 'da39a3ee5e6b4b0d3255bfef95601890afd80709'; remote = '0a8852b90bf09d5e216167a45c4f8ecb0a9d82c1' - IGNORING
[INFO] Unable to find resource 'org.apache.maven.doxia:doxia-modules:pom:1.3' in repository central (http://repo1.maven.org/maven2)
Downloading: http://localhost:8192/maven2/org/apache/maven/doxia/doxia-modules/1.3/doxia-modules-1.3.pom
2K downloaded  (doxia-modules-1.3.pom)
[WARNING] *** CHECKSUM FAILED - Checksum failed on download: local = 'da39a3ee5e6b4b0d3255bfef95601890afd80709'; remote = '0a8852b90bf09d5e216167a45c4f8ecb0a9d82c1' - RETRYING
Downloading: http://localhost:8192/maven2/org/apache/maven/doxia/doxia-modules/1.3/doxia-modules-1.3.pom
2K downloaded  (doxia-modules-1.3.pom)
[WARNING] *** CHECKSUM FAILED - Checksum failed on download: local = 'da39a3ee5e6b4b0d3255bfef95601890afd80709'; remote = '0a8852b90bf09d5e216167a45c4f8ecb0a9d82c1' - IGNORING
[INFO] Unable to find resource 'org.apache.maven.doxia:doxia-modules:pom:1.3' in repository central (http://repo1.maven.org/maven2)
[INFO] ------------------------------------------------------------------------
[ERROR] BUILD ERROR
[INFO] ------------------------------------------------------------------------
[INFO] Error building POM (may not be this project's POM).


Project ID: null:doxia-module-xhtml:jar:null

Reason: Cannot find parent: org.apache.maven.doxia:doxia-modules for project: null:doxia-module-xhtml:jar:null for project null:doxia-module-xhtml:jar:null


[INFO] ------------------------------------------------------------------------
[INFO] For more information, run Maven with the -e switch
[INFO] ------------------------------------------------------------------------
[INFO] Total time: 37 seconds
[INFO] Finished at: Tue Jan 22 16:58:34 UTC 2013
[INFO] Final Memory: 50M/120M
[INFO] ------------------------------------------------------------------------
---------------------------------------------

To subscribe to this information via syndicated feeds:
- RSS: http://vmgump.apache.org/gump/public/cocoon-subprojects/cocoon22-jnet/rss.xml
- Atom: http://vmgump.apache.org/gump/public/cocoon-subprojects/cocoon22-jnet/atom.xml

============================== Gump Tracking Only ===
Produced by Apache Gump(TM) version 2.3.
Gump Run 10001222012013, vmgump.apache.org:vmgump:10001222012013
Gump E-mail Identifier (unique within run) #7.

*********************************************************** G U M P
[GUMP@vmgump]: Project doxia-module-docbook-simple (in module doxia) failed
To whom it may engage...
        
This is an automated request, but not an unsolicited one. For 
more information please visit http://gump.apache.org/nagged.html, 
and/or contact the folk at general@gump.apache.org.

Project doxia-module-docbook-simple has an issue affecting its community integration.
This issue affects 1 projects.
The current state of this project is 'Failed', with reason 'Build Failed'.
For reference only, the following projects are affected by this:
    - doxia-module-docbook-simple :  A content generation framework which aims to provide its use...


Full details are available at:
    http://vmgump.apache.org/gump/public/doxia/doxia-module-docbook-simple/index.html

That said, some information snippets are provided here.

The following annotations (debug/informational/warning/error messages) were provided:
 -DEBUG- Sole jar output [doxia-module-docbook-simple-*[0-9T].jar] identifier set to project name
 -DEBUG- (Apache Gump generated) Apache Maven Settings in: /srv/gump/public/workspace/doxia/doxia/doxia-modules/doxia-module-docbook-simple/gump_mvn_settings.xml
 -INFO- Failed with reason build failed
 -DEBUG- Maven POM in: /srv/gump/public/workspace/doxia/doxia/doxia-modules/doxia-module-docbook-simple/pom.xml
 -INFO- Failed to extract fallback artifacts from Gump Repository



The following work was performed:
http://vmgump.apache.org/gump/public/doxia/doxia-module-docbook-simple/gump_work/build_doxia_doxia-module-docbook-simple.html
Work Name: build_doxia_doxia-module-docbook-simple (Type: Build)
Work ended in a state of : Failed
Elapsed: 33 secs
Command Line: /opt/maven2/bin/mvn --batch-mode --settings /srv/gump/public/workspace/doxia/doxia/doxia-modules/doxia-module-docbook-simple/gump_mvn_settings.xml install 
[Working Directory: /srv/gump/public/workspace/doxia/doxia/doxia-modules/doxia-module-docbook-simple]
M2_HOME: /opt/maven2
---------------------------------------------
Running org.apache.maven.doxia.module.docbook.DocBookSinkTest
[WARNING] [Docbook Sink] Modified invalid comment: 'Simple comment with ----' to 'Simple comment with - - - -'
Tests run: 31, Failures: 0, Errors: 0, Skipped: 0, Time elapsed: 0.957 sec

Results :

Tests run: 47, Failures: 0, Errors: 0, Skipped: 0

[INFO] [jar:jar {execution: default-jar}]
[INFO] Building jar: /srv/gump/public/workspace/doxia/doxia/doxia-modules/doxia-module-docbook-simple/target/doxia-module-docbook-simple-1.4-SNAPSHOT.jar
[INFO] Preparing clirr:check
[WARNING] Removing: check from forked lifecycle, to prevent recursive invocation.
[WARNING] The parameter expression: 'project.build.resources' used in mojo: 'process' has been deprecated. Use 'project.resources' instead.
[INFO] [remote-resources:process {execution: default}]
[debug] execute contextualize
[INFO] [resources:resources {execution: default-resources}]
[INFO] Using 'UTF-8' encoding to copy filtered resources.
[INFO] Copying 1 resource
[INFO] skip non existing resourceDirectory /srv/gump/public/workspace/doxia/doxia/doxia-modules/doxia-module-docbook-simple/target/generated-site/xsd
[INFO] Copying 3 resources
[INFO] Copying 3 resources
[INFO] [compiler:compile {execution: default-compile}]
[INFO] Nothing to compile - all classes are up to date
[INFO] [clirr:check {execution: default}]
[INFO] artifact org.apache.maven.doxia:doxia-module-docbook-simple: checking for updates from central
[INFO] Comparing to version: 1.3
Downloading: http://localhost:8192/maven2/org/apache/maven/doxia/doxia-module-docbook-simple/1.3/doxia-module-docbook-simple-1.3.jar
123K downloaded  (doxia-module-docbook-simple-1.3.jar)
Downloading: http://localhost:8192/maven2/org/apache/maven/doxia/doxia-module-docbook-simple/1.3/doxia-module-docbook-simple-1.3.pom
2K downloaded  (doxia-module-docbook-simple-1.3.pom)
Downloading: http://localhost:8192/maven2/org/apache/maven/doxia/doxia-modules/1.3/doxia-modules-1.3.pom
2K downloaded  (doxia-modules-1.3.pom)
[WARNING] *** CHECKSUM FAILED - Checksum failed on download: local = 'da39a3ee5e6b4b0d3255bfef95601890afd80709'; remote = '0a8852b90bf09d5e216167a45c4f8ecb0a9d82c1' - RETRYING
Downloading: http://localhost:8192/maven2/org/apache/maven/doxia/doxia-modules/1.3/doxia-modules-1.3.pom
2K downloaded  (doxia-modules-1.3.pom)
[WARNING] *** CHECKSUM FAILED - Checksum failed on download: local = 'da39a3ee5e6b4b0d3255bfef95601890afd80709'; remote = '0a8852b90bf09d5e216167a45c4f8ecb0a9d82c1' - IGNORING
[INFO] Unable to find resource 'org.apache.maven.doxia:doxia-modules:pom:1.3' in repository central (http://repo1.maven.org/maven2)
[INFO] ------------------------------------------------------------------------
[ERROR] BUILD ERROR
[INFO] ------------------------------------------------------------------------
[INFO] Failed to build project for previous artifact: Cannot find parent: org.apache.maven.doxia:doxia-modules for project: null:doxia-module-docbook-simple:jar:null for project null:doxia-module-docbook-simple:jar:null

Unable to download the artifact from any repository
[INFO] ------------------------------------------------------------------------
[INFO] For more information, run Maven with the -e switch
[INFO] ------------------------------------------------------------------------
[INFO] Total time: 32 seconds
[INFO] Finished at: Tue Jan 22 17:09:20 UTC 2013
[INFO] Final Memory: 38M/91M
[INFO] ------------------------------------------------------------------------
---------------------------------------------

To subscribe to this information via syndicated feeds:
- RSS: http://vmgump.apache.org/gump/public/doxia/doxia-module-docbook-simple/rss.xml
- Atom: http://vmgump.apache.org/gump/public/doxia/doxia-module-docbook-simple/atom.xml

============================== Gump Tracking Only ===
Produced by Apache Gump(TM) version 2.3.
Gump Run 10001222012013, vmgump.apache.org:vmgump:10001222012013
Gump E-mail Identifier (unique within run) #8.

*********************************************************** G U M P
[GUMP@vmgump]: Project doxia-module-xhtml (in module doxia) failed
To whom it may engage...
        
This is an automated request, but not an unsolicited one. For 
more information please visit http://gump.apache.org/nagged.html, 
and/or contact the folk at general@gump.apache.org.

Project doxia-module-xhtml has an issue affecting its community integration.
This issue affects 1 projects.
The current state of this project is 'Failed', with reason 'Build Failed'.
For reference only, the following projects are affected by this:
    - doxia-module-xhtml :  A content generation framework which aims to provide its use...


Full details are available at:
    http://vmgump.apache.org/gump/public/doxia/doxia-module-xhtml/index.html

That said, some information snippets are provided here.

The following annotations (debug/informational/warning/error messages) were provided:
 -DEBUG- Sole jar output [doxia-module-xhtml-*[0-9T].jar] identifier set to project name
 -DEBUG- (Apache Gump generated) Apache Maven Settings in: /srv/gump/public/workspace/doxia/doxia/doxia-modules/doxia-module-xhtml/gump_mvn_settings.xml
 -INFO- Failed with reason build failed
 -DEBUG- Maven POM in: /srv/gump/public/workspace/doxia/doxia/doxia-modules/doxia-module-xhtml/pom.xml
 -INFO- Failed to extract fallback artifacts from Gump Repository



The following work was performed:
http://vmgump.apache.org/gump/public/doxia/doxia-module-xhtml/gump_work/build_doxia_doxia-module-xhtml.html
Work Name: build_doxia_doxia-module-xhtml (Type: Build)
Work ended in a state of : Failed
Elapsed: 32 secs
Command Line: /opt/maven2/bin/mvn --batch-mode --settings /srv/gump/public/workspace/doxia/doxia/doxia-modules/doxia-module-xhtml/gump_mvn_settings.xml install 
[Working Directory: /srv/gump/public/workspace/doxia/doxia/doxia-modules/doxia-module-xhtml]
M2_HOME: /opt/maven2
---------------------------------------------
Tests run: 33, Failures: 0, Errors: 0, Skipped: 0, Time elapsed: 0.703 sec
Running org.apache.maven.doxia.module.xhtml.XhtmlIdentityTest
Tests run: 1, Failures: 0, Errors: 0, Skipped: 0, Time elapsed: 0.032 sec

Results :

Tests run: 73, Failures: 0, Errors: 0, Skipped: 0

[INFO] [jar:jar {execution: default-jar}]
[INFO] Building jar: /srv/gump/public/workspace/doxia/doxia/doxia-modules/doxia-module-xhtml/target/doxia-module-xhtml-1.4-SNAPSHOT.jar
[INFO] Preparing clirr:check
[WARNING] Removing: check from forked lifecycle, to prevent recursive invocation.
[WARNING] The parameter expression: 'project.build.resources' used in mojo: 'process' has been deprecated. Use 'project.resources' instead.
[INFO] [remote-resources:process {execution: default}]
[debug] execute contextualize
[INFO] [resources:resources {execution: default-resources}]
[INFO] Using 'UTF-8' encoding to copy filtered resources.
[INFO] skip non existing resourceDirectory /srv/gump/public/workspace/doxia/doxia/doxia-modules/doxia-module-xhtml/src/main/resources
[INFO] skip non existing resourceDirectory /srv/gump/public/workspace/doxia/doxia/doxia-modules/doxia-module-xhtml/target/generated-site/xsd
[INFO] Copying 3 resources
[INFO] Copying 3 resources
[INFO] [compiler:compile {execution: default-compile}]
[INFO] Nothing to compile - all classes are up to date
[INFO] [clirr:check {execution: default}]
[INFO] artifact org.apache.maven.doxia:doxia-module-xhtml: checking for updates from central
[INFO] Comparing to version: 1.3
Downloading: http://localhost:8192/maven2/org/apache/maven/doxia/doxia-module-xhtml/1.3/doxia-module-xhtml-1.3.jar
14K downloaded  (doxia-module-xhtml-1.3.jar)
Downloading: http://localhost:8192/maven2/org/apache/maven/doxia/doxia-module-xhtml/1.3/doxia-module-xhtml-1.3.pom
1K downloaded  (doxia-module-xhtml-1.3.pom)
Downloading: http://localhost:8192/maven2/org/apache/maven/doxia/doxia-modules/1.3/doxia-modules-1.3.pom
2K downloaded  (doxia-modules-1.3.pom)
[WARNING] *** CHECKSUM FAILED - Checksum failed on download: local = 'da39a3ee5e6b4b0d3255bfef95601890afd80709'; remote = '0a8852b90bf09d5e216167a45c4f8ecb0a9d82c1' - RETRYING
Downloading: http://localhost:8192/maven2/org/apache/maven/doxia/doxia-modules/1.3/doxia-modules-1.3.pom
2K downloaded  (doxia-modules-1.3.pom)
[WARNING] *** CHECKSUM FAILED - Checksum failed on download: local = 'da39a3ee5e6b4b0d3255bfef95601890afd80709'; remote = '0a8852b90bf09d5e216167a45c4f8ecb0a9d82c1' - IGNORING
[INFO] Unable to find resource 'org.apache.maven.doxia:doxia-modules:pom:1.3' in repository central (http://repo1.maven.org/maven2)
[INFO] ------------------------------------------------------------------------
[ERROR] BUILD ERROR
[INFO] ------------------------------------------------------------------------
[INFO] Failed to build project for previous artifact: Cannot find parent: org.apache.maven.doxia:doxia-modules for project: null:doxia-module-xhtml:jar:null for project null:doxia-module-xhtml:jar:null

Unable to download the artifact from any repository
[INFO] ------------------------------------------------------------------------
[INFO] For more information, run Maven with the -e switch
[INFO] ------------------------------------------------------------------------
[INFO] Total time: 30 seconds
[INFO] Finished at: Tue Jan 22 17:10:05 UTC 2013
[INFO] Final Memory: 37M/89M
[INFO] ------------------------------------------------------------------------
---------------------------------------------

To subscribe to this information via syndicated feeds:
- RSS: http://vmgump.apache.org/gump/public/doxia/doxia-module-xhtml/rss.xml
- Atom: http://vmgump.apache.org/gump/public/doxia/doxia-module-xhtml/atom.xml

============================== Gump Tracking Only ===
Produced by Apache Gump(TM) version 2.3.
Gump Run 10001222012013, vmgump.apache.org:vmgump:10001222012013
Gump E-mail Identifier (unique within run) #9.

*********************************************************** G U M P
[GUMP@vmgump]: Project cocoon22-servlet-service-impl (in module cocoon-subprojects) failed
To whom it may engage...
        
This is an automated request, but not an unsolicited one. For 
more information please visit http://gump.apache.org/nagged.html, 
and/or contact the folk at general@gump.apache.org.

Project cocoon22-servlet-service-impl has an issue affecting its community integration.
This issue affects 1 projects.
The current state of this project is 'Failed', with reason 'Build Failed'.
For reference only, the following projects are affected by this:
    - cocoon22-servlet-service-impl :  Java XML Framework


Full details are available at:
    http://vmgump.apache.org/gump/public/cocoon-subprojects/cocoon22-servlet-service-impl/index.html

That said, some information snippets are provided here.

The following annotations (debug/informational/warning/error messages) were provided:
 -INFO- Optional dependency cocoon22-spring-configurator failed with reason build failed
 -INFO- Optional dependency cocoon22-jnet failed with reason build failed
 -DEBUG- (Apache Gump generated) Apache Maven Settings in: /srv/gump/public/workspace/cocoon-subprojects/cocoon-servlet-service-impl/trunk/gump_mvn_settings.xml
 -INFO- Failed with reason build failed
 -DEBUG- Maven POM in: /srv/gump/public/workspace/cocoon-subprojects/cocoon-servlet-service-impl/trunk/pom.xml
 -INFO- Failed to extract fallback artifacts from Gump Repository



The following work was performed:
http://vmgump.apache.org/gump/public/cocoon-subprojects/cocoon22-servlet-service-impl/gump_work/build_cocoon-subprojects_cocoon22-servlet-service-impl.html
Work Name: build_cocoon-subprojects_cocoon22-servlet-service-impl (Type: Build)
Work ended in a state of : Failed
Elapsed: 19 secs
Command Line: /opt/maven2/bin/mvn --batch-mode --settings /srv/gump/public/workspace/cocoon-subprojects/cocoon-servlet-service-impl/trunk/gump_mvn_settings.xml install 
[Working Directory: /srv/gump/public/workspace/cocoon-subprojects/cocoon-servlet-service-impl/trunk]
M2_HOME: /opt/maven2
---------------------------------------------
[INFO] Copying 3 resources
[INFO] [compiler:compile {execution: default-compile}]
[INFO] Compiling 33 source files to /srv/gump/public/workspace/cocoon-subprojects/cocoon-servlet-service-impl/trunk/target/classes
[INFO] [resources:testResources {execution: default-testResources}]
[INFO] Using 'UTF-8' encoding to copy filtered resources.
[INFO] skip non existing resourceDirectory /srv/gump/public/workspace/cocoon-subprojects/cocoon-servlet-service-impl/trunk/src/test/resources
[INFO] Copying 3 resources
[INFO] [compiler:testCompile {execution: default-testCompile}]
[INFO] Compiling 4 source files to /srv/gump/public/workspace/cocoon-subprojects/cocoon-servlet-service-impl/trunk/target/test-classes
[INFO] [surefire:test {execution: default-test}]
[INFO] Surefire report directory: /srv/gump/public/workspace/cocoon-subprojects/cocoon-servlet-service-impl/trunk/target/surefire-reports

-------------------------------------------------------
 T E S T S
-------------------------------------------------------
Running org.apache.cocoon.servletservice.HttpServletResponseBufferingWrapperTestCase
log4j:WARN No appenders could be found for logger (org.apache.cocoon.servletservice.HttpServletResponseBufferingWrapper$ForwardingOrLimitingServletOutputStream).
log4j:WARN Please initialize the log4j system properly.
Tests run: 8, Failures: 0, Errors: 0, Skipped: 0, Time elapsed: 0.388 sec
Running org.apache.cocoon.servletservice.ServletServiceContextTestCase
Tests run: 5, Failures: 0, Errors: 0, Skipped: 0, Time elapsed: 0.082 sec
Running org.apache.cocoon.servletservice.util.ServletServiceResponseTestCase
Tests run: 1, Failures: 0, Errors: 0, Skipped: 0, Time elapsed: 0.014 sec
Running org.apache.cocoon.servletservice.util.RequestParametersTestCase
Tests run: 5, Failures: 0, Errors: 0, Skipped: 0, Time elapsed: 0.018 sec

Results :

Tests run: 19, Failures: 0, Errors: 0, Skipped: 0

[INFO] [jar:jar {execution: default-jar}]
[INFO] Building jar: /srv/gump/public/workspace/cocoon-subprojects/cocoon-servlet-service-impl/trunk/target/cocoon-servlet-service-impl-1.3.3-SNAPSHOT.jar
[INFO] ------------------------------------------------------------------------
[ERROR] BUILD ERROR
[INFO] ------------------------------------------------------------------------
[INFO] Error building POM (may not be this project's POM).


Project ID: null:doxia-module-xhtml:jar:null

Reason: Cannot find parent: org.apache.maven.doxia:doxia-modules for project: null:doxia-module-xhtml:jar:null for project null:doxia-module-xhtml:jar:null


[INFO] ------------------------------------------------------------------------
[INFO] For more information, run Maven with the -e switch
[INFO] ------------------------------------------------------------------------
[INFO] Total time: 18 seconds
[INFO] Finished at: Tue Jan 22 17:13:47 UTC 2013
[INFO] Final Memory: 51M/123M
[INFO] ------------------------------------------------------------------------
---------------------------------------------

To subscribe to this information via syndicated feeds:
- RSS: http://vmgump.apache.org/gump/public/cocoon-subprojects/cocoon22-servlet-service-impl/rss.xml
- Atom: http://vmgump.apache.org/gump/public/cocoon-subprojects/cocoon22-servlet-service-impl/atom.xml

============================== Gump Tracking Only ===
Produced by Apache Gump(TM) version 2.3.
Gump Run 10001222012013, vmgump.apache.org:vmgump:10001222012013
Gump E-mail Identifier (unique within run) #10.

*********************************************************** G U M P
[GUMP@vmgump]: Project doxia-module-apt (in module doxia) failed
To whom it may engage...
        
This is an automated request, but not an unsolicited one. For 
more information please visit http://gump.apache.org/nagged.html, 
and/or contact the folk at general@gump.apache.org.

Project doxia-module-apt has an issue affecting its community integration.
This issue affects 1 projects.
The current state of this project is 'Failed', with reason 'Build Failed'.
For reference only, the following projects are affected by this:
    - doxia-module-apt :  A content generation framework which aims to provide its use...


Full details are available at:
    http://vmgump.apache.org/gump/public/doxia/doxia-module-apt/index.html

That said, some information snippets are provided here.

The following annotations (debug/informational/warning/error messages) were provided:
 -DEBUG- Sole jar output [doxia-module-apt-*[0-9T].jar] identifier set to project name
 -DEBUG- (Apache Gump generated) Apache Maven Settings in: /srv/gump/public/workspace/doxia/doxia/doxia-modules/doxia-module-apt/gump_mvn_settings.xml
 -INFO- Failed with reason build failed
 -DEBUG- Maven POM in: /srv/gump/public/workspace/doxia/doxia/doxia-modules/doxia-module-apt/pom.xml
 -INFO- Failed to extract fallback artifacts from Gump Repository



The following work was performed:
http://vmgump.apache.org/gump/public/doxia/doxia-module-apt/gump_work/build_doxia_doxia-module-apt.html
Work Name: build_doxia_doxia-module-apt (Type: Build)
Work ended in a state of : Failed
Elapsed: 34 secs
Command Line: /opt/maven2/bin/mvn --batch-mode --settings /srv/gump/public/workspace/doxia/doxia/doxia-modules/doxia-module-apt/gump_mvn_settings.xml install 
[Working Directory: /srv/gump/public/workspace/doxia/doxia/doxia-modules/doxia-module-apt]
M2_HOME: /opt/maven2
---------------------------------------------
Tests run: 1, Failures: 0, Errors: 0, Skipped: 0, Time elapsed: 0.044 sec
Running org.apache.maven.doxia.module.apt.AptSinkTest
Tests run: 31, Failures: 0, Errors: 0, Skipped: 0, Time elapsed: 0.751 sec

Results :

Tests run: 54, Failures: 0, Errors: 0, Skipped: 0

[INFO] [jar:jar {execution: default-jar}]
[INFO] Building jar: /srv/gump/public/workspace/doxia/doxia/doxia-modules/doxia-module-apt/target/doxia-module-apt-1.4-SNAPSHOT.jar
[INFO] Preparing clirr:check
[WARNING] Removing: check from forked lifecycle, to prevent recursive invocation.
[WARNING] The parameter expression: 'project.build.resources' used in mojo: 'process' has been deprecated. Use 'project.resources' instead.
[INFO] [remote-resources:process {execution: default}]
[debug] execute contextualize
[INFO] [resources:resources {execution: default-resources}]
[INFO] Using 'UTF-8' encoding to copy filtered resources.
[INFO] Copying 1 resource
[INFO] skip non existing resourceDirectory /srv/gump/public/workspace/doxia/doxia/doxia-modules/doxia-module-apt/target/generated-site/xsd
[INFO] Copying 3 resources
[INFO] Copying 3 resources
[INFO] [compiler:compile {execution: default-compile}]
[INFO] Nothing to compile - all classes are up to date
[INFO] [clirr:check {execution: default}]
[INFO] artifact org.apache.maven.doxia:doxia-module-apt: checking for updates from central
[INFO] Comparing to version: 1.3
Downloading: http://localhost:8192/maven2/org/apache/maven/doxia/doxia-module-apt/1.3/doxia-module-apt-1.3.jar
50K downloaded  (doxia-module-apt-1.3.jar)
Downloading: http://localhost:8192/maven2/org/apache/maven/doxia/doxia-module-apt/1.3/doxia-module-apt-1.3.pom
2K downloaded  (doxia-module-apt-1.3.pom)
Downloading: http://localhost:8192/maven2/org/apache/maven/doxia/doxia-modules/1.3/doxia-modules-1.3.pom
2K downloaded  (doxia-modules-1.3.pom)
[WARNING] *** CHECKSUM FAILED - Checksum failed on download: local = 'da39a3ee5e6b4b0d3255bfef95601890afd80709'; remote = '0a8852b90bf09d5e216167a45c4f8ecb0a9d82c1' - RETRYING
Downloading: http://localhost:8192/maven2/org/apache/maven/doxia/doxia-modules/1.3/doxia-modules-1.3.pom
2K downloaded  (doxia-modules-1.3.pom)
[WARNING] *** CHECKSUM FAILED - Checksum failed on download: local = 'da39a3ee5e6b4b0d3255bfef95601890afd80709'; remote = '0a8852b90bf09d5e216167a45c4f8ecb0a9d82c1' - IGNORING
[INFO] Unable to find resource 'org.apache.maven.doxia:doxia-modules:pom:1.3' in repository central (http://repo1.maven.org/maven2)
[INFO] ------------------------------------------------------------------------
[ERROR] BUILD ERROR
[INFO] ------------------------------------------------------------------------
[INFO] Failed to build project for previous artifact: Cannot find parent: org.apache.maven.doxia:doxia-modules for project: null:doxia-module-apt:jar:null for project null:doxia-module-apt:jar:null

Unable to download the artifact from any repository
[INFO] ------------------------------------------------------------------------
[INFO] For more information, run Maven with the -e switch
[INFO] ------------------------------------------------------------------------
[INFO] Total time: 32 seconds
[INFO] Finished at: Tue Jan 22 17:35:28 UTC 2013
[INFO] Final Memory: 37M/90M
[INFO] ------------------------------------------------------------------------
---------------------------------------------

To subscribe to this information via syndicated feeds:
- RSS: http://vmgump.apache.org/gump/public/doxia/doxia-module-apt/rss.xml
- Atom: http://vmgump.apache.org/gump/public/doxia/doxia-module-apt/atom.xml

============================== Gump Tracking Only ===
Produced by Apache Gump(TM) version 2.3.
Gump Run 10001222012013, vmgump.apache.org:vmgump:10001222012013
Gump E-mail Identifier (unique within run) #11.

*********************************************************** G U M P
[GUMP@vmgump]: Project doxia-module-fml (in module doxia) failed
To whom it may engage...
        
This is an automated request, but not an unsolicited one. For 
more information please visit http://gump.apache.org/nagged.html, 
and/or contact the folk at general@gump.apache.org.

Project doxia-module-fml has an issue affecting its community integration.
This issue affects 1 projects.
The current state of this project is 'Failed', with reason 'Build Failed'.
For reference only, the following projects are affected by this:
    - doxia-module-fml :  A content generation framework which aims to provide its use...


Full details are available at:
    http://vmgump.apache.org/gump/public/doxia/doxia-module-fml/index.html

That said, some information snippets are provided here.

The following annotations (debug/informational/warning/error messages) were provided:
 -DEBUG- Sole jar output [doxia-module-fml-*[0-9T].jar] identifier set to project name
 -DEBUG- (Apache Gump generated) Apache Maven Settings in: /srv/gump/public/workspace/doxia/doxia/doxia-modules/doxia-module-fml/gump_mvn_settings.xml
 -INFO- Failed with reason build failed
 -DEBUG- Maven POM in: /srv/gump/public/workspace/doxia/doxia/doxia-modules/doxia-module-fml/pom.xml
 -INFO- Failed to extract fallback artifacts from Gump Repository



The following work was performed:
http://vmgump.apache.org/gump/public/doxia/doxia-module-fml/gump_work/build_doxia_doxia-module-fml.html
Work Name: build_doxia_doxia-module-fml (Type: Build)
Work ended in a state of : Failed
Elapsed: 33 secs
Command Line: /opt/maven2/bin/mvn --batch-mode --settings /srv/gump/public/workspace/doxia/doxia/doxia-modules/doxia-module-fml/gump_mvn_settings.xml install 
[Working Directory: /srv/gump/public/workspace/doxia/doxia/doxia-modules/doxia-module-fml]
M2_HOME: /opt/maven2
---------------------------------------------
Results :

Tests run: 6, Failures: 0, Errors: 0, Skipped: 0

[INFO] [jar:jar {execution: default-jar}]
[INFO] Building jar: /srv/gump/public/workspace/doxia/doxia/doxia-modules/doxia-module-fml/target/doxia-module-fml-1.4-SNAPSHOT.jar
[INFO] Preparing clirr:check
[WARNING] Removing: check from forked lifecycle, to prevent recursive invocation.
[INFO] [modello:java {execution: descriptor}]
[INFO] outputDirectory: /srv/gump/public/workspace/doxia/doxia/doxia-modules/doxia-module-fml/target/generated-sources/modello
[INFO] Working on model: src/main/mdo/fml.mdo
[INFO] Generating current version: 1.0.0
[WARNING] The parameter expression: 'project.build.resources' used in mojo: 'process' has been deprecated. Use 'project.resources' instead.
[INFO] [remote-resources:process {execution: default}]
[debug] execute contextualize
[INFO] [resources:resources {execution: default-resources}]
[INFO] Using 'UTF-8' encoding to copy filtered resources.
[INFO] Copying 2 resources
[INFO] skip non existing resourceDirectory /srv/gump/public/workspace/doxia/doxia/doxia-modules/doxia-module-fml/target/generated-site/xsd
[INFO] Copying 3 resources
[INFO] Copying 3 resources
[INFO] [compiler:compile {execution: default-compile}]
[INFO] Compiling 3 source files to /srv/gump/public/workspace/doxia/doxia/doxia-modules/doxia-module-fml/target/classes
[INFO] [clirr:check {execution: default}]
[INFO] artifact org.apache.maven.doxia:doxia-module-fml: checking for updates from central
[INFO] Comparing to version: 1.3
Downloading: http://localhost:8192/maven2/org/apache/maven/doxia/doxia-module-fml/1.3/doxia-module-fml-1.3.jar
36K downloaded  (doxia-module-fml-1.3.jar)
Downloading: http://localhost:8192/maven2/org/apache/maven/doxia/doxia-module-fml/1.3/doxia-module-fml-1.3.pom
5K downloaded  (doxia-module-fml-1.3.pom)
Downloading: http://localhost:8192/maven2/org/apache/maven/doxia/doxia-modules/1.3/doxia-modules-1.3.pom
2K downloaded  (doxia-modules-1.3.pom)
[WARNING] *** CHECKSUM FAILED - Checksum failed on download: local = 'da39a3ee5e6b4b0d3255bfef95601890afd80709'; remote = '0a8852b90bf09d5e216167a45c4f8ecb0a9d82c1' - RETRYING
Downloading: http://localhost:8192/maven2/org/apache/maven/doxia/doxia-modules/1.3/doxia-modules-1.3.pom
2K downloaded  (doxia-modules-1.3.pom)
[WARNING] *** CHECKSUM FAILED - Checksum failed on download: local = 'da39a3ee5e6b4b0d3255bfef95601890afd80709'; remote = '0a8852b90bf09d5e216167a45c4f8ecb0a9d82c1' - IGNORING
[INFO] Unable to find resource 'org.apache.maven.doxia:doxia-modules:pom:1.3' in repository central (http://repo1.maven.org/maven2)
[INFO] ------------------------------------------------------------------------
[ERROR] BUILD ERROR
[INFO] ------------------------------------------------------------------------
[INFO] Failed to build project for previous artifact: Cannot find parent: org.apache.maven.doxia:doxia-modules for project: null:doxia-module-fml:jar:null for project null:doxia-module-fml:jar:null

Unable to download the artifact from any repository
[INFO] ------------------------------------------------------------------------
[INFO] For more information, run Maven with the -e switch
[INFO] ------------------------------------------------------------------------
[INFO] Total time: 32 seconds
[INFO] Finished at: Tue Jan 22 17:36:07 UTC 2013
[INFO] Final Memory: 42M/100M
[INFO] ------------------------------------------------------------------------
---------------------------------------------

To subscribe to this information via syndicated feeds:
- RSS: http://vmgump.apache.org/gump/public/doxia/doxia-module-fml/rss.xml
- Atom: http://vmgump.apache.org/gump/public/doxia/doxia-module-fml/atom.xml

============================== Gump Tracking Only ===
Produced by Apache Gump(TM) version 2.3.
Gump Run 10001222012013, vmgump.apache.org:vmgump:10001222012013
Gump E-mail Identifier (unique within run) #12.

*********************************************************** G U M P
[GUMP@vmgump]: Project doxia-module-confluence (in module doxia) failed
To whom it may engage...
        
This is an automated request, but not an unsolicited one. For 
more information please visit http://gump.apache.org/nagged.html, 
and/or contact the folk at general@gump.apache.org.

Project doxia-module-confluence has an issue affecting its community integration.
This issue affects 1 projects.
The current state of this project is 'Failed', with reason 'Build Failed'.
For reference only, the following projects are affected by this:
    - doxia-module-confluence :  A content generation framework which aims to provide its use...


Full details are available at:
    http://vmgump.apache.org/gump/public/doxia/doxia-module-confluence/index.html

That said, some information snippets are provided here.

The following annotations (debug/informational/warning/error messages) were provided:
 -DEBUG- Sole jar output [doxia-module-confluence-*[0-9T].jar] identifier set to project name
 -DEBUG- (Apache Gump generated) Apache Maven Settings in: /srv/gump/public/workspace/doxia/doxia/doxia-modules/doxia-module-confluence/gump_mvn_settings.xml
 -INFO- Failed with reason build failed
 -DEBUG- Maven POM in: /srv/gump/public/workspace/doxia/doxia/doxia-modules/doxia-module-confluence/pom.xml
 -INFO- Failed to extract fallback artifacts from Gump Repository



The following work was performed:
http://vmgump.apache.org/gump/public/doxia/doxia-module-confluence/gump_work/build_doxia_doxia-module-confluence.html
Work Name: build_doxia_doxia-module-confluence (Type: Build)
Work ended in a state of : Failed
Elapsed: 31 secs
Command Line: /opt/maven2/bin/mvn --batch-mode --settings /srv/gump/public/workspace/doxia/doxia/doxia-modules/doxia-module-confluence/gump_mvn_settings.xml install 
[Working Directory: /srv/gump/public/workspace/doxia/doxia/doxia-modules/doxia-module-confluence]
M2_HOME: /opt/maven2
---------------------------------------------
Tests run: 31, Failures: 0, Errors: 0, Skipped: 0, Time elapsed: 1.98 sec
Running org.apache.maven.doxia.module.confluence.ConfluenceParserTest
Tests run: 25, Failures: 0, Errors: 0, Skipped: 0, Time elapsed: 0.827 sec

Results :

Tests run: 56, Failures: 0, Errors: 0, Skipped: 0

[INFO] [jar:jar {execution: default-jar}]
[INFO] Building jar: /srv/gump/public/workspace/doxia/doxia/doxia-modules/doxia-module-confluence/target/doxia-module-confluence-1.4-SNAPSHOT.jar
[INFO] Preparing clirr:check
[WARNING] Removing: check from forked lifecycle, to prevent recursive invocation.
[WARNING] The parameter expression: 'project.build.resources' used in mojo: 'process' has been deprecated. Use 'project.resources' instead.
[INFO] [remote-resources:process {execution: default}]
[debug] execute contextualize
[INFO] [resources:resources {execution: default-resources}]
[INFO] Using 'UTF-8' encoding to copy filtered resources.
[INFO] skip non existing resourceDirectory /srv/gump/public/workspace/doxia/doxia/doxia-modules/doxia-module-confluence/src/main/resources
[INFO] skip non existing resourceDirectory /srv/gump/public/workspace/doxia/doxia/doxia-modules/doxia-module-confluence/target/generated-site/xsd
[INFO] Copying 3 resources
[INFO] Copying 3 resources
[INFO] [compiler:compile {execution: default-compile}]
[INFO] Nothing to compile - all classes are up to date
[INFO] [clirr:check {execution: default}]
[INFO] artifact org.apache.maven.doxia:doxia-module-confluence: checking for updates from central
[INFO] Comparing to version: 1.3
Downloading: http://localhost:8192/maven2/org/apache/maven/doxia/doxia-module-confluence/1.3/doxia-module-confluence-1.3.jar
50K downloaded  (doxia-module-confluence-1.3.jar)
Downloading: http://localhost:8192/maven2/org/apache/maven/doxia/doxia-module-confluence/1.3/doxia-module-confluence-1.3.pom
2K downloaded  (doxia-module-confluence-1.3.pom)
Downloading: http://localhost:8192/maven2/org/apache/maven/doxia/doxia-modules/1.3/doxia-modules-1.3.pom
2K downloaded  (doxia-modules-1.3.pom)
[WARNING] *** CHECKSUM FAILED - Checksum failed on download: local = 'da39a3ee5e6b4b0d3255bfef95601890afd80709'; remote = '0a8852b90bf09d5e216167a45c4f8ecb0a9d82c1' - RETRYING
Downloading: http://localhost:8192/maven2/org/apache/maven/doxia/doxia-modules/1.3/doxia-modules-1.3.pom
2K downloaded  (doxia-modules-1.3.pom)
[WARNING] *** CHECKSUM FAILED - Checksum failed on download: local = 'da39a3ee5e6b4b0d3255bfef95601890afd80709'; remote = '0a8852b90bf09d5e216167a45c4f8ecb0a9d82c1' - IGNORING
[INFO] Unable to find resource 'org.apache.maven.doxia:doxia-modules:pom:1.3' in repository central (http://repo1.maven.org/maven2)
[INFO] ------------------------------------------------------------------------
[ERROR] BUILD ERROR
[INFO] ------------------------------------------------------------------------
[INFO] Failed to build project for previous artifact: Cannot find parent: org.apache.maven.doxia:doxia-modules for project: null:doxia-module-confluence:jar:null for project null:doxia-module-confluence:jar:null

Unable to download the artifact from any repository
[INFO] ------------------------------------------------------------------------
[INFO] For more information, run Maven with the -e switch
[INFO] ------------------------------------------------------------------------
[INFO] Total time: 30 seconds
[INFO] Finished at: Tue Jan 22 17:45:43 UTC 2013
[INFO] Final Memory: 37M/90M
[INFO] ------------------------------------------------------------------------
---------------------------------------------

To subscribe to this information via syndicated feeds:
- RSS: http://vmgump.apache.org/gump/public/doxia/doxia-module-confluence/rss.xml
- Atom: http://vmgump.apache.org/gump/public/doxia/doxia-module-confluence/atom.xml

============================== Gump Tracking Only ===
Produced by Apache Gump(TM) version 2.3.
Gump Run 10001222012013, vmgump.apache.org:vmgump:10001222012013
Gump E-mail Identifier (unique within run) #13.

*********************************************************** G U M P
[GUMP@vmgump]: Project doxia-module-xdoc (in module doxia) failed
To whom it may engage...
        
This is an automated request, but not an unsolicited one. For 
more information please visit http://gump.apache.org/nagged.html, 
and/or contact the folk at general@gump.apache.org.

Project doxia-module-xdoc has an issue affecting its community integration.
This issue affects 1 projects.
The current state of this project is 'Failed', with reason 'Build Failed'.
For reference only, the following projects are affected by this:
    - doxia-module-xdoc :  A content generation framework which aims to provide its use...


Full details are available at:
    http://vmgump.apache.org/gump/public/doxia/doxia-module-xdoc/index.html

That said, some information snippets are provided here.

The following annotations (debug/informational/warning/error messages) were provided:
 -DEBUG- Sole jar output [doxia-module-xdoc-*[0-9T].jar] identifier set to project name
 -DEBUG- (Apache Gump generated) Apache Maven Settings in: /srv/gump/public/workspace/doxia/doxia/doxia-modules/doxia-module-xdoc/gump_mvn_settings.xml
 -INFO- Failed with reason build failed
 -DEBUG- Maven POM in: /srv/gump/public/workspace/doxia/doxia/doxia-modules/doxia-module-xdoc/pom.xml
 -INFO- Failed to extract fallback artifacts from Gump Repository



The following work was performed:
http://vmgump.apache.org/gump/public/doxia/doxia-module-xdoc/gump_work/build_doxia_doxia-module-xdoc.html
Work Name: build_doxia_doxia-module-xdoc (Type: Build)
Work ended in a state of : Failed
Elapsed: 31 secs
Command Line: /opt/maven2/bin/mvn --batch-mode --settings /srv/gump/public/workspace/doxia/doxia/doxia-modules/doxia-module-xdoc/gump_mvn_settings.xml install 
[Working Directory: /srv/gump/public/workspace/doxia/doxia/doxia-modules/doxia-module-xdoc]
M2_HOME: /opt/maven2
---------------------------------------------
Running org.apache.maven.doxia.module.xdoc.XdocSinkWithLanguageIdTest
[WARNING] [Xhtml Sink] Modified invalid comment: 'Simple comment with ----' to 'Simple comment with - - - -'
Tests run: 33, Failures: 0, Errors: 0, Skipped: 0, Time elapsed: 0.64 sec

Results :

Tests run: 85, Failures: 0, Errors: 0, Skipped: 0

[INFO] [jar:jar {execution: default-jar}]
[INFO] Building jar: /srv/gump/public/workspace/doxia/doxia/doxia-modules/doxia-module-xdoc/target/doxia-module-xdoc-1.4-SNAPSHOT.jar
[INFO] Preparing clirr:check
[WARNING] Removing: check from forked lifecycle, to prevent recursive invocation.
[WARNING] The parameter expression: 'project.build.resources' used in mojo: 'process' has been deprecated. Use 'project.resources' instead.
[INFO] [remote-resources:process {execution: default}]
[debug] execute contextualize
[INFO] [resources:resources {execution: default-resources}]
[INFO] Using 'UTF-8' encoding to copy filtered resources.
[INFO] Copying 2 resources
[INFO] skip non existing resourceDirectory /srv/gump/public/workspace/doxia/doxia/doxia-modules/doxia-module-xdoc/target/generated-site/xsd
[INFO] Copying 3 resources
[INFO] Copying 3 resources
[INFO] [compiler:compile {execution: default-compile}]
[INFO] Nothing to compile - all classes are up to date
[INFO] [clirr:check {execution: default}]
[INFO] artifact org.apache.maven.doxia:doxia-module-xdoc: checking for updates from central
[INFO] Comparing to version: 1.3
Downloading: http://localhost:8192/maven2/org/apache/maven/doxia/doxia-module-xdoc/1.3/doxia-module-xdoc-1.3.jar
35K downloaded  (doxia-module-xdoc-1.3.jar)
Downloading: http://localhost:8192/maven2/org/apache/maven/doxia/doxia-module-xdoc/1.3/doxia-module-xdoc-1.3.pom
5K downloaded  (doxia-module-xdoc-1.3.pom)
Downloading: http://localhost:8192/maven2/org/apache/maven/doxia/doxia-modules/1.3/doxia-modules-1.3.pom
2K downloaded  (doxia-modules-1.3.pom)
[WARNING] *** CHECKSUM FAILED - Checksum failed on download: local = 'da39a3ee5e6b4b0d3255bfef95601890afd80709'; remote = '0a8852b90bf09d5e216167a45c4f8ecb0a9d82c1' - RETRYING
Downloading: http://localhost:8192/maven2/org/apache/maven/doxia/doxia-modules/1.3/doxia-modules-1.3.pom
2K downloaded  (doxia-modules-1.3.pom)
[WARNING] *** CHECKSUM FAILED - Checksum failed on download: local = 'da39a3ee5e6b4b0d3255bfef95601890afd80709'; remote = '0a8852b90bf09d5e216167a45c4f8ecb0a9d82c1' - IGNORING
[INFO] Unable to find resource 'org.apache.maven.doxia:doxia-modules:pom:1.3' in repository central (http://repo1.maven.org/maven2)
[INFO] ------------------------------------------------------------------------
[ERROR] BUILD ERROR
[INFO] ------------------------------------------------------------------------
[INFO] Failed to build project for previous artifact: Cannot find parent: org.apache.maven.doxia:doxia-modules for project: null:doxia-module-xdoc:jar:null for project null:doxia-module-xdoc:jar:null

Unable to download the artifact from any repository
[INFO] ------------------------------------------------------------------------
[INFO] For more information, run Maven with the -e switch
[INFO] ------------------------------------------------------------------------
[INFO] Total time: 30 seconds
[INFO] Finished at: Tue Jan 22 17:51:44 UTC 2013
[INFO] Final Memory: 37M/89M
[INFO] ------------------------------------------------------------------------
---------------------------------------------

To subscribe to this information via syndicated feeds:
- RSS: http://vmgump.apache.org/gump/public/doxia/doxia-module-xdoc/rss.xml
- Atom: http://vmgump.apache.org/gump/public/doxia/doxia-module-xdoc/atom.xml

============================== Gump Tracking Only ===
Produced by Apache Gump(TM) version 2.3.
Gump Run 10001222012013, vmgump.apache.org:vmgump:10001222012013
Gump E-mail Identifier (unique within run) #14.

*********************************************************** G U M P
[GUMP@vmgump]: Project doxia-site-renderer (in module doxia) failed
To whom it may engage...
        
This is an automated request, but not an unsolicited one. For 
more information please visit http://gump.apache.org/nagged.html, 
and/or contact the folk at general@gump.apache.org.

Project doxia-site-renderer has an issue affecting its community integration.
This issue affects 2 projects.
The current state of this project is 'Failed', with reason 'Build Failed'.
For reference only, the following projects are affected by this:
    - doxia-site-renderer :  A content generation framework which aims to provide its use...
    - doxia-site-renderer-test :  A content generation framework which aims to provide its use...


Full details are available at:
    http://vmgump.apache.org/gump/public/doxia/doxia-site-renderer/index.html

That said, some information snippets are provided here.

The following annotations (debug/informational/warning/error messages) were provided:
 -DEBUG- Sole jar output [doxia-site-renderer-*[0-9T].jar] identifier set to project name
 -INFO- Optional dependency velocity-engine prerequisite failed with reason build failed
 -INFO- Optional dependency doxia-module-docbook-simple failed with reason build failed
 -INFO- Optional dependency doxia-module-xhtml failed with reason build failed
 -INFO- Optional dependency doxia-module-apt failed with reason build failed
 -INFO- Optional dependency doxia-module-fml failed with reason build failed
 -INFO- Optional dependency doxia-module-confluence failed with reason build failed
 -INFO- Optional dependency doxia-module-xdoc failed with reason build failed
 -DEBUG- (Apache Gump generated) Apache Maven Settings in: /srv/gump/public/workspace/doxia/doxia-sitetools/doxia-site-renderer/gump_mvn_settings.xml
 -INFO- Failed with reason build failed
 -DEBUG- Maven POM in: /srv/gump/public/workspace/doxia/doxia-sitetools/doxia-site-renderer/pom.xml
 -INFO- Failed to extract fallback artifacts from Gump Repository



The following work was performed:
http://vmgump.apache.org/gump/public/doxia/doxia-site-renderer/gump_work/build_doxia_doxia-site-renderer.html
Work Name: build_doxia_doxia-site-renderer (Type: Build)
Work ended in a state of : Failed
Elapsed: 18 secs
Command Line: /opt/maven2/bin/mvn --batch-mode -DskipTests=true --settings /srv/gump/public/workspace/doxia/doxia-sitetools/doxia-site-renderer/gump_mvn_settings.xml install 
[Working Directory: /srv/gump/public/workspace/doxia/doxia-sitetools/doxia-site-renderer]
M2_HOME: /opt/maven2
---------------------------------------------
[INFO] Scanning for projects...
[INFO] ------------------------------------------------------------------------
[INFO] Building Site Renderer
[INFO]    task-segment: [install]
[INFO] ------------------------------------------------------------------------
[WARNING] The parameter expression: 'project.build.resources' used in mojo: 'process' has been deprecated. Use 'project.resources' instead.
[INFO] [remote-resources:process {execution: default}]
[INFO] snapshot org.apache.maven.doxia:doxia-decoration-model:1.4-SNAPSHOT: checking for updates from apache.snapshots
Downloading: http://localhost:8192/maven2/org/apache/maven/doxia/doxia-modules/1.3/doxia-modules-1.3.pom
2K downloaded  (doxia-modules-1.3.pom)
[WARNING] *** CHECKSUM FAILED - Checksum failed on download: local = 'da39a3ee5e6b4b0d3255bfef95601890afd80709'; remote = '0a8852b90bf09d5e216167a45c4f8ecb0a9d82c1' - RETRYING
Downloading: http://localhost:8192/maven2/org/apache/maven/doxia/doxia-modules/1.3/doxia-modules-1.3.pom
2K downloaded  (doxia-modules-1.3.pom)
[WARNING] *** CHECKSUM FAILED - Checksum failed on download: local = 'da39a3ee5e6b4b0d3255bfef95601890afd80709'; remote = '0a8852b90bf09d5e216167a45c4f8ecb0a9d82c1' - IGNORING
[INFO] Unable to find resource 'org.apache.maven.doxia:doxia-modules:pom:1.3' in repository central (http://repo1.maven.org/maven2)
[INFO] ------------------------------------------------------------------------
[ERROR] BUILD ERROR
[INFO] ------------------------------------------------------------------------
[INFO] Failed to resolve dependencies for one or more projects in the reactor. Reason: Unable to get dependency information: Unable to read the metadata file for artifact 'org.apache.maven.doxia:doxia-module-apt:jar': Cannot find parent: org.apache.maven.doxia:doxia-modules for project: null:doxia-module-apt:jar:null for project null:doxia-module-apt:jar:null
  org.apache.maven.doxia:doxia-module-apt:jar:1.3

from the specified remote repositories:
  apache.snapshots (http://repository.apache.org/snapshots),
  central (http://repo1.maven.org/maven2)

Path to dependency: 
	1) org.apache.maven.doxia:doxia-site-renderer:jar:1.4-SNAPSHOT



Unable to download the artifact from any repository
[INFO] ------------------------------------------------------------------------
[INFO] For more information, run Maven with the -e switch
[INFO] ------------------------------------------------------------------------
[INFO] Total time: 17 seconds
[INFO] Finished at: Tue Jan 22 17:54:36 UTC 2013
[INFO] Final Memory: 19M/47M
[INFO] ------------------------------------------------------------------------
---------------------------------------------

To subscribe to this information via syndicated feeds:
- RSS: http://vmgump.apache.org/gump/public/doxia/doxia-site-renderer/rss.xml
- Atom: http://vmgump.apache.org/gump/public/doxia/doxia-site-renderer/atom.xml

============================== Gump Tracking Only ===
Produced by Apache Gump(TM) version 2.3.
Gump Run 10001222012013, vmgump.apache.org:vmgump:10001222012013
Gump E-mail Identifier (unique within run) #15.

*********************************************************** G U M P
[GUMP@vmgump]: Project openjpa-lib (in module openjpa) failed
To whom it may engage...
        
This is an automated request, but not an unsolicited one. For 
more information please visit http://gump.apache.org/nagged.html, 
and/or contact the folk at general@gump.apache.org.

Project openjpa-lib has an issue affecting its community integration.
This issue affects 9 projects.
The current state of this project is 'Failed', with reason 'Build Failed'.
For reference only, the following projects are affected by this:
    - openjpa :  Apache OpenJPA is a Java persistence project that can be use...
    - openjpa-jdbc :  Apache OpenJPA is a Java persistence project that can be use...
    - openjpa-kernel :  Apache OpenJPA is a Java persistence project that can be use...
    - openjpa-lib :  Apache OpenJPA is a Java persistence project that can be use...
    - openjpa-persistence :  Apache OpenJPA is a Java persistence project that can be use...
    - openjpa-persistence-jdbc :  Apache OpenJPA is a Java persistence project that can be use...
    - openjpa-slice :  Apache OpenJPA is a Java persistence project that can be use...
    - openjpa-testsupport :  Apache OpenJPA is a Java persistence project that can be use...
    - openjpa-xmlstore :  Apache OpenJPA is a Java persistence project that can be use...


Full details are available at:
    http://vmgump.apache.org/gump/public/openjpa/openjpa-lib/index.html

That said, some information snippets are provided here.

The following annotations (debug/informational/warning/error messages) were provided:
 -DEBUG- Sole jar output [openjpa-lib-*[0-9T].jar] identifier set to project name
 -INFO- Optional dependency commons-logging prerequisite failed with reason build failed
 -INFO- Optional dependency logging-log4j-12 failed with reason build failed
 -DEBUG- (Apache Gump generated) Apache Maven Settings in: /srv/gump/public/workspace/openjpa/openjpa-lib/gump_mvn_settings.xml
 -INFO- Failed with reason build failed
 -DEBUG- Maven POM in: /srv/gump/public/workspace/openjpa/openjpa-lib/pom.xml
 -DEBUG- Extracted fallback artifacts from Gump Repository



The following work was performed:
http://vmgump.apache.org/gump/public/openjpa/openjpa-lib/gump_work/build_openjpa_openjpa-lib.html
Work Name: build_openjpa_openjpa-lib (Type: Build)
Work ended in a state of : Failed
Elapsed: 35 secs
Command Line: /opt/maven2/bin/mvn --batch-mode -Dcheckstyle.skip=true --settings /srv/gump/public/workspace/openjpa/openjpa-lib/gump_mvn_settings.xml package 
[Working Directory: /srv/gump/public/workspace/openjpa/openjpa-lib]
M2_HOME: /opt/maven2
---------------------------------------------
69K downloaded  (maven-scm-provider-cvs-commons-1.2.jar)
Downloading: http://localhost:8192/maven2/org/apache/maven/scm/maven-scm-provider-starteam/1.2/maven-scm-provider-starteam-1.2.jar
69K downloaded  (maven-scm-provider-starteam-1.2.jar)
Downloading: http://localhost:8192/maven2/org/apache/maven/scm/maven-scm-provider-clearcase/1.2/maven-scm-provider-clearcase-1.2.jar
62K downloaded  (maven-scm-provider-clearcase-1.2.jar)
Downloading: http://localhost:8192/maven2/org/apache/maven/scm/maven-scm-provider-perforce/1.2/maven-scm-provider-perforce-1.2.jar
66K downloaded  (maven-scm-provider-perforce-1.2.jar)
Downloading: http://localhost:8192/maven2/org/apache/maven/scm/maven-scm-provider-hg/1.2/maven-scm-provider-hg-1.2.jar
51K downloaded  (maven-scm-provider-hg-1.2.jar)
[INFO] ------------------------------------------------------------------------
[ERROR] BUILD ERROR
[INFO] ------------------------------------------------------------------------
[INFO] Failed to resolve artifact.

Missing:
----------
1) org.apache.maven.scm:maven-scm-manager-plexus:jar:1.2

  Try downloading the file manually from the project website.

  Then, install it using the command: 
      mvn install:install-file -DgroupId=org.apache.maven.scm -DartifactId=maven-scm-manager-plexus -Dversion=1.2 -Dpackaging=jar -Dfile=/path/to/file

  Alternatively, if you host your own repository you can deploy the file there: 
      mvn deploy:deploy-file -DgroupId=org.apache.maven.scm -DartifactId=maven-scm-manager-plexus -Dversion=1.2 -Dpackaging=jar -Dfile=/path/to/file -Durl=[url] -DrepositoryId=[id]

  Path to dependency: 
  	1) org.codehaus.mojo:buildnumber-maven-plugin:maven-plugin:1.0-beta-4
  	2) org.apache.maven.scm:maven-scm-manager-plexus:jar:1.2

----------
1 required artifact is missing.

for artifact: 
  org.codehaus.mojo:buildnumber-maven-plugin:maven-plugin:1.0-beta-4

from the specified remote repositories:
  gump-central (http://localhost:8192/maven2),
  codehaus.org (http://snapshots.repository.codehaus.org),
  gump-apache.snapshots (http://localhost:8192/repo/m2-snapshot-repository)



[INFO] ------------------------------------------------------------------------
[INFO] For more information, run Maven with the -e switch
[INFO] ------------------------------------------------------------------------
[INFO] Total time: 33 seconds
[INFO] Finished at: Tue Jan 22 20:02:17 UTC 2013
[INFO] Final Memory: 14M/36M
[INFO] ------------------------------------------------------------------------
---------------------------------------------

To subscribe to this information via syndicated feeds:
- RSS: http://vmgump.apache.org/gump/public/openjpa/openjpa-lib/rss.xml
- Atom: http://vmgump.apache.org/gump/public/openjpa/openjpa-lib/atom.xml

============================== Gump Tracking Only ===
Produced by Apache Gump(TM) version 2.3.
Gump Run 10001222012013, vmgump.apache.org:vmgump:10001222012013
Gump E-mail Identifier (unique within run) #20.

*********************************************************** G U M P
[GUMP@vmgump]: Project groovy (in module groovy) failed
To whom it may engage...
        
This is an automated request, but not an unsolicited one. For 
more information please visit http://gump.apache.org/nagged.html, 
and/or contact the folk at general@gump.apache.org.

Project groovy has an issue affecting its community integration.
This issue affects 1 projects.
The current state of this project is 'Failed', with reason 'Build Failed'.
For reference only, the following projects are affected by this:
    - groovy :  New agile dynamic language using a Java-like syntax for the ...


Full details are available at:
    http://vmgump.apache.org/gump/public/groovy/groovy/index.html

That said, some information snippets are provided here.

The following annotations (debug/informational/warning/error messages) were provided:
 -DEBUG- Sole jar output [groovy-*[0-9T].jar] identifier set to project name
 -INFO- Optional dependency jakarta-bsf prerequisite failed with reason build failed
 -INFO- Optional dependency commons-logging prerequisite failed with reason build failed
 -INFO- Optional dependency commons-primitives failed with reason build failed
 -INFO- Optional dependency commons-cli failed with reason build failed
 -INFO- Optional dependency mx4j failed with reason build failed
 -DEBUG- (Apache Gump generated) Apache Maven Settings in: /srv/gump/public/workspace/groovy/gump_mvn_settings.xml
 -INFO- Failed with reason build failed
 -DEBUG- Maven POM in: /srv/gump/public/workspace/groovy/pom.xml
 -DEBUG- Extracted fallback artifacts from Gump Repository



The following work was performed:
http://vmgump.apache.org/gump/public/groovy/groovy/gump_work/build_groovy_groovy.html
Work Name: build_groovy_groovy (Type: Build)
Work ended in a state of : Failed
Elapsed: 22 secs
Command Line: /opt/maven2/bin/mvn --batch-mode --settings /srv/gump/public/workspace/groovy/gump_mvn_settings.xml package 
[Working Directory: /srv/gump/public/workspace/groovy]
M2_HOME: /opt/maven2
---------------------------------------------
Downloading: http://localhost:8192/maven2/ch/qos/logback/logback-core/0.9.21/logback-core-0.9.21.jar
Downloading: http://localhost:8192/maven2/org/slf4j/jcl-over-slf4j/1.6.0/jcl-over-slf4j-1.6.0.jar
637K downloaded  (extra166y-1.7.0.jar)
16K downloaded  (jcl-over-slf4j-1.6.0.jar)
287K downloaded  (logback-core-0.9.21.jar)
[WARNING] *** CHECKSUM FAILED - Checksum failed on download: local = 'da39a3ee5e6b4b0d3255bfef95601890afd80709'; remote = '7a137df24cce1ee099d1a947d8da8d5ef0b153c5' - RETRYING
Downloading: http://localhost:8192/maven2/ch/qos/logback/logback-core/0.9.21/logback-core-0.9.21.jar
287K downloaded  (logback-core-0.9.21.jar)
[WARNING] *** CHECKSUM FAILED - Checksum failed on download: local = 'da39a3ee5e6b4b0d3255bfef95601890afd80709'; remote = '7a137df24cce1ee099d1a947d8da8d5ef0b153c5' - IGNORING
[INFO] Unable to find resource 'ch.qos.logback:logback-core:jar:0.9.21' in repository central (http://repo1.maven.org/maven2)
[INFO] ------------------------------------------------------------------------
[ERROR] BUILD ERROR
[INFO] ------------------------------------------------------------------------
[INFO] Failed to resolve artifact.

Missing:
----------
1) ch.qos.logback:logback-core:jar:0.9.21

  Try downloading the file manually from the project website.

  Then, install it using the command: 
      mvn install:install-file -DgroupId=ch.qos.logback -DartifactId=logback-core -Dversion=0.9.21 -Dpackaging=jar -Dfile=/path/to/file

  Alternatively, if you host your own repository you can deploy the file there: 
      mvn deploy:deploy-file -DgroupId=ch.qos.logback -DartifactId=logback-core -Dversion=0.9.21 -Dpackaging=jar -Dfile=/path/to/file -Durl=[url] -DrepositoryId=[id]

  Path to dependency: 
  	1) org.codehaus.groovy:groovy:jar:1.9.0-beta-2
  	2) ch.qos.logback:logback-classic:jar:0.9.21
  	3) ch.qos.logback:logback-core:jar:0.9.21

----------
1 required artifact is missing.

for artifact: 
  org.codehaus.groovy:groovy:jar:1.9.0-beta-2

from the specified remote repositories:
  gump-central (http://localhost:8192/maven2)



[INFO] ------------------------------------------------------------------------
[INFO] For more information, run Maven with the -e switch
[INFO] ------------------------------------------------------------------------
[INFO] Total time: 21 seconds
[INFO] Finished at: Tue Jan 22 20:19:52 UTC 2013
[INFO] Final Memory: 11M/28M
[INFO] ------------------------------------------------------------------------
---------------------------------------------

To subscribe to this information via syndicated feeds:
- RSS: http://vmgump.apache.org/gump/public/groovy/groovy/rss.xml
- Atom: http://vmgump.apache.org/gump/public/groovy/groovy/atom.xml

============================== Gump Tracking Only ===
Produced by Apache Gump(TM) version 2.3.
Gump Run 10001222012013, vmgump.apache.org:vmgump:10001222012013
Gump E-mail Identifier (unique within run) #21.


--
Apache Gump
http://gump.apache.org/ [Instance: vmgump]

---------------------------------------------------------------------
To unsubscribe, e-mail: general-unsubscribe@gump.apache.org
For additional commands, e-mail: general-help@gump.apache.org


Mime
View raw message