gump-general mailing list archives

Site index · List index
Message view « Date » · « Thread »
Top « Date » · « Thread »
From g...@vmgump.apache.org
Subject BATCH: All dressed up, with nowhere to go...
Date Thu, 03 Jan 2013 21:58:01 GMT
Dear Gumpmeisters,
            
The following 4 notifys should have been sent

*********************************************************** G U M P
[GUMP@vmgump]: Module jakarta-servletapi-5 failed
[GUMP@vmgump]: Project txt2html-task (in module jakarta-servletapi-5) failed
[GUMP@vmgump]: Project jakarta-servletapi-5-servlet (in module jakarta-servletapi-5) failed
[GUMP@vmgump]: Project apacheds-core-integ-test (in module apacheds) failed
*********************************************************** G U M P
[GUMP@vmgump]: Module jakarta-servletapi-5 failed
To whom it may engage...
        
This is an automated request, but not an unsolicited one. For 
more information please visit http://gump.apache.org/nagged.html, 
and/or contact the folk at general@gump.apache.org.

Module jakarta-servletapi-5 has an issue affecting its community integration.
The current state of this module is 'Failed', with reason 'Update Failed'.

Full details are available at:
    http://vmgump.apache.org/gump/public/jakarta-servletapi-5/index.html

That said, some information snippets are provided here.

The following annotations (debug/informational/warning/error messages) were provided:
 -INFO- Failed with reason update failed



The following work was performed:
http://vmgump.apache.org/gump/public/jakarta-servletapi-5/gump_work/update_jakarta-servletapi-5.html
Work Name: update_jakarta-servletapi-5 (Type: Update)
Work ended in a state of : Failed
Elapsed: 1 sec
Command Line: svn --quiet checkout http://svn.apache.org/repos/asf/tomcat/tc5.5.x/archive/trunk/servletapi
--non-interactive jakarta-servletapi-5 
[Working Directory: /srv/gump/public/workspace/cvs]
---------------------------------------------
svn: URL 'http://svn.apache.org/repos/asf/tomcat/tc5.5.x/archive/trunk/servletapi' doesn't
exist
---------------------------------------------

To subscribe to this information via syndicated feeds:
- RSS: http://vmgump.apache.org/gump/public/jakarta-servletapi-5/rss.xml
- Atom: http://vmgump.apache.org/gump/public/jakarta-servletapi-5/atom.xml

============================== Gump Tracking Only ===
Produced by Apache Gump(TM) version 2.3.
Gump Run 46001203012013, vmgump.apache.org:vmgump:46001203012013
Gump E-mail Identifier (unique within run) #1.

*********************************************************** G U M P
[GUMP@vmgump]: Project txt2html-task (in module jakarta-servletapi-5) failed
To whom it may engage...
        
This is an automated request, but not an unsolicited one. For 
more information please visit http://gump.apache.org/nagged.html, 
and/or contact the folk at general@gump.apache.org.

Project txt2html-task has an issue affecting its community integration.
The current state of this project is 'Failed', with reason 'Update Failed'.

Full details are available at:
    http://vmgump.apache.org/gump/public/jakarta-servletapi-5/txt2html-task/index.html

That said, some information snippets are provided here.

The following annotations (debug/informational/warning/error messages) were provided:
 -DEBUG- Sole jar output [jsp-anttask-03012013.jar] identifier set to project name
 -INFO- Failed with reason update failed
 -DEBUG- Extracted fallback artifacts from Gump Repository

To subscribe to this information via syndicated feeds:
- RSS: http://vmgump.apache.org/gump/public/jakarta-servletapi-5/txt2html-task/rss.xml
- Atom: http://vmgump.apache.org/gump/public/jakarta-servletapi-5/txt2html-task/atom.xml

============================== Gump Tracking Only ===
Produced by Apache Gump(TM) version 2.3.
Gump Run 46001203012013, vmgump.apache.org:vmgump:46001203012013
Gump E-mail Identifier (unique within run) #2.

*********************************************************** G U M P
[GUMP@vmgump]: Project jakarta-servletapi-5-servlet (in module jakarta-servletapi-5) failed
To whom it may engage...
        
This is an automated request, but not an unsolicited one. For 
more information please visit http://gump.apache.org/nagged.html, 
and/or contact the folk at general@gump.apache.org.

Project jakarta-servletapi-5-servlet has an issue affecting its community integration.
The current state of this project is 'Failed', with reason 'Update Failed'.

Full details are available at:
    http://vmgump.apache.org/gump/public/jakarta-servletapi-5/jakarta-servletapi-5-servlet/index.html

That said, some information snippets are provided here.

The following annotations (debug/informational/warning/error messages) were provided:
 -INFO- Failed with reason update failed
 -DEBUG- Extracted fallback artifacts from Gump Repository

To subscribe to this information via syndicated feeds:
- RSS: http://vmgump.apache.org/gump/public/jakarta-servletapi-5/jakarta-servletapi-5-servlet/rss.xml
- Atom: http://vmgump.apache.org/gump/public/jakarta-servletapi-5/jakarta-servletapi-5-servlet/atom.xml

============================== Gump Tracking Only ===
Produced by Apache Gump(TM) version 2.3.
Gump Run 46001203012013, vmgump.apache.org:vmgump:46001203012013
Gump E-mail Identifier (unique within run) #3.

*********************************************************** G U M P
[GUMP@vmgump]: Project apacheds-core-integ-test (in module apacheds) failed
To whom it may engage...
        
This is an automated request, but not an unsolicited one. For 
more information please visit http://gump.apache.org/nagged.html, 
and/or contact the folk at general@gump.apache.org.

Project apacheds-core-integ-test has an issue affecting its community integration.
This issue affects 1 projects.
The current state of this project is 'Failed', with reason 'Build Failed'.
For reference only, the following projects are affected by this:
    - apacheds-core-integ-test :  Apache Directory Server


Full details are available at:
    http://vmgump.apache.org/gump/public/apacheds/apacheds-core-integ-test/index.html

That said, some information snippets are provided here.

The following annotations (debug/informational/warning/error messages) were provided:
 -WARNING- Overriding Maven settings: [/srv/gump/public/workspace/apacheds/core-integ/gump_mvn_settings.xml]
 -DEBUG- (Apache Gump generated) Apache Maven Settings in: /srv/gump/public/workspace/apacheds/core-integ/gump_mvn_settings.xml
 -INFO- Failed with reason build failed
 -DEBUG- Maven POM in: /srv/gump/public/workspace/apacheds/core-integ/pom.xml



The following work was performed:
http://vmgump.apache.org/gump/public/apacheds/apacheds-core-integ-test/gump_work/build_apacheds_apacheds-core-integ-test.html
Work Name: build_apacheds_apacheds-core-integ-test (Type: Build)
Work ended in a state of : Failed
Elapsed: 4 mins 33 secs
Command Line: /opt/maven3/bin/mvn --batch-mode --settings /srv/gump/public/workspace/apacheds/core-integ/gump_mvn_settings.xml
test 
[Working Directory: /srv/gump/public/workspace/apacheds/core-integ]
M2_HOME: /opt/maven3
---------------------------------------------
Tests run: 1, Failures: 0, Errors: 0, Skipped: 0, Time elapsed: 0.989 sec
Running org.apache.directory.server.core.authz.AuthorizationServiceAsAdminIT
Tests run: 4, Failures: 0, Errors: 0, Skipped: 0, Time elapsed: 1.025 sec
Running org.apache.directory.server.core.authz.ModifyAuthorizationIT
Tests run: 7, Failures: 0, Errors: 0, Skipped: 0, Time elapsed: 2.258 sec
Running org.apache.directory.server.core.authz.LookupAuthorizationIT
Tests run: 1, Failures: 0, Errors: 0, Skipped: 0, Time elapsed: 1.025 sec
Running org.apache.directory.server.core.authz.AuthzAuthnIT
Tests run: 3, Failures: 0, Errors: 0, Skipped: 0, Time elapsed: 1.129 sec
Running org.apache.directory.server.core.authz.AddAuthorizationIT
Tests run: 4, Failures: 0, Errors: 0, Skipped: 0, Time elapsed: 2.105 sec
Running org.apache.directory.server.core.authz.CompareAuthorizationIT
Tests run: 5, Failures: 0, Errors: 0, Skipped: 0, Time elapsed: 1.269 sec
Running org.apache.directory.server.core.authz.AuthorizationServiceAsNonAdminIT
Tests run: 4, Failures: 0, Errors: 0, Skipped: 0, Time elapsed: 1.085 sec
Running org.apache.directory.server.core.authz.MoveRenameAuthorizationIT
Tests run: 5, Failures: 0, Errors: 0, Skipped: 0, Time elapsed: 3.183 sec
Running org.apache.directory.server.core.authn.ppolicy.PasswordPolicyIT
Tests run: 10, Failures: 0, Errors: 0, Skipped: 0, Time elapsed: 28.935 sec
Running org.apache.directory.server.core.authn.SimpleAuthenticationIT
Tests run: 12, Failures: 0, Errors: 0, Skipped: 0, Time elapsed: 2.167 sec
Running org.apache.directory.server.core.trigger.SubentryServiceForTriggersIT
Tests run: 1, Failures: 0, Errors: 0, Skipped: 1, Time elapsed: 0 sec
Running org.apache.directory.server.core.trigger.TriggerInterceptorIT
Tests run: 1, Failures: 0, Errors: 0, Skipped: 1, Time elapsed: 0.002 sec

Results :

Tests in error: 
  testLdifFileLoader(org.apache.directory.server.core.authz.SearchAuthorizationIT)

Tests run: 706, Failures: 0, Errors: 1, Skipped: 131

[INFO] ------------------------------------------------------------------------
[INFO] BUILD FAILURE
[INFO] ------------------------------------------------------------------------
[INFO] Total time: 4:30.902s
[INFO] Finished at: Thu Jan 03 21:33:33 UTC 2013
[INFO] Final Memory: 16M/63M
[INFO] ------------------------------------------------------------------------
[ERROR] Failed to execute goal org.apache.maven.plugins:maven-surefire-plugin:2.12.2:test
(default-test) on project apacheds-core-integ: There are test failures.
[ERROR] 
[ERROR] Please refer to /srv/gump/public/workspace/apacheds/core-integ/target/surefire-reports
for the individual test results.
[ERROR] -> [Help 1]
[ERROR] 
[ERROR] To see the full stack trace of the errors, re-run Maven with the -e switch.
[ERROR] Re-run Maven using the -X switch to enable full debug logging.
[ERROR] 
[ERROR] For more information about the errors and possible solutions, please read the following
articles:
[ERROR] [Help 1] http://cwiki.apache.org/confluence/display/MAVEN/MojoFailureException
---------------------------------------------

To subscribe to this information via syndicated feeds:
- RSS: http://vmgump.apache.org/gump/public/apacheds/apacheds-core-integ-test/rss.xml
- Atom: http://vmgump.apache.org/gump/public/apacheds/apacheds-core-integ-test/atom.xml

============================== Gump Tracking Only ===
Produced by Apache Gump(TM) version 2.3.
Gump Run 46001203012013, vmgump.apache.org:vmgump:46001203012013
Gump E-mail Identifier (unique within run) #5.


--
Apache Gump
http://gump.apache.org/ [Instance: vmgump]

---------------------------------------------------------------------
To unsubscribe, e-mail: general-unsubscribe@gump.apache.org
For additional commands, e-mail: general-help@gump.apache.org


Mime
View raw message