gump-general mailing list archives

Site index · List index
Message view « Date » · « Thread »
Top « Date » · « Thread »
From g...@vmgump.apache.org
Subject BATCH: All dressed up, with nowhere to go...
Date Tue, 18 Dec 2012 21:57:15 GMT
Dear Gumpmeisters,
            
The following 3 notifys should have been sent

*********************************************************** G U M P
[GUMP@vmgump]: Project lucene-java-contrib-test (in module lucene-java) failed
[GUMP@vmgump]: Project commons-jelly-tags-sql (in module commons-jelly) failed
[GUMP@vmgump]: Project commons-jelly-tags-ant-test (in module commons-jelly) failed
*********************************************************** G U M P
[GUMP@vmgump]: Project lucene-java-contrib-test (in module lucene-java) failed
To whom it may engage...
        
This is an automated request, but not an unsolicited one. For 
more information please visit http://gump.apache.org/nagged.html, 
and/or contact the folk at general@gump.apache.org.

Project lucene-java-contrib-test has an issue affecting its community integration.
This issue affects 1 projects.
The current state of this project is 'Failed', with reason 'Build Failed'.
For reference only, the following projects are affected by this:
    - lucene-java-contrib-test :  Java Based Search Engine


Full details are available at:
    http://vmgump.apache.org/gump/public/lucene-java/lucene-java-contrib-test/index.html

That said, some information snippets are provided here.

The following annotations (debug/informational/warning/error messages) were provided:
 -DEBUG- Dependency on javacc exists, no need to add for property javacc.home.
 -INFO- Failed with reason build failed



The following work was performed:
http://vmgump.apache.org/gump/public/lucene-java/lucene-java-contrib-test/gump_work/build_lucene-java_lucene-java-contrib-test.html
Work Name: build_lucene-java_lucene-java-contrib-test (Type: Build)
Work ended in a state of : Failed
Elapsed: 7 secs
Command Line: /usr/lib/jvm/java-7-oracle/bin/java -Djava.awt.headless=true -Dbuild.sysclasspath=only
-Xbootclasspath/p:/srv/gump/public/workspace/xml-xalan/build/xalan-unbundled.jar:/srv/gump/public/workspace/xml-xalan/build/serializer.jar:/srv/gump/public/workspace/xml-commons/java/external/build/xml-apis.jar:/srv/gump/public/workspace/xml-xerces2/build/xercesImpl.jar
org.apache.tools.ant.Main -Dgump.merge=/srv/gump/public/gump/work/merge.xml -Dversion=18122012
-Divy.default.ivy.user.dir=/srv/gump/public/workspace/lucene-java/.ivy2 -Djavacc.home=/srv/gump/packages/javacc-3.1
test 
[Working Directory: /srv/gump/public/workspace/lucene-java/lucene]
CLASSPATH: /usr/lib/jvm/java-7-oracle/lib/tools.jar:/srv/gump/public/workspace/lucene-java/lucene/build/classes/tools:/srv/gump/public/workspace/lucene-java/lucene/build/classes/test:/srv/gump/public/workspace/lucene-java/lucene/build/contrib/demo/classes/test:/srv/gump/public/workspace/lucene-java/lucene/build/contrib/highlighter/classes/test:/srv/gump/public/workspace/lucene-java/lucene/build/contrib/instantiated/classes/test:/srv/gump/public/workspace/lucene-java/lucene/build/contrib/memory/classes/test:/srv/gump/public/workspace/lucene-java/lucene/build/contrib/misc/classes/test:/srv/gump/public/workspace/lucene-java/lucene/build/contrib/sandbox/classes/test:/srv/gump/public/workspace/lucene-java/lucene/build/contrib/spatial/classes/test:/srv/gump/public/workspace/lucene-java/lucene/queries/build/classes/test:/srv/gump/public/workspace/lucene-java/lucene/queryparser/build/classes/test:/srv/gump/public/workspace/ant/dist/lib/ant.jar:/srv/gump/public/workspace/ant/dist/lib/
 ant-launcher.jar:/srv/gump/public/workspace/ant/dist/lib/ant-jmf.jar:/srv/gump/public/workspace/ant/dist/lib/ant-junit.jar:/srv/gump/public/workspace/ant/dist/lib/ant-swing.jar:/srv/gump/public/workspace/ant/dist/lib/ant-apache-resolver.jar:/srv/gump/public/workspace/ant/dist/lib/ant-apache-xalan2.jar:/srv/gump/public/workspace/xml-commons/java/build/resolver.jar:/srv/gump/public/workspace/apache-commons/compress/target/commons-compress-1.5-SNAPSHOT.jar:/srv/gump/public/workspace/commons-digester-2.x/target/commons-digester-2.2-SNAPSHOT.jar:/srv/gump/public/workspace/apache-commons/logging/target/commons-logging-18122012.jar:/srv/gump/public/workspace/apache-commons/logging/target/commons-logging-api-18122012.jar:/srv/gump/packages/caucho-libs/hessian-3.0.8.jar:/srv/gump/public/workspace/icu4j/main/classes/core/out/lib/icu4j-core.jar:/srv/gump/public/workspace/icu4j/main/classes/collate/out/lib/icu4j-collate.jar:/srv/gump/public/workspace/icu4j/main/classes/currdata/out/lib/
 icu4j-currdata.jar:/srv/gump/public/workspace/icu4j/main/classes/langdata/out/lib/icu4j-langdata.jar:/srv/gump/public/workspace/icu4j/main/classes/regiondata/out/lib/icu4j-regiondata.jar:/srv/gump/public/workspace/icu4j/main/classes/translit/out/lib/icu4j-translit.jar:/srv/gump/public/workspace/icu4j/main/classes/charset/out/lib/icu4j-charset.jar:/srv/gump/public/workspace/icu4j/main/classes/localespi/out/lib/icu4j-localespi.jar:/srv/gump/packages/apache-attic/jakarta-regexp-1.5.jar:/srv/gump/public/workspace/jakarta-servletapi-5/jsr154/dist/lib/servlet-api.jar:/srv/gump/packages/javacc-3.1/bin/lib/javacc.jar:/srv/gump/public/workspace/jline/target/jline-0.9.95-SNAPSHOT.jar:/srv/gump/packages/jtidy/jtidy-r938.jar:/srv/gump/public/workspace/junit/dist/junit-18122012.jar:/srv/gump/public/workspace/junit/dist/junit-dep-18122012.jar:/srv/gump/public/workspace/lucene-java/lucene/build/core/lucene-core-18122012.jar:/srv/gump/public/workspace/lucene-java/lucene/build/analysis/icu/l
 ucene-analyzers-icu-18122012.jar:/srv/gump/public/workspace/lucene-java/lucene/build/analysis/smartcn/lucene-analyzers-smartcn-18122012.jar:/srv/gump/public/workspace/lucene-java/lucene/build/analysis/common/lucene-analyzers-common-18122012.jar:/srv/gump/public/workspace/lucene-java/lucene/build/analysis/stempel/lucene-analyzers-stempel-18122012.jar:/srv/gump/public/workspace/lucene-java/lucene/build/analysis/phonetic/lucene-analyzers-phonetic-18122012.jar:/srv/gump/public/workspace/lucene-java/lucene/build/analysis/morfologik/lucene-analyzers-morfologik-18122012.jar:/srv/gump/public/workspace/lucene-java/lucene/build/queries/lucene-queries-18122012.jar:/srv/gump/public/workspace/lucene-java/lucene/build/sandbox/lucene-sandbox-18122012.jar:/srv/gump/public/workspace/lucene-java/lucene/build/queryparser/lucene-queryparser-18122012.jar:/srv/gump/public/workspace/lucene-java/lucene/build/demo/lucene-demo-18122012.jar:/srv/gump/public/workspace/lucene-java/lucene/build/memory/lu
 cene-memory-18122012.jar:/srv/gump/public/workspace/lucene-java/lucene/build/highlighter/lucene-highlighter-18122012.jar:/srv/gump/public/workspace/lucene-java/lucene/build/misc/lucene-misc-18122012.jar:/srv/gump/public/workspace/lucene-java/lucene/build/test-framework/lucene-test-framework-18122012.jar:/srv/gump/packages/nekohtml-0.9.5/nekohtml.jar:/srv/gump/public/workspace/xml-commons/java/external/build/xml-apis-ext.jar:/srv/gump/public/workspace/ivy/build/artifact/jars/ivy-18122012.jar:/srv/gump/packages/bouncycastle-jdk14/bcpg-jdk14-145.jar:/srv/gump/packages/bouncycastle-jdk14/bcprov-ext-jdk14-145.jar:/srv/gump/packages/commons-httpclient/commons-httpclient-3.1.jar:/srv/gump/public/workspace/commons-codec-1.x/dist/commons-codec-18122012.jar:/srv/gump/packages/apache-attic/oro-2.0.8.jar:/srv/gump/packages/apache-commons/commons-vfs-1.0.jar:/srv/gump/packages/apache-attic/slide-webdavlib-2.1.jar:/srv/gump/packages/jsch/jsch-0.1.45.jar
---------------------------------------------
-clover.load:

-clover.classpath:

-clover.setup:

clover:

compile-core:

-clover.disable:

-clover.load:

-clover.classpath:

-clover.setup:

clover:

common.compile-core:

compile-core:

compile-test:

install-junit4-taskdef:
  [taskdef] Could not load definitions from resource com/carrotsearch/junit4/antlib.xml. It
could not be found.

validate:

test:

BUILD FAILED
/srv/gump/public/workspace/lucene-java/lucene/build.xml:50: The following error occurred while
executing this line:
/srv/gump/public/workspace/lucene-java/lucene/common-build.xml:1175: The following error occurred
while executing this line:
/srv/gump/public/workspace/lucene-java/lucene/common-build.xml:800: Problem: failed to create
task or type antlib:com.carrotsearch.junit4:pickseed
Cause: The name is undefined.
Action: Check the spelling.
Action: Check that any custom tasks/types have been declared.
Action: Check that any <presetdef>/<macrodef> declarations have taken place.
No types or tasks have been defined in this namespace yet

This appears to be an antlib declaration. 
Action: Check that the implementing library exists in one of:
        -ANT_HOME/lib
        -the IDE Ant configuration dialogs


Total time: 7 seconds
---------------------------------------------

To subscribe to this information via syndicated feeds:
- RSS: http://vmgump.apache.org/gump/public/lucene-java/lucene-java-contrib-test/rss.xml
- Atom: http://vmgump.apache.org/gump/public/lucene-java/lucene-java-contrib-test/atom.xml

============================== Gump Tracking Only ===
Produced by Apache Gump(TM) version 2.3.
Gump Run 07001218122012, vmgump.apache.org:vmgump:07001218122012
Gump E-mail Identifier (unique within run) #1.

*********************************************************** G U M P
[GUMP@vmgump]: Project commons-jelly-tags-sql (in module commons-jelly) failed
To whom it may engage...
        
This is an automated request, but not an unsolicited one. For 
more information please visit http://gump.apache.org/nagged.html, 
and/or contact the folk at general@gump.apache.org.

Project commons-jelly-tags-sql has an issue affecting its community integration.
This issue affects 1 projects.
The current state of this project is 'Failed', with reason 'Build Failed'.
For reference only, the following projects are affected by this:
    - commons-jelly-tags-sql :  Commons Jelly


Full details are available at:
    http://vmgump.apache.org/gump/public/commons-jelly/commons-jelly-tags-sql/index.html

That said, some information snippets are provided here.

The following annotations (debug/informational/warning/error messages) were provided:
 -DEBUG- Sole jar output [commons-jelly-tags-sql-18122012.jar] identifier set to project name
 -DEBUG- Dependency on xml-xerces exists, no need to add for property maven.jar.xerces.
 -DEBUG- Dependency on commons-jexl-1.x exists, no need to add for property maven.jar.commons-jexl.
 -DEBUG- (Apache Gump generated) Apache Maven Properties in: /srv/gump/public/workspace/commons-jelly/jelly-tags/sql/build.properties
 -INFO- Failed with reason build failed
 -DEBUG- Maven POM in: /srv/gump/public/workspace/commons-jelly/jelly-tags/sql/project.xml
 -DEBUG- Maven project properties in: /srv/gump/public/workspace/commons-jelly/jelly-tags/sql/project.properties
 -INFO- Project Reports in: /srv/gump/public/workspace/commons-jelly/jelly-tags/sql/target/test-reports
 -WARNING- No directory [/srv/gump/public/workspace/commons-jelly/jelly-tags/sql/target/test-reports]
 -INFO- Failed to extract fallback artifacts from Gump Repository



The following work was performed:
http://vmgump.apache.org/gump/public/commons-jelly/commons-jelly-tags-sql/gump_work/build_commons-jelly_commons-jelly-tags-sql.html
Work Name: build_commons-jelly_commons-jelly-tags-sql (Type: Build)
Work ended in a state of : Failed
Elapsed: 6 secs
Command Line: maven --offline jar 
[Working Directory: /srv/gump/public/workspace/commons-jelly/jelly-tags/sql]
---------------------------------------------
 __  __
|  \/  |__ _Apache__ ___
| |\/| / _` \ V / -_) ' \  ~ intelligent projects ~
|_|  |_\__,_|\_/\___|_||_|  v. 1.0.2

You are working offline so the build will continue, but commons-jelly-1.1-SNAPSHOT.jar may
be out of date!
build:start:

java:prepare-filesystem:
    [mkdir] Created dir: /srv/gump/public/workspace/commons-jelly/jelly-tags/sql/target/classes

java:compile:
    [echo] Compiling to /srv/gump/public/workspace/commons-jelly/jelly-tags/sql/target/classes
    [javac] Compiling 18 source files to /srv/gump/public/workspace/commons-jelly/jelly-tags/sql/target/classes
    [javac] warning: [options] bootstrap class path not set in conjunction with -source 1.5
    [javac] /srv/gump/public/workspace/commons-jelly/jelly-tags/sql/src/java/org/apache/commons/jelly/tags/sql/DataSourceWrapper.java:38:
error: DataSourceWrapper is not abstract and does not override abstract method getParentLogger()
in CommonDataSource
    [javac] public class DataSourceWrapper implements DataSource {
    [javac]        ^
    [javac] Note: Some input files use unchecked or unsafe operations.
    [javac] Note: Recompile with -Xlint:unchecked for details.
    [javac] 1 error
    [javac] 1 warning

BUILD FAILED
File...... /home/gump/.maven/cache/maven-java-plugin-1.5/plugin.jelly
Element... ant:javac
Line...... 63
Column.... 48
Compile failed; see the compiler error output for details.
Total time: 6 seconds
Finished at: Tue Dec 18 19:09:11 UTC 2012

---------------------------------------------

To subscribe to this information via syndicated feeds:
- RSS: http://vmgump.apache.org/gump/public/commons-jelly/commons-jelly-tags-sql/rss.xml
- Atom: http://vmgump.apache.org/gump/public/commons-jelly/commons-jelly-tags-sql/atom.xml

============================== Gump Tracking Only ===
Produced by Apache Gump(TM) version 2.3.
Gump Run 07001218122012, vmgump.apache.org:vmgump:07001218122012
Gump E-mail Identifier (unique within run) #2.

*********************************************************** G U M P
[GUMP@vmgump]: Project commons-jelly-tags-ant-test (in module commons-jelly) failed
To whom it may engage...
        
This is an automated request, but not an unsolicited one. For 
more information please visit http://gump.apache.org/nagged.html, 
and/or contact the folk at general@gump.apache.org.

Project commons-jelly-tags-ant-test has an issue affecting its community integration.
This issue affects 1 projects.
The current state of this project is 'Failed', with reason 'Build Failed'.
For reference only, the following projects are affected by this:
    - commons-jelly-tags-ant-test :  Commons Jelly


Full details are available at:
    http://vmgump.apache.org/gump/public/commons-jelly/commons-jelly-tags-ant-test/index.html

That said, some information snippets are provided here.

The following annotations (debug/informational/warning/error messages) were provided:
 -DEBUG- Dependency on ant exists, no need to add for property maven.jar.ant-optional.
 -DEBUG- Dependency on xml-xerces exists, no need to add for property maven.jar.xerces.
 -DEBUG- Dependency on commons-jexl-1.x exists, no need to add for property maven.jar.commons-jexl.
 -WARNING- Overriding Maven properties: [/srv/gump/public/workspace/commons-jelly/jelly-tags/ant/build.properties]
 -DEBUG- (Apache Gump generated) Apache Maven Properties in: /srv/gump/public/workspace/commons-jelly/jelly-tags/ant/build.properties
 -INFO- Failed with reason build failed
 -DEBUG- Maven POM in: /srv/gump/public/workspace/commons-jelly/jelly-tags/ant/project.xml
 -DEBUG- Maven project properties in: /srv/gump/public/workspace/commons-jelly/jelly-tags/ant/project.properties
 -INFO- Project Reports in: /srv/gump/public/workspace/commons-jelly/jelly-tags/ant/target/test-reports



The following work was performed:
http://vmgump.apache.org/gump/public/commons-jelly/commons-jelly-tags-ant-test/gump_work/build_commons-jelly_commons-jelly-tags-ant-test.html
Work Name: build_commons-jelly_commons-jelly-tags-ant-test (Type: Build)
Work ended in a state of : Failed
Elapsed: 12 secs
Command Line: maven --offline jar 
[Working Directory: /srv/gump/public/workspace/commons-jelly/jelly-tags/ant]
---------------------------------------------
    [junit] Actual expression: (${foo4.1})=(null)
    [junit] 	at org.apache.commons.jelly.tags.junit.AssertTagSupport.fail(AssertTagSupport.java:44)
    [junit] 	at org.apache.commons.jelly.tags.junit.AssertTagSupport.failNotEquals(AssertTagSupport.java:77)
    [junit] 	at org.apache.commons.jelly.tags.junit.AssertEqualsTag.doTag(AssertEqualsTag.java:56)
    [junit] 	at org.apache.commons.jelly.impl.TagScript.run(TagScript.java:267)
    [junit] 	at org.apache.commons.jelly.impl.ScriptBlock.run(ScriptBlock.java:96)
    [junit] 	at org.apache.commons.jelly.tags.junit.CaseTag$1.runTest(CaseTag.java:60)
    [junit] 
    [junit] 
    [junit] Testcase: startUpReadWrite(org.apache.commons.jelly.tags.junit.CaseTag$1):	Caused
an ERROR
    [junit] file:/srv/gump/public/workspace/commons-jelly/jelly-tags/ant/target/test-classes/org/apache/commons/jelly/ant/suite.jelly:98:5:
<test:assertEquals> file:/srv/gump/public/workspace/commons-jelly/jelly-tags/ant/target/test-classes/org/apache/commons/jelly/ant/suite.jelly:98:5:
<test:assertEquals>  expected:[bar5] but was:[null]
    [junit] Expected expression: (bar5)=(bar5)
    [junit] Actual expression: (${foo5.1})=(null)
    [junit] org.apache.commons.jelly.JellyTagException: file:/srv/gump/public/workspace/commons-jelly/jelly-tags/ant/target/test-classes/org/apache/commons/jelly/ant/suite.jelly:98:5:
<test:assertEquals> file:/srv/gump/public/workspace/commons-jelly/jelly-tags/ant/target/test-classes/org/apache/commons/jelly/ant/suite.jelly:98:5:
<test:assertEquals>  expected:[bar5] but was:[null]
    [junit] Expected expression: (bar5)=(bar5)
    [junit] Actual expression: (${foo5.1})=(null)
    [junit] 	at org.apache.commons.jelly.impl.TagScript.handleException(TagScript.java:732)
    [junit] 	at org.apache.commons.jelly.impl.TagScript.run(TagScript.java:287)
    [junit] 	at org.apache.commons.jelly.impl.ScriptBlock.run(ScriptBlock.java:96)
    [junit] 	at org.apache.commons.jelly.tags.junit.CaseTag$1.runTest(CaseTag.java:60)
    [junit] Caused by: org.apache.commons.jelly.tags.junit.JellyAssertionFailedError: file:/srv/gump/public/workspace/commons-jelly/jelly-tags/ant/target/test-classes/org/apache/commons/jelly/ant/suite.jelly:98:5:
<test:assertEquals>  expected:[bar5] but was:[null]
    [junit] Expected expression: (bar5)=(bar5)
    [junit] Actual expression: (${foo5.1})=(null)
    [junit] 	at org.apache.commons.jelly.tags.junit.AssertTagSupport.fail(AssertTagSupport.java:44)
    [junit] 	at org.apache.commons.jelly.tags.junit.AssertTagSupport.failNotEquals(AssertTagSupport.java:77)
    [junit] 	at org.apache.commons.jelly.tags.junit.AssertEqualsTag.doTag(AssertEqualsTag.java:56)
    [junit] 	at org.apache.commons.jelly.impl.TagScript.run(TagScript.java:267)
    [junit] Root cause
    [junit] org.apache.commons.jelly.tags.junit.JellyAssertionFailedError: file:/srv/gump/public/workspace/commons-jelly/jelly-tags/ant/target/test-classes/org/apache/commons/jelly/ant/suite.jelly:98:5:
<test:assertEquals>  expected:[bar5] but was:[null]
    [junit] Expected expression: (bar5)=(bar5)
    [junit] Actual expression: (${foo5.1})=(null)
    [junit] 	at org.apache.commons.jelly.tags.junit.AssertTagSupport.fail(AssertTagSupport.java:44)
    [junit] 	at org.apache.commons.jelly.tags.junit.AssertTagSupport.failNotEquals(AssertTagSupport.java:77)
    [junit] 	at org.apache.commons.jelly.tags.junit.AssertEqualsTag.doTag(AssertEqualsTag.java:56)
    [junit] 	at org.apache.commons.jelly.impl.TagScript.run(TagScript.java:267)
    [junit] 	at org.apache.commons.jelly.impl.ScriptBlock.run(ScriptBlock.java:96)
    [junit] 	at org.apache.commons.jelly.tags.junit.CaseTag$1.runTest(CaseTag.java:60)
    [junit] 
    [junit] 
    [junit] [ERROR] TEST org.apache.commons.jelly.ant.TestJelly FAILED

BUILD FAILED
File...... /home/gump/.maven/cache/maven-test-plugin-1.6.2/plugin.jelly
Element... fail
Line...... 181
Column.... 54
There were test failures.
Total time: 12 seconds
Finished at: Tue Dec 18 19:15:09 UTC 2012

---------------------------------------------

To subscribe to this information via syndicated feeds:
- RSS: http://vmgump.apache.org/gump/public/commons-jelly/commons-jelly-tags-ant-test/rss.xml
- Atom: http://vmgump.apache.org/gump/public/commons-jelly/commons-jelly-tags-ant-test/atom.xml

============================== Gump Tracking Only ===
Produced by Apache Gump(TM) version 2.3.
Gump Run 07001218122012, vmgump.apache.org:vmgump:07001218122012
Gump E-mail Identifier (unique within run) #3.


--
Apache Gump
http://gump.apache.org/ [Instance: vmgump]

---------------------------------------------------------------------
To unsubscribe, e-mail: general-unsubscribe@gump.apache.org
For additional commands, e-mail: general-help@gump.apache.org


Mime
View raw message