gump-general mailing list archives

Site index · List index
Message view « Date » · « Thread »
Top « Date » · « Thread »
From g...@vmgump.apache.org
Subject BATCH: All dressed up, with nowhere to go...
Date Thu, 18 Oct 2012 00:37:03 GMT
Dear Gumpmeisters,
            
The following 1 notifys should have been sent

*********************************************************** G U M P
[GUMP@vmgump]: Project apacheds-server-integ-test (in module apacheds) failed
*********************************************************** G U M P
[GUMP@vmgump]: Project apacheds-server-integ-test (in module apacheds) failed
To whom it may engage...
        
This is an automated request, but not an unsolicited one. For 
more information please visit http://gump.apache.org/nagged.html, 
and/or contact the folk at general@gump.apache.org.

Project apacheds-server-integ-test has an issue affecting its community integration.
This issue affects 1 projects.
The current state of this project is 'Failed', with reason 'Build Failed'.
For reference only, the following projects are affected by this:
    - apacheds-server-integ-test :  Apache Directory Server


Full details are available at:
    http://vmgump.apache.org/gump/public/apacheds/apacheds-server-integ-test/index.html

That said, some information snippets are provided here.

The following annotations (debug/informational/warning/error messages) were provided:
 -WARNING- Overriding Maven settings: [/srv/gump/public/workspace/apacheds/server-integ/gump_mvn_settings.xml]
 -DEBUG- (Apache Gump generated) Apache Maven Settings in: /srv/gump/public/workspace/apacheds/server-integ/gump_mvn_settings.xml
 -INFO- Failed with reason build failed
 -DEBUG- Maven POM in: /srv/gump/public/workspace/apacheds/server-integ/pom.xml



The following work was performed:
http://vmgump.apache.org/gump/public/apacheds/apacheds-server-integ-test/gump_work/build_apacheds_apacheds-server-integ-test.html
Work Name: build_apacheds_apacheds-server-integ-test (Type: Build)
Work ended in a state of : Failed
Elapsed: 9 mins 7 secs
Command Line: /opt/maven3/bin/mvn --batch-mode --settings /srv/gump/public/workspace/apacheds/server-integ/gump_mvn_settings.xml
package 
[Working Directory: /srv/gump/public/workspace/apacheds/server-integ]
M2_HOME: /opt/maven3
---------------------------------------------
(consumer1 completed) 
(consumer2 completed) 
(consumer3 completed) 
(consumer4 completed) 
(consumer1 completed) 
(consumer2 completed) 
(consumer3 completed) 
(consumer4 completed) 
(consumer1 completed) 
(consumer2 completed) 
(consumer3 completed) 
(consumer4 completed) 
(consumer1 completed) 
(consumer2 completed) 
(consumer3 completed) 
(consumer4 completed) 

---> Running testInitialRefreshLoad

NbAdded every 100ms : 
0, 245, 483, 669, 1002, 1002, 1002, 1002, 1002, 1002, 1002, 1002, 1002, 1002, 1002, 1002,
1002, 1002, 1002, 1002, 1002, 1002, 1002, 1002, 1002, 1002, 1002, 1002, 1002, 1002, 1002,
1002, 1002, 1002, 1002, 1002, 1002, 1002, 1002, 1002, 1002, 1002, 1002, 1002, 1002, 1002,
1002, 1002, 1002, 1002Tests run: 4, Failures: 4, Errors: 0, Skipped: 0, Time elapsed: 32.611
sec <<< FAILURE!
Running org.apache.directory.IndexIT
Tests run: 2, Failures: 0, Errors: 0, Skipped: 1, Time elapsed: 0.498 sec

Results :

Failed tests:   testInitialRefreshLoadAndAdd(org.apache.directory.server.replication.ClientInitialRefreshIT)
  testInitialRefreshStopAndGo(org.apache.directory.server.replication.ClientInitialRefreshIT)
  testInitialRefresh4Consumers(org.apache.directory.server.replication.ClientInitialRefreshIT)
  testInitialRefreshLoad(org.apache.directory.server.replication.ClientInitialRefreshIT)

Tests run: 399, Failures: 4, Errors: 0, Skipped: 14

[INFO] ------------------------------------------------------------------------
[INFO] BUILD FAILURE
[INFO] ------------------------------------------------------------------------
[INFO] Total time: 9:05.359s
[INFO] Finished at: Thu Oct 18 00:21:45 UTC 2012
[INFO] Final Memory: 17M/62M
[INFO] ------------------------------------------------------------------------
[ERROR] Failed to execute goal org.apache.maven.plugins:maven-surefire-plugin:2.12.2:test
(default-test) on project apacheds-server-integ: There are test failures.
[ERROR] 
[ERROR] Please refer to /srv/gump/public/workspace/apacheds/server-integ/target/surefire-reports
for the individual test results.
[ERROR] -> [Help 1]
[ERROR] 
[ERROR] To see the full stack trace of the errors, re-run Maven with the -e switch.
[ERROR] Re-run Maven using the -X switch to enable full debug logging.
[ERROR] 
[ERROR] For more information about the errors and possible solutions, please read the following
articles:
[ERROR] [Help 1] http://cwiki.apache.org/confluence/display/MAVEN/MojoFailureException
---------------------------------------------

To subscribe to this information via syndicated feeds:
- RSS: http://vmgump.apache.org/gump/public/apacheds/apacheds-server-integ-test/rss.xml
- Atom: http://vmgump.apache.org/gump/public/apacheds/apacheds-server-integ-test/atom.xml

============================== Gump Tracking Only ===
Produced by Apache Gump(TM) version 2.3.
Gump Run 02011217102012, vmgump.apache.org:vmgump:02011217102012
Gump E-mail Identifier (unique within run) #1.


--
Apache Gump
http://gump.apache.org/ [Instance: vmgump]

---------------------------------------------------------------------
To unsubscribe, e-mail: general-unsubscribe@gump.apache.org
For additional commands, e-mail: general-help@gump.apache.org


Mime
View raw message