gump-general mailing list archives

Site index · List index
Message view « Date » · « Thread »
Top « Date » · « Thread »
From g...@vmgump.apache.org
Subject BATCH: All dressed up, with nowhere to go...
Date Tue, 11 Sep 2012 22:35:15 GMT
Dear Gumpmeisters,
            
The following 6 notifys should have been sent

*********************************************************** G U M P
[GUMP@vmgump]: Project hamcrest-java-unit-test (in module hamcrest) failed
[GUMP@vmgump]: Project lucene-java-contrib-test (in module lucene-java) failed
[GUMP@vmgump]: Project mockito (in module mockito) failed
[GUMP@vmgump]: Project commons-jelly-tags-ant-test (in module commons-jelly) failed
[GUMP@vmgump]: Project google-docbkx-maven-plugin (in module google-docbkx) failed
[GUMP@vmgump]: Project cocoon-optional (in module cocoon3) failed
*********************************************************** G U M P
[GUMP@vmgump]: Project hamcrest-java-unit-test (in module hamcrest) failed
To whom it may engage...
        
This is an automated request, but not an unsolicited one. For 
more information please visit http://gump.apache.org/nagged.html, 
and/or contact the folk at general@gump.apache.org.

Project hamcrest-java-unit-test has an issue affecting its community integration.
This issue affects 3 projects.
The current state of this project is 'Failed', with reason 'Build Failed'.
For reference only, the following projects are affected by this:
    - hamcrest-java-unit-test :  Provides a library of matcher objects (also known as constra...
    - jmock2 :  jMock is a library for testing Java code using mock objects.
    - jmock2-test :  jMock is a library for testing Java code using mock objects.


Full details are available at:
    http://vmgump.apache.org/gump/public/hamcrest/hamcrest-java-unit-test/index.html

That said, some information snippets are provided here.

The following annotations (debug/informational/warning/error messages) were provided:
 -INFO- Failed with reason build failed
 -INFO- Failed to extract fallback artifacts from Gump Repository



The following work was performed:
http://vmgump.apache.org/gump/public/hamcrest/hamcrest-java-unit-test/gump_work/build_hamcrest_hamcrest-java-unit-test.html
Work Name: build_hamcrest_hamcrest-java-unit-test (Type: Build)
Work ended in a state of : Failed
Elapsed: 16 secs
Command Line: /usr/lib/jvm/java-7-oracle/bin/java -Djava.awt.headless=true -Dbuild.sysclasspath=only
-Xbootclasspath/p:/srv/gump/public/workspace/xml-xalan/build/xalan-unbundled.jar:/srv/gump/public/workspace/xml-xalan/build/serializer.jar:/srv/gump/public/workspace/xml-commons/java/external/build/xml-apis.jar:/srv/gump/public/workspace/xml-xerces2/build/xercesImpl.jar
org.apache.tools.ant.Main -Dgump.merge=/srv/gump/public/gump/work/merge.xml -Dversion=11092012
unit-test 
[Working Directory: /srv/gump/public/workspace/hamcrest/hamcrest-java]
CLASSPATH: /usr/lib/jvm/java-7-oracle/lib/tools.jar:/srv/gump/public/workspace/hamcrest/hamcrest-java/lib/integration/easymock-2.2.jar:/srv/gump/public/workspace/hamcrest/hamcrest-java/build/temp/build/hamcrest-unit-test-11092012.jar.contents:/srv/gump/public/workspace/ant/dist/lib/ant.jar:/srv/gump/public/workspace/ant/dist/lib/ant-launcher.jar:/srv/gump/public/workspace/ant/dist/lib/ant-jmf.jar:/srv/gump/public/workspace/ant/dist/lib/ant-junit.jar:/srv/gump/public/workspace/ant/dist/lib/ant-swing.jar:/srv/gump/public/workspace/ant/dist/lib/ant-apache-resolver.jar:/srv/gump/public/workspace/ant/dist/lib/ant-apache-xalan2.jar:/srv/gump/public/workspace/hamcrest/hamcrest-java/build/hamcrest-integration-11092012.jar:/srv/gump/public/workspace/hamcrest/hamcrest-java/build/hamcrest-all-11092012.jar:/srv/gump/packages/jarjar/jarjar-0.6.jar:/srv/gump/public/workspace/jmock/build/dist/jmock-core-11092012.jar:/srv/gump/public/workspace/jmock/build/dist/jmock-cglib-11092012.jar:/srv/g
 ump/public/workspace/junit/dist/junit-11092012.jar:/srv/gump/public/workspace/junit/dist/junit-dep-11092012.jar:/srv/gump/packages/qdox/qdox-1.12.jar:/srv/gump/public/workspace/xml-commons/java/external/build/xml-apis-ext.jar
---------------------------------------------
    [junit] Testsuite: org.hamcrest.core.EveryTest
    [junit] Tests run: 3, Failures: 0, Errors: 0, Time elapsed: 0.009 sec
    [junit] 
    [junit] Testsuite: org.hamcrest.core.IsAnythingTest
    [junit] Tests run: 5, Failures: 0, Errors: 0, Time elapsed: 0.003 sec
    [junit] 
    [junit] Testsuite: org.hamcrest.core.IsEqualTest
    [junit] Tests run: 12, Failures: 0, Errors: 0, Time elapsed: 0.011 sec
    [junit] 
    [junit] Testsuite: org.hamcrest.core.IsInstanceOfTest
    [junit] Tests run: 8, Failures: 0, Errors: 0, Time elapsed: 0.007 sec
    [junit] 
    [junit] Testsuite: org.hamcrest.core.IsNotTest
    [junit] Tests run: 5, Failures: 0, Errors: 0, Time elapsed: 0.007 sec
    [junit] 
    [junit] Testsuite: org.hamcrest.core.IsNullTest
    [junit] Tests run: 4, Failures: 0, Errors: 0, Time elapsed: 0.002 sec
    [junit] 
    [junit] Testsuite: org.hamcrest.core.IsSameTest
    [junit] Tests run: 5, Failures: 0, Errors: 0, Time elapsed: 0.004 sec
    [junit] 
    [junit] Testsuite: org.hamcrest.core.IsTest
    [junit] Tests run: 6, Failures: 0, Errors: 0, Time elapsed: 0.005 sec
    [junit] 
    [junit] Testsuite: org.hamcrest.generator.EasyMock2FactoryWriterTest
    [junit] Tests run: 5, Failures: 0, Errors: 0, Time elapsed: 0.003 sec
    [junit] 
    [junit] Testsuite: org.hamcrest.generator.HamcrestFactoryWriterTest
    [junit] Tests run: 9, Failures: 0, Errors: 0, Time elapsed: 0.005 sec
    [junit] 
    [junit] Testsuite: org.hamcrest.generator.QDoxFactoryReaderTest
    [junit] Tests run: 2, Failures: 0, Errors: 0, Time elapsed: 0.055 sec
    [junit] 
    [junit] Testsuite: org.hamcrest.generator.QuickReferenceWriterTest
    [junit] Tests run: 2, Failures: 0, Errors: 0, Time elapsed: 0.006 sec
    [junit] 
    [junit] Testsuite: org.hamcrest.generator.ReflectiveFactoryReaderTest
    [junit] Tests run: 2, Failures: 1, Errors: 0, Time elapsed: 0.011 sec
    [junit] 
    [junit] Testcase: testOnlyReadsPublicStaticAnnotatedMethodsThatReturnMatcher(org.hamcrest.generator.ReflectiveFactoryReaderTest):
FAILED
    [junit] expected:<[g]oodMethod> but was:<[anotherG]oodMethod>
    [junit] junit.framework.ComparisonFailure: expected:<[g]oodMethod> but was:<[anotherG]oodMethod>
    [junit] 	at org.hamcrest.generator.ReflectiveFactoryReaderTest.testOnlyReadsPublicStaticAnnotatedMethodsThatReturnMatcher(ReflectiveFactoryReaderTest.java:88)
    [junit] 
    [junit] 

BUILD FAILED
/srv/gump/public/workspace/hamcrest/hamcrest-java/build.xml:118: Test org.hamcrest.generator.ReflectiveFactoryReaderTest
failed

Total time: 16 seconds
---------------------------------------------

To subscribe to this information via syndicated feeds:
- RSS: http://vmgump.apache.org/gump/public/hamcrest/hamcrest-java-unit-test/rss.xml
- Atom: http://vmgump.apache.org/gump/public/hamcrest/hamcrest-java-unit-test/atom.xml

============================== Gump Tracking Only ===
Produced by Apache Gump(TM) version 2.3.
Gump Run 06001211092012, vmgump.apache.org:vmgump:06001211092012
Gump E-mail Identifier (unique within run) #2.

*********************************************************** G U M P
[GUMP@vmgump]: Project lucene-java-contrib-test (in module lucene-java) failed
To whom it may engage...
        
This is an automated request, but not an unsolicited one. For 
more information please visit http://gump.apache.org/nagged.html, 
and/or contact the folk at general@gump.apache.org.

Project lucene-java-contrib-test has an issue affecting its community integration.
This issue affects 1 projects.
The current state of this project is 'Failed', with reason 'Build Failed'.
For reference only, the following projects are affected by this:
    - lucene-java-contrib-test :  Java Based Search Engine


Full details are available at:
    http://vmgump.apache.org/gump/public/lucene-java/lucene-java-contrib-test/index.html

That said, some information snippets are provided here.

The following annotations (debug/informational/warning/error messages) were provided:
 -DEBUG- Dependency on javacc exists, no need to add for property javacc.home.
 -INFO- Failed with reason build failed



The following work was performed:
http://vmgump.apache.org/gump/public/lucene-java/lucene-java-contrib-test/gump_work/build_lucene-java_lucene-java-contrib-test.html
Work Name: build_lucene-java_lucene-java-contrib-test (Type: Build)
Work ended in a state of : Failed
Elapsed: 9 secs
Command Line: /usr/lib/jvm/java-7-oracle/bin/java -Djava.awt.headless=true -Dbuild.sysclasspath=only
-Xbootclasspath/p:/srv/gump/public/workspace/xml-xalan/build/xalan-unbundled.jar:/srv/gump/public/workspace/xml-xalan/build/serializer.jar:/srv/gump/public/workspace/xml-commons/java/external/build/xml-apis.jar:/srv/gump/public/workspace/xml-xerces2/build/xercesImpl.jar
org.apache.tools.ant.Main -Dgump.merge=/srv/gump/public/gump/work/merge.xml -Dversion=11092012
-Divy.default.ivy.user.dir=/srv/gump/public/workspace/lucene-java/.ivy2 -Djavacc.home=/srv/gump/packages/javacc-3.1
test 
[Working Directory: /srv/gump/public/workspace/lucene-java/lucene]
CLASSPATH: /usr/lib/jvm/java-7-oracle/lib/tools.jar:/srv/gump/public/workspace/lucene-java/lucene/build/classes/tools:/srv/gump/public/workspace/lucene-java/lucene/build/classes/test:/srv/gump/public/workspace/lucene-java/lucene/build/contrib/demo/classes/test:/srv/gump/public/workspace/lucene-java/lucene/build/contrib/highlighter/classes/test:/srv/gump/public/workspace/lucene-java/lucene/build/contrib/instantiated/classes/test:/srv/gump/public/workspace/lucene-java/lucene/build/contrib/memory/classes/test:/srv/gump/public/workspace/lucene-java/lucene/build/contrib/misc/classes/test:/srv/gump/public/workspace/lucene-java/lucene/build/contrib/sandbox/classes/test:/srv/gump/public/workspace/lucene-java/lucene/build/contrib/spatial/classes/test:/srv/gump/public/workspace/lucene-java/lucene/queries/build/classes/test:/srv/gump/public/workspace/lucene-java/lucene/queryparser/build/classes/test:/srv/gump/public/workspace/ant/dist/lib/ant.jar:/srv/gump/public/workspace/ant/dist/lib/
 ant-launcher.jar:/srv/gump/public/workspace/ant/dist/lib/ant-jmf.jar:/srv/gump/public/workspace/ant/dist/lib/ant-junit.jar:/srv/gump/public/workspace/ant/dist/lib/ant-swing.jar:/srv/gump/public/workspace/ant/dist/lib/ant-apache-resolver.jar:/srv/gump/public/workspace/ant/dist/lib/ant-apache-xalan2.jar:/srv/gump/public/workspace/xml-commons/java/build/resolver.jar:/srv/gump/public/workspace/apache-commons/compress/target/commons-compress-1.5-SNAPSHOT.jar:/srv/gump/public/workspace/commons-digester-2.x/target/commons-digester-2.2-SNAPSHOT.jar:/srv/gump/public/workspace/apache-commons/logging/target/commons-logging-11092012.jar:/srv/gump/public/workspace/apache-commons/logging/target/commons-logging-api-11092012.jar:/srv/gump/packages/caucho-libs/hessian-3.0.8.jar:/srv/gump/public/workspace/icu4j/main/classes/core/out/lib/icu4j-core.jar:/srv/gump/public/workspace/icu4j/main/classes/collate/out/lib/icu4j-collate.jar:/srv/gump/public/workspace/icu4j/main/classes/currdata/out/lib/
 icu4j-currdata.jar:/srv/gump/public/workspace/icu4j/main/classes/langdata/out/lib/icu4j-langdata.jar:/srv/gump/public/workspace/icu4j/main/classes/regiondata/out/lib/icu4j-regiondata.jar:/srv/gump/public/workspace/icu4j/main/classes/translit/out/lib/icu4j-translit.jar:/srv/gump/public/workspace/icu4j/main/classes/charset/out/lib/icu4j-charset.jar:/srv/gump/public/workspace/icu4j/main/classes/localespi/out/lib/icu4j-localespi.jar:/srv/gump/packages/apache-attic/jakarta-regexp-1.5.jar:/srv/gump/public/workspace/jakarta-servletapi-5/jsr154/dist/lib/servlet-api.jar:/srv/gump/packages/javacc-3.1/bin/lib/javacc.jar:/srv/gump/public/workspace/jline/target/jline-0.9.95-SNAPSHOT.jar:/srv/gump/packages/jtidy/jtidy-r938.jar:/srv/gump/public/workspace/junit/dist/junit-11092012.jar:/srv/gump/public/workspace/junit/dist/junit-dep-11092012.jar:/srv/gump/public/workspace/lucene-java/lucene/build/core/lucene-core-11092012.jar:/srv/gump/public/workspace/lucene-java/lucene/build/analysis/icu/l
 ucene-analyzers-icu-11092012.jar:/srv/gump/public/workspace/lucene-java/lucene/build/analysis/smartcn/lucene-analyzers-smartcn-11092012.jar:/srv/gump/public/workspace/lucene-java/lucene/build/analysis/common/lucene-analyzers-common-11092012.jar:/srv/gump/public/workspace/lucene-java/lucene/build/analysis/stempel/lucene-analyzers-stempel-11092012.jar:/srv/gump/public/workspace/lucene-java/lucene/build/analysis/phonetic/lucene-analyzers-phonetic-11092012.jar:/srv/gump/public/workspace/lucene-java/lucene/build/analysis/morfologik/lucene-analyzers-morfologik-11092012.jar:/srv/gump/public/workspace/lucene-java/lucene/build/queries/lucene-queries-11092012.jar:/srv/gump/public/workspace/lucene-java/lucene/build/sandbox/lucene-sandbox-11092012.jar:/srv/gump/public/workspace/lucene-java/lucene/build/queryparser/lucene-queryparser-11092012.jar:/srv/gump/public/workspace/lucene-java/lucene/build/demo/lucene-demo-11092012.jar:/srv/gump/public/workspace/lucene-java/lucene/build/memory/lu
 cene-memory-11092012.jar:/srv/gump/public/workspace/lucene-java/lucene/build/highlighter/lucene-highlighter-11092012.jar:/srv/gump/public/workspace/lucene-java/lucene/build/misc/lucene-misc-11092012.jar:/srv/gump/public/workspace/lucene-java/lucene/build/test-framework/lucene-test-framework-11092012.jar:/srv/gump/packages/nekohtml-0.9.5/nekohtml.jar:/srv/gump/public/workspace/xml-commons/java/external/build/xml-apis-ext.jar:/srv/gump/public/workspace/ivy/build/artifact/jars/ivy-11092012.jar:/srv/gump/packages/bouncycastle-jdk14/bcpg-jdk14-145.jar:/srv/gump/packages/bouncycastle-jdk14/bcprov-ext-jdk14-145.jar:/srv/gump/packages/commons-httpclient/commons-httpclient-3.1.jar:/srv/gump/public/workspace/commons-codec-1.x/dist/commons-codec-11092012.jar:/srv/gump/packages/apache-attic/oro-2.0.8.jar:/srv/gump/packages/apache-commons/commons-vfs-1.0.jar:/srv/gump/packages/apache-attic/slide-webdavlib-2.1.jar:/srv/gump/packages/jsch/jsch-0.1.45.jar
---------------------------------------------

ivy-fail:

ivy-configure:
[ivy:configure] :: loading settings :: file = /srv/gump/public/workspace/lucene-java/lucene/ivy-settings.xml

resolve:

common.init:

compile-lucene-core:

init:

-clover.disable:

-clover.setup:

clover:

compile-core:

compile-core:

compile-test:

install-junit4-taskdef:
  [taskdef] Could not load definitions from resource com/carrotsearch/junit4/antlib.xml. It
could not be found.

validate:

test:

BUILD FAILED
/srv/gump/public/workspace/lucene-java/lucene/build.xml:49: The following error occurred while
executing this line:
/srv/gump/public/workspace/lucene-java/lucene/common-build.xml:1133: The following error occurred
while executing this line:
/srv/gump/public/workspace/lucene-java/lucene/common-build.xml:772: Problem: failed to create
task or type antlib:com.carrotsearch.junit4:pickseed
Cause: The name is undefined.
Action: Check the spelling.
Action: Check that any custom tasks/types have been declared.
Action: Check that any <presetdef>/<macrodef> declarations have taken place.
No types or tasks have been defined in this namespace yet

This appears to be an antlib declaration. 
Action: Check that the implementing library exists in one of:
        -ANT_HOME/lib
        -the IDE Ant configuration dialogs


Total time: 6 seconds
---------------------------------------------

To subscribe to this information via syndicated feeds:
- RSS: http://vmgump.apache.org/gump/public/lucene-java/lucene-java-contrib-test/rss.xml
- Atom: http://vmgump.apache.org/gump/public/lucene-java/lucene-java-contrib-test/atom.xml

============================== Gump Tracking Only ===
Produced by Apache Gump(TM) version 2.3.
Gump Run 06001211092012, vmgump.apache.org:vmgump:06001211092012
Gump E-mail Identifier (unique within run) #11.

*********************************************************** G U M P
[GUMP@vmgump]: Project mockito (in module mockito) failed
To whom it may engage...
        
This is an automated request, but not an unsolicited one. For 
more information please visit http://gump.apache.org/nagged.html, 
and/or contact the folk at general@gump.apache.org.

Project mockito has an issue affecting its community integration.
This issue affects 2 projects.
The current state of this project is 'Failed', with reason 'Build Failed'.
For reference only, the following projects are affected by this:
    - mockito :  Mockito is a mocking framework
    - xml-fop-test :  XSL-FO (Formatting Objects) processor


Full details are available at:
    http://vmgump.apache.org/gump/public/mockito/mockito/index.html

That said, some information snippets are provided here.

The following annotations (debug/informational/warning/error messages) were provided:
 -INFO- Failed with reason build failed
 -INFO- Failed to extract fallback artifacts from Gump Repository



The following work was performed:
http://vmgump.apache.org/gump/public/mockito/mockito/gump_work/build_mockito_mockito.html
Work Name: build_mockito_mockito (Type: Build)
Work ended in a state of : Failed
Elapsed: 12 secs
Command Line: /usr/lib/jvm/java-7-oracle/bin/java -Djava.awt.headless=true -Dbuild.sysclasspath=only
-Xbootclasspath/p:/srv/gump/public/workspace/xml-xalan/build/xalan-unbundled.jar:/srv/gump/public/workspace/xml-xalan/build/serializer.jar:/srv/gump/public/workspace/xml-commons/java/external/build/xml-apis.jar:/srv/gump/public/workspace/xml-xerces2/build/xercesImpl.jar
org.apache.tools.ant.Main -Dgump.merge=/srv/gump/public/gump/work/merge.xml -Dversion=11092012
jar 
[Working Directory: /srv/gump/public/workspace/mockito]
CLASSPATH: /usr/lib/jvm/java-7-oracle/lib/tools.jar:/srv/gump/public/workspace/mockito/lib/repackaged/cglib-and-asm-1.0.jar:/srv/gump/public/workspace/mockito/target/classes:/srv/gump/public/workspace/mockito/target/test-classes:/srv/gump/public/workspace/mockito/lib/build/pmd-4.1.jar:/srv/gump/public/workspace/mockito/lib/test/fest-assert-1.3.jar:/srv/gump/public/workspace/mockito/lib/test/fest-util-1.1.4.jar:/srv/gump/public/workspace/mockito/lib/test/powermock-reflect-1.2.5.jar:/srv/gump/public/workspace/ant/dist/lib/ant.jar:/srv/gump/public/workspace/ant/dist/lib/ant-launcher.jar:/srv/gump/public/workspace/ant/dist/lib/ant-jmf.jar:/srv/gump/public/workspace/ant/dist/lib/ant-junit.jar:/srv/gump/public/workspace/ant/dist/lib/ant-swing.jar:/srv/gump/public/workspace/ant/dist/lib/ant-apache-resolver.jar:/srv/gump/public/workspace/ant/dist/lib/ant-apache-xalan2.jar:/srv/gump/public/workspace/xml-commons/java/build/resolver.jar:/srv/gump/public/workspace/asm/output/dist/lib/asm
 -11092012.jar:/srv/gump/public/workspace/asm/output/dist/lib/all/asm-all-11092012.jar:/srv/gump/public/workspace/asm/output/dist/lib/asm-analysis-11092012.jar:/srv/gump/public/workspace/asm/output/dist/lib/asm-commons-11092012.jar:/srv/gump/public/workspace/asm/output/dist/lib/asm-tree-11092012.jar:/srv/gump/public/workspace/asm/output/dist/lib/asm-util-11092012.jar:/srv/gump/public/workspace/asm/output/dist/lib/asm-xml-11092012.jar:/srv/gump/packages/jarjar/jarjar-0.6.jar:/srv/gump/public/workspace/jaxen/target/jaxen-11092012.jar:/srv/gump/public/workspace/junit/dist/junit-11092012.jar:/srv/gump/public/workspace/junit/dist/junit-dep-11092012.jar:/srv/gump/public/workspace/objenesis/main/target/objenesis-1.2.jar:/srv/gump/public/workspace/xml-commons/java/external/build/xml-apis-ext.jar
---------------------------------------------
    [javac] import org.mockito.ReturnValues;
    [javac]                   ^
    [javac] /srv/gump/public/workspace/mockito/src/org/mockito/configuration/IMockitoConfiguration.java:7:
warning: [deprecation] ReturnValues in org.mockito has been deprecated
    [javac] import org.mockito.ReturnValues;
    [javac]                   ^
    [javac] /srv/gump/public/workspace/mockito/src/org/mockito/internal/configuration/GlobalConfiguration.java:7:
warning: [deprecation] ReturnValues in org.mockito has been deprecated
    [javac] import org.mockito.ReturnValues;
    [javac]                   ^
    [javac] /srv/gump/public/workspace/mockito/src/org/mockito/internal/runners/JUnit44RunnerImpl.java:8:
warning: [deprecation] InitializationError in org.junit.internal.runners has been deprecated
    [javac] import org.junit.internal.runners.InitializationError;
    [javac]                                  ^
    [javac] /srv/gump/public/workspace/mockito/src/org/mockito/internal/runners/JUnit44RunnerImpl.java:9:
warning: [deprecation] JUnit4ClassRunner in org.junit.internal.runners has been deprecated
    [javac] import org.junit.internal.runners.JUnit4ClassRunner;
    [javac]                                  ^
    [javac] /srv/gump/public/workspace/mockito/src/org/mockito/internal/stubbing/answers/AnswerReturnValuesAdapter.java:9:
warning: [deprecation] ReturnValues in org.mockito has been deprecated
    [javac] import org.mockito.ReturnValues;
    [javac]                   ^
    [javac] /srv/gump/public/workspace/mockito/src/org/mockito/internal/configuration/DefaultAnnotationEngine.java:32:
warning: [deprecation] createMockFor(Annotation,Field) in AnnotationEngine has been deprecated
    [javac]     public Object createMockFor(Annotation annotation, Field field) {
    [javac]                   ^
    [javac] /srv/gump/public/workspace/mockito/src/org/mockito/internal/configuration/SpyAnnotationEngine.java:41:
warning: [deprecation] createMockFor(Annotation,Field) in AnnotationEngine has been deprecated
    [javac]     public Object createMockFor(Annotation annotation, Field field) {
    [javac]                   ^
    [javac] /srv/gump/public/workspace/mockito/src/org/mockito/internal/configuration/injection/scanner/MockScanner.java:77:
warning: [deprecation] Mock in MockitoAnnotations has been deprecated
    [javac]                 || null != field.getAnnotation(MockitoAnnotations.Mock.class);
    [javac]                                                                  ^
    [javac] /srv/gump/public/workspace/mockito/src/org/mockito/internal/matchers/LocalizedMatcher.java:13:
error: LocalizedMatcher is not abstract and does not override abstract method describeMismatch(Object,Description)
in Matcher
    [javac] public class LocalizedMatcher implements Matcher, ContainsExtraTypeInformation,
CapturesArguments, MatcherDecorator, Serializable {
    [javac]        ^
    [javac] /srv/gump/public/workspace/mockito/src/org/mockito/internal/matchers/LocalizedMatcher.java:24:
warning: [deprecation] _dont_implement_Matcher___instead_extend_BaseMatcher_() in Matcher
has been deprecated
    [javac]     public void _dont_implement_Matcher___instead_extend_BaseMatcher_() {
    [javac]                 ^
    [javac] /srv/gump/public/workspace/mockito/src/org/mockito/internal/runners/JUnit45AndHigherRunnerImpl.java:24:
warning: [deprecation] withBefores(FrameworkMethod,Object,Statement) in BlockJUnit4ClassRunner
has been deprecated
    [javac]             protected Statement withBefores(FrameworkMethod method, Object target,
    [javac]                                 ^
    [javac] /srv/gump/public/workspace/mockito/src/org/mockito/internal/runners/JUnit45AndHigherRunnerImpl.java:28:
warning: [deprecation] withBefores(FrameworkMethod,Object,Statement) in BlockJUnit4ClassRunner
has been deprecated
    [javac]                 return super.withBefores(method, target, statement);
    [javac]                             ^
    [javac] /srv/gump/public/workspace/mockito/src/org/mockito/verification/Timeout.java:64:
warning: [deprecation] atMost(int) in VerificationWithTimeout has been deprecated
    [javac]     public VerificationMode atMost(int maxNumberOfInvocations) {
    [javac]                             ^
    [javac] Note: Some input files use unchecked or unsafe operations.
    [javac] Note: Recompile with -Xlint:unchecked for details.
    [javac] 1 error
    [javac] 13 warnings

BUILD FAILED
/srv/gump/public/workspace/mockito/build.xml:80: Compile failed; see the compiler error output
for details.

Total time: 11 seconds
---------------------------------------------

To subscribe to this information via syndicated feeds:
- RSS: http://vmgump.apache.org/gump/public/mockito/mockito/rss.xml
- Atom: http://vmgump.apache.org/gump/public/mockito/mockito/atom.xml

============================== Gump Tracking Only ===
Produced by Apache Gump(TM) version 2.3.
Gump Run 06001211092012, vmgump.apache.org:vmgump:06001211092012
Gump E-mail Identifier (unique within run) #12.

*********************************************************** G U M P
[GUMP@vmgump]: Project commons-jelly-tags-ant-test (in module commons-jelly) failed
To whom it may engage...
        
This is an automated request, but not an unsolicited one. For 
more information please visit http://gump.apache.org/nagged.html, 
and/or contact the folk at general@gump.apache.org.

Project commons-jelly-tags-ant-test has an issue affecting its community integration.
This issue affects 1 projects.
The current state of this project is 'Failed', with reason 'Build Failed'.
For reference only, the following projects are affected by this:
    - commons-jelly-tags-ant-test :  Commons Jelly


Full details are available at:
    http://vmgump.apache.org/gump/public/commons-jelly/commons-jelly-tags-ant-test/index.html

That said, some information snippets are provided here.

The following annotations (debug/informational/warning/error messages) were provided:
 -DEBUG- Dependency on ant exists, no need to add for property maven.jar.ant-optional.
 -DEBUG- Dependency on xml-xerces exists, no need to add for property maven.jar.xerces.
 -DEBUG- Dependency on commons-jexl-1.x exists, no need to add for property maven.jar.commons-jexl.
 -WARNING- Overriding Maven properties: [/srv/gump/public/workspace/commons-jelly/jelly-tags/ant/build.properties]
 -DEBUG- (Apache Gump generated) Apache Maven Properties in: /srv/gump/public/workspace/commons-jelly/jelly-tags/ant/build.properties
 -INFO- Failed with reason build failed
 -DEBUG- Maven POM in: /srv/gump/public/workspace/commons-jelly/jelly-tags/ant/project.xml
 -DEBUG- Maven project properties in: /srv/gump/public/workspace/commons-jelly/jelly-tags/ant/project.properties
 -INFO- Project Reports in: /srv/gump/public/workspace/commons-jelly/jelly-tags/ant/target/test-reports



The following work was performed:
http://vmgump.apache.org/gump/public/commons-jelly/commons-jelly-tags-ant-test/gump_work/build_commons-jelly_commons-jelly-tags-ant-test.html
Work Name: build_commons-jelly_commons-jelly-tags-ant-test (Type: Build)
Work ended in a state of : Failed
Elapsed: 11 secs
Command Line: maven --offline jar 
[Working Directory: /srv/gump/public/workspace/commons-jelly/jelly-tags/ant]
---------------------------------------------
    [junit] Actual expression: (${foo4.1})=(null)
    [junit] 	at org.apache.commons.jelly.tags.junit.AssertTagSupport.fail(AssertTagSupport.java:44)
    [junit] 	at org.apache.commons.jelly.tags.junit.AssertTagSupport.failNotEquals(AssertTagSupport.java:77)
    [junit] 	at org.apache.commons.jelly.tags.junit.AssertEqualsTag.doTag(AssertEqualsTag.java:56)
    [junit] 	at org.apache.commons.jelly.impl.TagScript.run(TagScript.java:267)
    [junit] 	at org.apache.commons.jelly.impl.ScriptBlock.run(ScriptBlock.java:96)
    [junit] 	at org.apache.commons.jelly.tags.junit.CaseTag$1.runTest(CaseTag.java:60)
    [junit] 
    [junit] 
    [junit] Testcase: startUpReadWrite(org.apache.commons.jelly.tags.junit.CaseTag$1):	Caused
an ERROR
    [junit] file:/srv/gump/public/workspace/commons-jelly/jelly-tags/ant/target/test-classes/org/apache/commons/jelly/ant/suite.jelly:98:5:
<test:assertEquals> file:/srv/gump/public/workspace/commons-jelly/jelly-tags/ant/target/test-classes/org/apache/commons/jelly/ant/suite.jelly:98:5:
<test:assertEquals>  expected:[bar5] but was:[null]
    [junit] Expected expression: (bar5)=(bar5)
    [junit] Actual expression: (${foo5.1})=(null)
    [junit] org.apache.commons.jelly.JellyTagException: file:/srv/gump/public/workspace/commons-jelly/jelly-tags/ant/target/test-classes/org/apache/commons/jelly/ant/suite.jelly:98:5:
<test:assertEquals> file:/srv/gump/public/workspace/commons-jelly/jelly-tags/ant/target/test-classes/org/apache/commons/jelly/ant/suite.jelly:98:5:
<test:assertEquals>  expected:[bar5] but was:[null]
    [junit] Expected expression: (bar5)=(bar5)
    [junit] Actual expression: (${foo5.1})=(null)
    [junit] 	at org.apache.commons.jelly.impl.TagScript.handleException(TagScript.java:732)
    [junit] 	at org.apache.commons.jelly.impl.TagScript.run(TagScript.java:287)
    [junit] 	at org.apache.commons.jelly.impl.ScriptBlock.run(ScriptBlock.java:96)
    [junit] 	at org.apache.commons.jelly.tags.junit.CaseTag$1.runTest(CaseTag.java:60)
    [junit] Caused by: org.apache.commons.jelly.tags.junit.JellyAssertionFailedError: file:/srv/gump/public/workspace/commons-jelly/jelly-tags/ant/target/test-classes/org/apache/commons/jelly/ant/suite.jelly:98:5:
<test:assertEquals>  expected:[bar5] but was:[null]
    [junit] Expected expression: (bar5)=(bar5)
    [junit] Actual expression: (${foo5.1})=(null)
    [junit] 	at org.apache.commons.jelly.tags.junit.AssertTagSupport.fail(AssertTagSupport.java:44)
    [junit] 	at org.apache.commons.jelly.tags.junit.AssertTagSupport.failNotEquals(AssertTagSupport.java:77)
    [junit] 	at org.apache.commons.jelly.tags.junit.AssertEqualsTag.doTag(AssertEqualsTag.java:56)
    [junit] 	at org.apache.commons.jelly.impl.TagScript.run(TagScript.java:267)
    [junit] Root cause
    [junit] org.apache.commons.jelly.tags.junit.JellyAssertionFailedError: file:/srv/gump/public/workspace/commons-jelly/jelly-tags/ant/target/test-classes/org/apache/commons/jelly/ant/suite.jelly:98:5:
<test:assertEquals>  expected:[bar5] but was:[null]
    [junit] Expected expression: (bar5)=(bar5)
    [junit] Actual expression: (${foo5.1})=(null)
    [junit] 	at org.apache.commons.jelly.tags.junit.AssertTagSupport.fail(AssertTagSupport.java:44)
    [junit] 	at org.apache.commons.jelly.tags.junit.AssertTagSupport.failNotEquals(AssertTagSupport.java:77)
    [junit] 	at org.apache.commons.jelly.tags.junit.AssertEqualsTag.doTag(AssertEqualsTag.java:56)
    [junit] 	at org.apache.commons.jelly.impl.TagScript.run(TagScript.java:267)
    [junit] 	at org.apache.commons.jelly.impl.ScriptBlock.run(ScriptBlock.java:96)
    [junit] 	at org.apache.commons.jelly.tags.junit.CaseTag$1.runTest(CaseTag.java:60)
    [junit] 
    [junit] 
    [junit] [ERROR] TEST org.apache.commons.jelly.ant.TestJelly FAILED

BUILD FAILED
File...... /home/gump/.maven/cache/maven-test-plugin-1.6.2/plugin.jelly
Element... fail
Line...... 181
Column.... 54
There were test failures.
Total time: 11 seconds
Finished at: Tue Sep 11 19:23:01 UTC 2012

---------------------------------------------

To subscribe to this information via syndicated feeds:
- RSS: http://vmgump.apache.org/gump/public/commons-jelly/commons-jelly-tags-ant-test/rss.xml
- Atom: http://vmgump.apache.org/gump/public/commons-jelly/commons-jelly-tags-ant-test/atom.xml

============================== Gump Tracking Only ===
Produced by Apache Gump(TM) version 2.3.
Gump Run 06001211092012, vmgump.apache.org:vmgump:06001211092012
Gump E-mail Identifier (unique within run) #14.

*********************************************************** G U M P
[GUMP@vmgump]: Project google-docbkx-maven-plugin (in module google-docbkx) failed
To whom it may engage...
        
This is an automated request, but not an unsolicited one. For 
more information please visit http://gump.apache.org/nagged.html, 
and/or contact the folk at general@gump.apache.org.

Project google-docbkx-maven-plugin has an issue affecting its community integration.
This issue affects 1 projects.
The current state of this project is 'Failed', with reason 'Build Failed'.
For reference only, the following projects are affected by this:
    - google-docbkx-maven-plugin :  A number of tools for handling DocBook XML transformations.


Full details are available at:
    http://vmgump.apache.org/gump/public/google-docbkx/google-docbkx-maven-plugin/index.html

That said, some information snippets are provided here.

The following annotations (debug/informational/warning/error messages) were provided:
 -DEBUG- (Apache Gump generated) Apache Maven Settings in: /srv/gump/public/workspace/google-docbkx/docbkx-maven-plugin/gump_mvn_settings.xml
 -INFO- Failed with reason build failed
 -DEBUG- Maven POM in: /srv/gump/public/workspace/google-docbkx/docbkx-maven-plugin/pom.xml
 -INFO- Failed to extract fallback artifacts from Gump Repository



The following work was performed:
http://vmgump.apache.org/gump/public/google-docbkx/google-docbkx-maven-plugin/gump_work/build_google-docbkx_google-docbkx-maven-plugin.html
Work Name: build_google-docbkx_google-docbkx-maven-plugin (Type: Build)
Work ended in a state of : Failed
Elapsed: 44 secs
Command Line: /opt/maven2/bin/mvn --batch-mode --settings /srv/gump/public/workspace/google-docbkx/docbkx-maven-plugin/gump_mvn_settings.xml
package 
[Working Directory: /srv/gump/public/workspace/google-docbkx/docbkx-maven-plugin]
M2_HOME: /opt/maven2
---------------------------------------------
[WARNING] Failed to obtain description for empty.local.l10n.xml
[WARNING] Failed to obtain description for local.l10n.xml
[WARNING] Failed to obtain description for webhelp.autolabel
[WARNING] Failed to obtain description for htmlhelp.output
[WARNING] Failed to parse description for olink.pubid
[INFO] Number of parameters: 332
[INFO] [docbkx-builder:build {execution: generate-template}]
[INFO] Number of parameters: 0
[INFO] [plugin:descriptor {execution: default-descriptor}]
[INFO] Using 2 extractors.
[INFO] Applying extractor for language: java
[INFO] Extractor for language: java found 10 mojo descriptors.
[INFO] Applying extractor for language: bsh
[INFO] Extractor for language: bsh found 0 mojo descriptors.
[INFO] [resources:resources {execution: default-resources}]
[WARNING] Using platform encoding (UTF-8 actually) to copy filtered resources, i.e. build
is platform dependent!
[INFO] Copying 4 resources
[INFO] [compiler:compile {execution: default-compile}]
[INFO] Compiling 21 source files to /srv/gump/public/workspace/google-docbkx/docbkx-maven-plugin/target/classes
[INFO] ------------------------------------------------------------------------
[ERROR] BUILD FAILURE
[INFO] ------------------------------------------------------------------------
[INFO] Compilation failure

/srv/gump/public/workspace/google-docbkx/docbkx-maven-plugin/src/main/java/com/agilejava/docbkx/maven/AbstractFoMojo.java:[125,44]
error: no suitable method found for newInstance()

    method FopFactory.newInstance(URI,InputStream) is not applicable
      (actual and formal argument lists differ in length)
    method FopFactory.newInstance(URI) is not applicable
      (actual and formal argument lists differ in length)
    method FopFactory.newInstance(File) is not applicable
      (actual and formal argument lists differ in length)
    method FopFactory.newInstance(FopFactoryConfig) is not applicable
      (actual and formal argument lists differ in length)
/srv/gump/public/workspace/google-docbkx/docbkx-maven-plugin/src/main/java/com/agilejava/docbkx/maven/AbstractFoMojo.java:[127,13]
error: cannot find symbol

could not parse error message:   symbol:   method setBaseURL(String)
  location: variable userAgent of type FOUserAgent
/srv/gump/public/workspace/google-docbkx/docbkx-maven-plugin/src/main/java/com/agilejava/docbkx/maven/AbstractFoMojo.java:139:
error: cannot find symbol
      fopFactory.setUserConfig(configuration);
                ^


[INFO] ------------------------------------------------------------------------
[INFO] For more information, run Maven with the -e switch
[INFO] ------------------------------------------------------------------------
[INFO] Total time: 43 seconds
[INFO] Finished at: Tue Sep 11 20:47:53 UTC 2012
[INFO] Final Memory: 31M/75M
[INFO] ------------------------------------------------------------------------
---------------------------------------------

To subscribe to this information via syndicated feeds:
- RSS: http://vmgump.apache.org/gump/public/google-docbkx/google-docbkx-maven-plugin/rss.xml
- Atom: http://vmgump.apache.org/gump/public/google-docbkx/google-docbkx-maven-plugin/atom.xml

============================== Gump Tracking Only ===
Produced by Apache Gump(TM) version 2.3.
Gump Run 06001211092012, vmgump.apache.org:vmgump:06001211092012
Gump E-mail Identifier (unique within run) #16.

*********************************************************** G U M P
[GUMP@vmgump]: Project cocoon-optional (in module cocoon3) failed
To whom it may engage...
        
This is an automated request, but not an unsolicited one. For 
more information please visit http://gump.apache.org/nagged.html, 
and/or contact the folk at general@gump.apache.org.

Project cocoon-optional has an issue affecting its community integration.
This issue affects 5 projects.
The current state of this project is 'Failed', with reason 'Build Failed'.
For reference only, the following projects are affected by this:
    - cocoon-all :  Java XML Framework
    - cocoon-databases :  Java XML Framework
    - cocoon-optional :  Java XML Framework
    - cocoon-optional-test :  Java XML Framework
    - cocoon3-reactor :  Java XML Framework


Full details are available at:
    http://vmgump.apache.org/gump/public/cocoon3/cocoon-optional/index.html

That said, some information snippets are provided here.

The following annotations (debug/informational/warning/error messages) were provided:
 -DEBUG- Sole jar output [cocoon-optional-*[0-9T].jar] identifier set to project name
 -INFO- Optional dependency solr prerequisite failed with reason build failed
 -INFO- Optional dependency commons-betwixt failed with reason build failed
 -INFO- Optional dependency tika-reactor failed with reason build failed
 -DEBUG- (Apache Gump generated) Apache Maven Settings in: /srv/gump/public/workspace/cocoon3/cocoon-optional/gump_mvn_settings.xml
 -INFO- Failed with reason build failed
 -DEBUG- Maven POM in: /srv/gump/public/workspace/cocoon3/cocoon-optional/pom.xml
 -INFO- Failed to extract fallback artifacts from Gump Repository



The following work was performed:
http://vmgump.apache.org/gump/public/cocoon3/cocoon-optional/gump_work/build_cocoon3_cocoon-optional.html
Work Name: build_cocoon3_cocoon-optional (Type: Build)
Work ended in a state of : Failed
Elapsed: 30 secs
Command Line: /opt/maven2/bin/mvn --batch-mode -DskipTests=true --settings /srv/gump/public/workspace/cocoon3/cocoon-optional/gump_mvn_settings.xml
install 
[Working Directory: /srv/gump/public/workspace/cocoon3/cocoon-optional]
M2_HOME: /opt/maven2
---------------------------------------------
Downloading: http://localhost:8192/maven/2/org/apache/xmlgraphics/batik-extension/1.7/batik-extension-1.7.jar
54K downloaded  (batik-extension-1.7.jar)
4431K downloaded  (lucene-kuromoji-3.6.1.jar)
Downloading: http://localhost:8192/maven/2/org/apache/lucene/lucene-misc/3.6.1/lucene-misc-3.6.1.jar
49K downloaded  (lucene-misc-3.6.1.jar)
Downloading: http://localhost:8192/maven/2/org/apache/lucene/lucene-phonetic/3.6.1/lucene-phonetic-3.6.1.jar
[INFO] Unable to find resource 'org.apache.lucene:lucene-phonetic:jar:3.6.1' in repository
maven2-repository.dev.java.net (http://download.java.net/maven/2/)
Downloading: http://localhost:8192/maven2/org/apache/lucene/lucene-phonetic/3.6.1/lucene-phonetic-3.6.1.jar
14K downloaded  (lucene-phonetic-3.6.1.jar)
Downloading: http://localhost:8192/maven/2/org/apache/lucene/lucene-spatial/3.6.1/lucene-spatial-3.6.1.jar
[INFO] Unable to find resource 'org.apache.lucene:lucene-spatial:jar:3.6.1' in repository
maven2-repository.dev.java.net (http://download.java.net/maven/2/)
Downloading: http://localhost:8192/maven2/org/apache/lucene/lucene-spatial/3.6.1/lucene-spatial-3.6.1.jar
58K downloaded  (lucene-spatial-3.6.1.jar)
Downloading: http://localhost:8192/maven/2/org/apache/lucene/lucene-spellchecker/3.6.1/lucene-spellchecker-3.6.1.jar
[INFO] Unable to find resource 'org.apache.lucene:lucene-spellchecker:jar:3.6.1' in repository
maven2-repository.dev.java.net (http://download.java.net/maven/2/)
Downloading: http://localhost:8192/maven2/org/apache/lucene/lucene-spellchecker/3.6.1/lucene-spellchecker-3.6.1.jar
102K downloaded  (lucene-spellchecker-3.6.1.jar)
Downloading: http://localhost:8192/maven/2/org/apache/lucene/lucene-grouping/3.6.1/lucene-grouping-3.6.1.jar
[INFO] Unable to find resource 'org.apache.lucene:lucene-grouping:jar:3.6.1' in repository
maven2-repository.dev.java.net (http://download.java.net/maven/2/)
Downloading: http://localhost:8192/maven2/org/apache/lucene/lucene-grouping/3.6.1/lucene-grouping-3.6.1.jar
62K downloaded  (lucene-grouping-3.6.1.jar)
[INFO] [enforcer:enforce {execution: enforce-maven}]
[WARNING] The parameter expression: 'project.build.resources' used in mojo: 'process' has
been deprecated. Use 'project.resources' instead.
[INFO] [remote-resources:process {execution: default}]
[debug] execute contextualize
[INFO] [resources:resources {execution: default-resources}]
[INFO] Using 'UTF-8' encoding to copy filtered resources.
[INFO] Copying 3 resources
[INFO] Copying 3 resources
[INFO] [compiler:compile {execution: default-compile}]
[INFO] Compiling 16 source files to /srv/gump/public/workspace/cocoon3/cocoon-optional/target/classes
[INFO] -------------------------------------------------------------
[ERROR] COMPILATION ERROR : 
[INFO] -------------------------------------------------------------
[ERROR] /srv/gump/public/workspace/cocoon3/cocoon-optional/src/main/java/org/apache/cocoon/optional/pipeline/components/sax/fop/FopSerializer.java:[37,60]
error: no suitable method found for newInstance()
[INFO] 1 error
[INFO] -------------------------------------------------------------
[INFO] ------------------------------------------------------------------------
[ERROR] BUILD FAILURE
[INFO] ------------------------------------------------------------------------
[INFO] Compilation failure
/srv/gump/public/workspace/cocoon3/cocoon-optional/src/main/java/org/apache/cocoon/optional/pipeline/components/sax/fop/FopSerializer.java:[37,60]
error: no suitable method found for newInstance()

[INFO] ------------------------------------------------------------------------
[INFO] For more information, run Maven with the -e switch
[INFO] ------------------------------------------------------------------------
[INFO] Total time: 28 seconds
[INFO] Finished at: Tue Sep 11 21:21:11 UTC 2012
[INFO] Final Memory: 61M/146M
[INFO] ------------------------------------------------------------------------
---------------------------------------------

To subscribe to this information via syndicated feeds:
- RSS: http://vmgump.apache.org/gump/public/cocoon3/cocoon-optional/rss.xml
- Atom: http://vmgump.apache.org/gump/public/cocoon3/cocoon-optional/atom.xml

============================== Gump Tracking Only ===
Produced by Apache Gump(TM) version 2.3.
Gump Run 06001211092012, vmgump.apache.org:vmgump:06001211092012
Gump E-mail Identifier (unique within run) #17.


--
Apache Gump
http://gump.apache.org/ [Instance: vmgump]

---------------------------------------------------------------------
To unsubscribe, e-mail: general-unsubscribe@gump.apache.org
For additional commands, e-mail: general-help@gump.apache.org


Mime
View raw message