gump-general mailing list archives

Site index · List index
Message view « Date » · « Thread »
Top « Date » · « Thread »
From g...@vmgump.apache.org
Subject BATCH: All dressed up, with nowhere to go...
Date Sat, 08 Sep 2012 21:20:58 GMT
Dear Gumpmeisters,
            
The following 1 notifys should have been sent

*********************************************************** G U M P
[GUMP@vmgump]: Project camel-test-spring (in module camel) failed
*********************************************************** G U M P
[GUMP@vmgump]: Project camel-test-spring (in module camel) failed
To whom it may engage...
        
This is an automated request, but not an unsolicited one. For 
more information please visit http://gump.apache.org/nagged.html, 
and/or contact the folk at general@gump.apache.org.

Project camel-test-spring has an issue affecting its community integration.
This issue affects 3 projects.
The current state of this project is 'Failed', with reason 'Build Failed'.
For reference only, the following projects are affected by this:
    - camel-jms :  Camel :: JMS
    - camel-jms-test :  Integration framework based on known Enterprise Integration
...
    - camel-test-spring :  Camel :: Test Spring


Full details are available at:
    http://vmgump.apache.org/gump/public/camel/camel-test-spring/index.html

That said, some information snippets are provided here.

The following annotations (debug/informational/warning/error messages) were provided:
 -DEBUG- Sole jar output [camel-test-spring-*[0-9T].jar] identifier set to project name
 -DEBUG- (Apache Gump generated) Apache Maven Settings in: /srv/gump/public/workspace/camel/components/camel-test-spring/gump_mvn_settings.xml
 -INFO- Failed with reason build failed
 -DEBUG- Maven POM in: /srv/gump/public/workspace/camel/components/camel-test-spring/pom.xml
 -INFO- Failed to extract fallback artifacts from Gump Repository



The following work was performed:
http://vmgump.apache.org/gump/public/camel/camel-test-spring/gump_work/build_camel_camel-test-spring.html
Work Name: build_camel_camel-test-spring (Type: Build)
Work ended in a state of : Failed
Elapsed: 20 secs
Command Line: /opt/maven2/bin/mvn --batch-mode --settings /srv/gump/public/workspace/camel/components/camel-test-spring/gump_mvn_settings.xml
install 
[Working Directory: /srv/gump/public/workspace/camel/components/camel-test-spring]
M2_HOME: /opt/maven2
---------------------------------------------
Tests run: 1, Failures: 0, Errors: 1, Skipped: 0, Time elapsed: 0.003 sec <<< FAILURE!
Running org.apache.camel.test.junit4.CamelSpringJUnit4ClassRunnerShutdownTimeoutTest
Tests run: 1, Failures: 0, Errors: 1, Skipped: 0, Time elapsed: 0.002 sec <<< FAILURE!
Running org.apache.camel.test.junit4.CamelSpringJUnit4ClassRunnerUseAdviceWithTest
Tests run: 1, Failures: 0, Errors: 1, Skipped: 0, Time elapsed: 0.005 sec <<< FAILURE!
Running org.apache.camel.test.patterns.DebugSpringCamelContextTest
Tests run: 1, Failures: 0, Errors: 1, Skipped: 0, Time elapsed: 0.314 sec <<< FAILURE!
Running org.apache.camel.test.patterns.DebugSpringTest
Tests run: 1, Failures: 0, Errors: 1, Skipped: 0, Time elapsed: 0.011 sec <<< FAILURE!
Running org.apache.camel.test.patterns.ProduceBeanTest
Tests run: 1, Failures: 0, Errors: 1, Skipped: 0, Time elapsed: 0.019 sec <<< FAILURE!

Results :

Tests in error: 
  initializationError(org.apache.camel.test.junit4.CamelSpringJUnit4ClassRunnerDisableJmxInheritedOverrideTest):
org/apache/commons/logging/LogFactory
  initializationError(org.apache.camel.test.junit4.CamelSpringJUnit4ClassRunnerDisableJmxInheritedTest):
Could not initialize class org.apache.camel.test.junit4.CamelSpringJUnit4ClassRunner
  initializationError(org.apache.camel.test.junit4.CamelSpringJUnit4ClassRunnerDisableJmxTest):
Could not initialize class org.apache.camel.test.junit4.CamelSpringJUnit4ClassRunner
  initializationError(org.apache.camel.test.junit4.CamelSpringJUnit4ClassRunnerExcludeRoutesTest):
Could not initialize class org.apache.camel.test.junit4.CamelSpringJUnit4ClassRunner
  initializationError(org.apache.camel.test.junit4.CamelSpringJUnit4ClassRunnerLazyLoadTypeConvertersInheritedOverrideTest):
Could not initialize class org.apache.camel.test.junit4.CamelSpringJUnit4ClassRunner
  initializationError(org.apache.camel.test.junit4.CamelSpringJUnit4ClassRunnerLazyLoadTypeConvertersInheritedTest):
Could not initialize class org.apache.camel.test.junit4.CamelSpringJUnit4ClassRunner
  initializationError(org.apache.camel.test.junit4.CamelSpringJUnit4ClassRunnerLazyLoadTypeConvertersTest):
Could not initialize class org.apache.camel.test.junit4.CamelSpringJUnit4ClassRunner
  initializationError(org.apache.camel.test.junit4.CamelSpringJUnit4ClassRunnerMockEndpointsAndSkipTest):
Could not initialize class org.apache.camel.test.junit4.CamelSpringJUnit4ClassRunner
  initializationError(org.apache.camel.test.junit4.CamelSpringJUnit4ClassRunnerMockEndpointsTest):
Could not initialize class org.apache.camel.test.junit4.CamelSpringJUnit4ClassRunner
  initializationError(org.apache.camel.test.junit4.CamelSpringJUnit4ClassRunnerPlainTest):
Could not initialize class org.apache.camel.test.junit4.CamelSpringJUnit4ClassRunner
  initializationError(org.apache.camel.test.junit4.CamelSpringJUnit4ClassRunnerProvidesBreakpointInherritedTest):
Could not initialize class org.apache.camel.test.junit4.CamelSpringJUnit4ClassRunner
  initializationError(org.apache.camel.test.junit4.CamelSpringJUnit4ClassRunnerProvidesBreakpointTest):
Could not initialize class org.apache.camel.test.junit4.CamelSpringJUnit4ClassRunner
  initializationError(org.apache.camel.test.junit4.CamelSpringJUnit4ClassRunnerShutdownTimeoutInheritedOverrideTest):
Could not initialize class org.apache.camel.test.junit4.CamelSpringJUnit4ClassRunner
  initializationError(org.apache.camel.test.junit4.CamelSpringJUnit4ClassRunnerShutdownTimeoutInheritedTest):
Could not initialize class org.apache.camel.test.junit4.CamelSpringJUnit4ClassRunner
  initializationError(org.apache.camel.test.junit4.CamelSpringJUnit4ClassRunnerShutdownTimeoutTest):
Could not initialize class org.apache.camel.test.junit4.CamelSpringJUnit4ClassRunner
  initializationError(org.apache.camel.test.junit4.CamelSpringJUnit4ClassRunnerUseAdviceWithTest):
Could not initialize class org.apache.camel.test.junit4.CamelSpringJUnit4ClassRunner
  testDebugger(org.apache.camel.test.patterns.DebugSpringCamelContextTest): org/apache/commons/logging/LogFactory
  testDebugger(org.apache.camel.test.patterns.DebugSpringTest): org/apache/commons/logging/LogFactory
  testProduceBean(org.apache.camel.test.patterns.ProduceBeanTest): org/apache/commons/logging/LogFactory

Tests run: 19, Failures: 0, Errors: 19, Skipped: 0

[INFO] ------------------------------------------------------------------------
[ERROR] BUILD FAILURE
[INFO] ------------------------------------------------------------------------
[INFO] There are test failures.

Please refer to /srv/gump/public/workspace/camel/components/camel-test-spring/target/surefire-reports
for the individual test results.
[INFO] ------------------------------------------------------------------------
[INFO] For more information, run Maven with the -e switch
[INFO] ------------------------------------------------------------------------
[INFO] Total time: 19 seconds
[INFO] Finished at: Sat Sep 08 16:48:18 UTC 2012
[INFO] Final Memory: 27M/65M
[INFO] ------------------------------------------------------------------------
---------------------------------------------

To subscribe to this information via syndicated feeds:
- RSS: http://vmgump.apache.org/gump/public/camel/camel-test-spring/rss.xml
- Atom: http://vmgump.apache.org/gump/public/camel/camel-test-spring/atom.xml

============================== Gump Tracking Only ===
Produced by Apache Gump(TM) version 2.3.
Gump Run 06001208092012, vmgump.apache.org:vmgump:06001208092012
Gump E-mail Identifier (unique within run) #7.


--
Apache Gump
http://gump.apache.org/ [Instance: vmgump]

---------------------------------------------------------------------
To unsubscribe, e-mail: general-unsubscribe@gump.apache.org
For additional commands, e-mail: general-help@gump.apache.org


Mime
View raw message