gump-general mailing list archives

Site index · List index
Message view « Date » · « Thread »
Top « Date » · « Thread »
From g...@vmgump.apache.org
Subject BATCH: All dressed up, with nowhere to go...
Date Sat, 02 Jun 2012 03:20:17 GMT
Dear Gumpmeisters,
            
The following 5 notifys should have been sent

*********************************************************** G U M P
[GUMP@vmgump]: Project cocoon22-xml-test (in module cocoon) failed
[GUMP@vmgump]: Project cocoon22-spring-configurator (in module cocoon) failed
[GUMP@vmgump]: Project lenya-core-api (in module lenya) failed
[GUMP@vmgump]: Project lenya-reactor (in module lenya) failed
[GUMP@vmgump]: Project camel-jms-test (in module camel) failed
*********************************************************** G U M P
[GUMP@vmgump]: Project cocoon22-xml-test (in module cocoon) failed
To whom it may engage...
        
This is an automated request, but not an unsolicited one. For 
more information please visit http://gump.apache.org/nagged.html, 
and/or contact the folk at general@gump.apache.org.

Project cocoon22-xml-test has an issue affecting its community integration.
This issue affects 1 projects.
The current state of this project is 'Failed', with reason 'Build Failed'.
For reference only, the following projects are affected by this:
    - cocoon22-xml-test :  Java XML FrameworkJava XML Framework


Full details are available at:
    http://vmgump.apache.org/gump/public/cocoon/cocoon22-xml-test/index.html

That said, some information snippets are provided here.

The following annotations (debug/informational/warning/error messages) were provided:
 -DEBUG- (Apache Gump generated) Apache Maven Settings in: /srv/gump/public/workspace/cocoon/cocoon-xml/gump_mvn_settings.xml
 -INFO- Failed with reason build failed
 -INFO- Project Reports in: /srv/gump/public/workspace/cocoon/cocoon-xml/target/surefire-reports
 -WARNING- No directory [/srv/gump/public/workspace/cocoon/cocoon-xml/target/surefire-reports]



The following work was performed:
http://vmgump.apache.org/gump/public/cocoon/cocoon22-xml-test/gump_work/build_cocoon_cocoon22-xml-test.html
Work Name: build_cocoon_cocoon22-xml-test (Type: Build)
Work ended in a state of : Failed
Elapsed: 2 secs
Command Line: /opt/maven2/bin/mvn --batch-mode --settings /srv/gump/public/workspace/cocoon/cocoon-xml/gump_mvn_settings.xml
test 
[Working Directory: /srv/gump/public/workspace/cocoon/cocoon-xml]
M2_HOME: /opt/maven2
---------------------------------------------
[INFO] Scanning for projects...
[INFO] ------------------------------------------------------------------------
[INFO] Building Maven Default Project
[INFO]    task-segment: [test]
[INFO] ------------------------------------------------------------------------
[INFO] ------------------------------------------------------------------------
[ERROR] BUILD ERROR
[INFO] ------------------------------------------------------------------------
[INFO] Cannot execute mojo: resources. It requires a project with an existing pom.xml, but
the build is not using one.
[INFO] ------------------------------------------------------------------------
[INFO] For more information, run Maven with the -e switch
[INFO] ------------------------------------------------------------------------
[INFO] Total time: 1 second
[INFO] Finished at: Fri Jun 01 19:08:46 UTC 2012
[INFO] Final Memory: 3M/15M
[INFO] ------------------------------------------------------------------------
---------------------------------------------

To subscribe to this information via syndicated feeds:
- RSS: http://vmgump.apache.org/gump/public/cocoon/cocoon22-xml-test/rss.xml
- Atom: http://vmgump.apache.org/gump/public/cocoon/cocoon22-xml-test/atom.xml

============================== Gump Tracking Only ===
Produced by Apache Gump(TM) version 2.3.
Gump Run 09001801062012, vmgump.apache.org:vmgump:09001801062012
Gump E-mail Identifier (unique within run) #1.

*********************************************************** G U M P
[GUMP@vmgump]: Project cocoon22-spring-configurator (in module cocoon) failed
To whom it may engage...
        
This is an automated request, but not an unsolicited one. For 
more information please visit http://gump.apache.org/nagged.html, 
and/or contact the folk at general@gump.apache.org.

Project cocoon22-spring-configurator has an issue affecting its community integration.
This issue affects 1 projects.
The current state of this project is 'Failed', with reason 'Configuration Failed'.
For reference only, the following projects are affected by this:
    - cocoon22-spring-configurator :  Java XML FrameworkJava XML Framework


Full details are available at:
    http://vmgump.apache.org/gump/public/cocoon/cocoon22-spring-configurator/index.html

That said, some information snippets are provided here.

The following annotations (debug/informational/warning/error messages) were provided:
 -INFO- Failed with reason configuration failed
 -ERROR- Bad Dependency. Project: cocoon22-parent : unknown to *this* workspace 
 -INFO- Optional dependency commons-logging prerequisite failed with reason build failed
 -INFO- Optional dependency logging-log4j-12 failed with reason build failed
 -INFO- Failed to extract fallback artifacts from Gump Repository

To subscribe to this information via syndicated feeds:
- RSS: http://vmgump.apache.org/gump/public/cocoon/cocoon22-spring-configurator/rss.xml
- Atom: http://vmgump.apache.org/gump/public/cocoon/cocoon22-spring-configurator/atom.xml

============================== Gump Tracking Only ===
Produced by Apache Gump(TM) version 2.3.
Gump Run 09001801062012, vmgump.apache.org:vmgump:09001801062012
Gump E-mail Identifier (unique within run) #2.

*********************************************************** G U M P
[GUMP@vmgump]: Project lenya-core-api (in module lenya) failed
To whom it may engage...
        
This is an automated request, but not an unsolicited one. For 
more information please visit http://gump.apache.org/nagged.html, 
and/or contact the folk at general@gump.apache.org.

Project lenya-core-api has an issue affecting its community integration.
This issue affects 1 projects.
The current state of this project is 'Failed', with reason 'Configuration Failed'.
For reference only, the following projects are affected by this:
    - lenya-core-api :  Content Management System


Full details are available at:
    http://vmgump.apache.org/gump/public/lenya/lenya-core-api/index.html

That said, some information snippets are provided here.

The following annotations (debug/informational/warning/error messages) were provided:
 -INFO- Failed with reason configuration failed
 -ERROR- Bad Dependency. Project: cocoon22-flowscript-impl : unknown to *this* workspace 
 -WARNING- Bad *Optional* Dependency. Project: cocoon22-chaperon-impl : unknown to *this*
workspace
 -WARNING- Bad *Optional* Dependency. Project: cocoon22-core : unknown to *this* workspace
 -WARNING- Bad *Optional* Dependency. Project: cocoon22-serializers-impl : unknown to *this*
workspace
 -WARNING- Bad *Optional* Dependency. Project: cocoon22-serializers-impl : unknown to *this*
workspace
 -WARNING- Bad *Optional* Dependency. Project: cocoon22-sitemap-impl : unknown to *this* workspace
 -WARNING- Bad *Optional* Dependency. Project: cocoon22-validation-impl : unknown to *this*
workspace
 -INFO- Optional dependency commons-validator prerequisite failed with reason build failed

To subscribe to this information via syndicated feeds:
- RSS: http://vmgump.apache.org/gump/public/lenya/lenya-core-api/rss.xml
- Atom: http://vmgump.apache.org/gump/public/lenya/lenya-core-api/atom.xml

============================== Gump Tracking Only ===
Produced by Apache Gump(TM) version 2.3.
Gump Run 09001801062012, vmgump.apache.org:vmgump:09001801062012
Gump E-mail Identifier (unique within run) #3.

*********************************************************** G U M P
[GUMP@vmgump]: Project lenya-reactor (in module lenya) failed
To whom it may engage...
        
This is an automated request, but not an unsolicited one. For 
more information please visit http://gump.apache.org/nagged.html, 
and/or contact the folk at general@gump.apache.org.

Project lenya-reactor has an issue affecting its community integration.
This issue affects 1 projects.
The current state of this project is 'Failed', with reason 'Configuration Failed'.
For reference only, the following projects are affected by this:
    - lenya-reactor :  Content Management System


Full details are available at:
    http://vmgump.apache.org/gump/public/lenya/lenya-reactor/index.html

That said, some information snippets are provided here.

The following annotations (debug/informational/warning/error messages) were provided:
 -INFO- Failed with reason configuration failed
 -ERROR- Bad Dependency. Project: cocoon22-flowscript-impl : unknown to *this* workspace 
 -WARNING- Bad *Optional* Dependency. Project: cocoon22-reactor : unknown to *this* workspace
 -INFO- Optional dependency velocity-engine prerequisite failed with reason build failed
 -INFO- Optional dependency commons-validator prerequisite failed with reason build failed
 -INFO- Optional dependency commons-digester prerequisite failed with reason build failed
 -INFO- Optional dependency commons-beanutils prerequisite failed with reason build failed
 -INFO- Optional dependency commons-logging prerequisite failed with reason build failed

To subscribe to this information via syndicated feeds:
- RSS: http://vmgump.apache.org/gump/public/lenya/lenya-reactor/rss.xml
- Atom: http://vmgump.apache.org/gump/public/lenya/lenya-reactor/atom.xml

============================== Gump Tracking Only ===
Produced by Apache Gump(TM) version 2.3.
Gump Run 09001801062012, vmgump.apache.org:vmgump:09001801062012
Gump E-mail Identifier (unique within run) #4.

*********************************************************** G U M P
[GUMP@vmgump]: Project camel-jms-test (in module camel) failed
To whom it may engage...
        
This is an automated request, but not an unsolicited one. For 
more information please visit http://gump.apache.org/nagged.html, 
and/or contact the folk at general@gump.apache.org.

Project camel-jms-test has an issue affecting its community integration.
This issue affects 1 projects.
The current state of this project is 'Failed', with reason 'Build Failed'.
For reference only, the following projects are affected by this:
    - camel-jms-test :  Integration framework based on known Enterprise Integration
...


Full details are available at:
    http://vmgump.apache.org/gump/public/camel/camel-jms-test/index.html

That said, some information snippets are provided here.

The following annotations (debug/informational/warning/error messages) were provided:
 -WARNING- Overriding Maven settings: [/srv/gump/public/workspace/camel/components/camel-jms/gump_mvn_settings.xml]
 -DEBUG- (Apache Gump generated) Apache Maven Settings in: /srv/gump/public/workspace/camel/components/camel-jms/gump_mvn_settings.xml
 -INFO- Failed with reason build failed
 -DEBUG- Maven POM in: /srv/gump/public/workspace/camel/components/camel-jms/pom.xml
 -INFO- Project Reports in: /srv/gump/public/workspace/camel/components/camel-jms/target/surefire-report
 -WARNING- No directory [/srv/gump/public/workspace/camel/components/camel-jms/target/surefire-report]



The following work was performed:
http://vmgump.apache.org/gump/public/camel/camel-jms-test/gump_work/build_camel_camel-jms-test.html
Work Name: build_camel_camel-jms-test (Type: Build)
Work ended in a state of : Failed
Elapsed: 21 mins 26 secs
Command Line: /opt/maven2/bin/mvn --batch-mode --settings /srv/gump/public/workspace/camel/components/camel-jms/gump_mvn_settings.xml
test 
[Working Directory: /srv/gump/public/workspace/camel/components/camel-jms]
M2_HOME: /opt/maven2
---------------------------------------------
Running org.apache.camel.component.jms.tx.JMXTXUseOriginalBodyWithTXErrorHandlerTest
Tests run: 2, Failures: 0, Errors: 0, Skipped: 0, Time elapsed: 8.026 sec
Running org.apache.camel.component.jms.tx.JmsToJmsTransactedSecurityTest
Tests run: 2, Failures: 0, Errors: 0, Skipped: 0, Time elapsed: 9.558 sec
Running org.apache.camel.component.jms.tx.JmsToJmsTransactedTest
Tests run: 4, Failures: 0, Errors: 0, Skipped: 0, Time elapsed: 7.587 sec
Running org.apache.camel.component.jms.tx.QueueToProcessorTransactionTest
Tests run: 1, Failures: 0, Errors: 0, Skipped: 0, Time elapsed: 5.497 sec
Running org.apache.camel.component.jms.tx.QueueToQueueRequestReplyTransactionTest
Tests run: 1, Failures: 0, Errors: 0, Skipped: 0, Time elapsed: 12.799 sec
Running org.apache.camel.component.jms.tx.QueueToQueueTransactionTest
Tests run: 1, Failures: 0, Errors: 0, Skipped: 0, Time elapsed: 5.636 sec
Running org.apache.camel.component.jms.tx.QueueToQueueTransactionWithoutDefineTransactionManagerTest
Tests run: 1, Failures: 0, Errors: 0, Skipped: 0, Time elapsed: 3.49 sec
Running org.apache.camel.component.jms.tx.RouteIdTransactedTest
Tests run: 2, Failures: 0, Errors: 0, Skipped: 0, Time elapsed: 4.744 sec
Running org.apache.camel.component.jms.tx.TransactedAsyncUsingThreadsTest
Tests run: 2, Failures: 0, Errors: 0, Skipped: 0, Time elapsed: 3.818 sec
Running org.apache.camel.component.jms.tx.TransactionErrorHandlerBuilderAsSpringBeanTest
Tests run: 1, Failures: 0, Errors: 0, Skipped: 0, Time elapsed: 5.909 sec
Running org.apache.camel.component.jms.tx.TransactionErrorHandlerCustomerSpringParserTest
Tests run: 1, Failures: 0, Errors: 0, Skipped: 0, Time elapsed: 6.05 sec
Running org.apache.camel.component.jms.tx.TransactionInterceptSendToEndpointTest
Tests run: 1, Failures: 0, Errors: 0, Skipped: 0, Time elapsed: 4.998 sec
Running org.apache.camel.component.jms.tx.TransactionMinimalConfigurationTest
Tests run: 1, Failures: 0, Errors: 0, Skipped: 0, Time elapsed: 5.433 sec
Running org.apache.camel.component.jms.tx.XMLQueueToProcessorTransactionTest
Tests run: 1, Failures: 0, Errors: 0, Skipped: 0, Time elapsed: 4.661 sec
Running org.apache.camel.component.jms.tx.XMLQueueToQueueTransactionTest
Tests run: 1, Failures: 0, Errors: 0, Skipped: 0, Time elapsed: 4.724 sec

Results :

Failed tests: 

Tests run: 384, Failures: 1, Errors: 0, Skipped: 5

[INFO] ------------------------------------------------------------------------
[ERROR] BUILD FAILURE
[INFO] ------------------------------------------------------------------------
[INFO] There are test failures.

Please refer to /srv/gump/public/workspace/camel/components/camel-jms/target/surefire-reports
for the individual test results.
[INFO] ------------------------------------------------------------------------
[INFO] For more information, run Maven with the -e switch
[INFO] ------------------------------------------------------------------------
[INFO] Total time: 21 minutes 24 seconds
[INFO] Finished at: Sat Jun 02 03:08:43 UTC 2012
[INFO] Final Memory: 33M/81M
[INFO] ------------------------------------------------------------------------
---------------------------------------------

To subscribe to this information via syndicated feeds:
- RSS: http://vmgump.apache.org/gump/public/camel/camel-jms-test/rss.xml
- Atom: http://vmgump.apache.org/gump/public/camel/camel-jms-test/atom.xml

============================== Gump Tracking Only ===
Produced by Apache Gump(TM) version 2.3.
Gump Run 09001801062012, vmgump.apache.org:vmgump:09001801062012
Gump E-mail Identifier (unique within run) #5.


--
Apache Gump
http://gump.apache.org/ [Instance: vmgump]

---------------------------------------------------------------------
To unsubscribe, e-mail: general-unsubscribe@gump.apache.org
For additional commands, e-mail: general-help@gump.apache.org


Mime
View raw message