gump-general mailing list archives

Site index · List index
Message view « Date » · « Thread »
Top « Date » · « Thread »
From g...@vmgump.apache.org
Subject BATCH: All dressed up, with nowhere to go...
Date Wed, 18 Apr 2012 21:38:17 GMT
Dear Gumpmeisters,
            
The following 1 notifys should have been sent

*********************************************************** G U M P
[GUMP@vmgump]: Project httpcomponents-client (in module httpcomponents) failed
*********************************************************** G U M P
[GUMP@vmgump]: Project httpcomponents-client (in module httpcomponents) failed
To whom it may engage...
        
This is an automated request, but not an unsolicited one. For 
more information please visit http://gump.apache.org/nagged.html, 
and/or contact the folk at general@gump.apache.org.

Project httpcomponents-client has an issue affecting its community integration.
This issue affects 4 projects.
The current state of this project is 'Failed', with reason 'Build Failed'.
For reference only, the following projects are affected by this:
    - httpcomponents-client :  HttpComponents Client
    - httpcomponents-client-test :  HttpComponents Client
    - jmeter-svn :  Pure Java load testing and performance measurement tool.
   ...
    - jmeter-test :  Pure Java load testing and performance measurement tool.
   ...


Full details are available at:
    http://vmgump.apache.org/gump/public/httpcomponents/httpcomponents-client/index.html

That said, some information snippets are provided here.

The following annotations (debug/informational/warning/error messages) were provided:
 -DEBUG- (Apache Gump generated) Apache Maven Settings in: /srv/gump/public/workspace/httpcomponents/httpclient/gump_mvn_settings.xml
 -INFO- Failed with reason build failed
 -DEBUG- Maven POM in: /srv/gump/public/workspace/httpcomponents/httpclient/pom.xml
 -INFO- Failed to extract fallback artifacts from Gump Repository



The following work was performed:
http://vmgump.apache.org/gump/public/httpcomponents/httpcomponents-client/gump_work/build_httpcomponents_httpcomponents-client.html
Work Name: build_httpcomponents_httpcomponents-client (Type: Build)
Work ended in a state of : Failed
Elapsed: 24 secs
Command Line: /opt/maven2/bin/mvn --batch-mode -DskipTests=true --settings /srv/gump/public/workspace/httpcomponents/httpclient/gump_mvn_settings.xml
package 
[Working Directory: /srv/gump/public/workspace/httpcomponents/httpclient]
M2_HOME: /opt/maven2
---------------------------------------------
[debug] execute contextualize
[INFO] [resources:resources {execution: default-resources}]
[INFO] Using 'UTF-8' encoding to copy filtered resources.
[INFO] Copying 1 resource
[INFO] Copying 2 resources to META-INF
Downloading: http://files.couchbase.com/maven2//org/apache/httpcomponents/httpcore/4.2-beta1/httpcore-4.2-beta1.pom
[INFO] Unable to find resource 'org.apache.httpcomponents:httpcore:pom:4.2-beta1' in repository
spy (http://files.couchbase.com/maven2/)
Downloading: http://localhost:8192/maven2/org/apache/httpcomponents/httpcore/4.2-beta1/httpcore-4.2-beta1.pom

Downloading: http://files.couchbase.com/maven2//org/apache/httpcomponents/httpcomponents-core/4.2-beta1/httpcomponents-core-4.2-beta1.pom
[INFO] Unable to find resource 'org.apache.httpcomponents:httpcomponents-core:pom:4.2-beta1'
in repository spy (http://files.couchbase.com/maven2/)
Downloading: http://localhost:8192/maven2/org/apache/httpcomponents/httpcomponents-core/4.2-beta1/httpcomponents-core-4.2-beta1.pom

Downloading: http://files.couchbase.com/maven2//commons-codec/commons-codec/1.6/commons-codec-1.6.pom
[INFO] Unable to find resource 'commons-codec:commons-codec:pom:1.6' in repository spy (http://files.couchbase.com/maven2/)
Downloading: http://localhost:8192/maven2/commons-codec/commons-codec/1.6/commons-codec-1.6.pom

Downloading: http://files.couchbase.com/maven2//org/apache/httpcomponents/httpcore/4.2-beta1/httpcore-4.2-beta1.jar
Downloading: http://files.couchbase.com/maven2//commons-codec/commons-codec/1.6/commons-codec-1.6.jar
[INFO] Unable to find resource 'org.apache.httpcomponents:httpcore:jar:4.2-beta1' in repository
spy (http://files.couchbase.com/maven2/)
Downloading: http://localhost:8192/maven2/org/apache/httpcomponents/httpcore/4.2-beta1/httpcore-4.2-beta1.jar
[INFO] Unable to find resource 'commons-codec:commons-codec:jar:1.6' in repository spy (http://files.couchbase.com/maven2/)
Downloading: http://localhost:8192/maven2/commons-codec/commons-codec/1.6/commons-codec-1.6.jar
75K downloaded  (commons-codec-1.6.jar)
215K downloaded  (httpcore-4.2-beta1.jar)
[INFO] [compiler:compile {execution: default-compile}]
[INFO] Compiling 291 source files to /srv/gump/public/workspace/httpcomponents/httpclient/httpclient/target/classes
[INFO] -------------------------------------------------------------
[ERROR] COMPILATION ERROR : 
[INFO] -------------------------------------------------------------
[ERROR] /srv/gump/public/workspace/httpcomponents/httpclient/httpclient/src/main/java/org/apache/http/client/utils/URLEncodedUtils.java:[108,16]
cannot find symbol
symbol  : method parse(java.util.List<org.apache.http.NameValuePair>,java.util.Scanner,java.lang.Comparable<capture#348
of ? extends java.lang.Comparable<?>>)
location: class org.apache.http.client.utils.URLEncodedUtils
[INFO] 1 error
[INFO] -------------------------------------------------------------
[INFO] ------------------------------------------------------------------------
[ERROR] BUILD FAILURE
[INFO] ------------------------------------------------------------------------
[INFO] Compilation failure
/srv/gump/public/workspace/httpcomponents/httpclient/httpclient/src/main/java/org/apache/http/client/utils/URLEncodedUtils.java:[108,16]
cannot find symbol
symbol  : method parse(java.util.List<org.apache.http.NameValuePair>,java.util.Scanner,java.lang.Comparable<capture#348
of ? extends java.lang.Comparable<?>>)
location: class org.apache.http.client.utils.URLEncodedUtils

[INFO] ------------------------------------------------------------------------
[INFO] For more information, run Maven with the -e switch
[INFO] ------------------------------------------------------------------------
[INFO] Total time: 23 seconds
[INFO] Finished at: Wed Apr 18 17:39:14 UTC 2012
[INFO] Final Memory: 64M/171M
[INFO] ------------------------------------------------------------------------
---------------------------------------------

To subscribe to this information via syndicated feeds:
- RSS: http://vmgump.apache.org/gump/public/httpcomponents/httpcomponents-client/rss.xml
- Atom: http://vmgump.apache.org/gump/public/httpcomponents/httpcomponents-client/atom.xml

============================== Gump Tracking Only ===
Produced by Apache Gump(TM) version 2.3.
Gump Run 05001218042012, vmgump.apache.org:vmgump:05001218042012
Gump E-mail Identifier (unique within run) #2.


--
Apache Gump
http://gump.apache.org/ [Instance: vmgump]

---------------------------------------------------------------------
To unsubscribe, e-mail: general-unsubscribe@gump.apache.org
For additional commands, e-mail: general-help@gump.apache.org


Mime
View raw message