gump-general mailing list archives

Site index · List index
Message view « Date » · « Thread »
Top « Date » · « Thread »
From g...@vmgump.apache.org
Subject BATCH: All dressed up, with nowhere to go...
Date Tue, 17 Apr 2012 21:49:13 GMT
Dear Gumpmeisters,
            
The following 5 notifys should have been sent

*********************************************************** G U M P
[GUMP@vmgump]: Project args4j-site (in module args4j) failed
[GUMP@vmgump]: Project google-docbkx-maven-builder (in module google-docbkx) failed
[GUMP@vmgump]: Project google-docbkx-maven-plugin (in module google-docbkx) failed
[GUMP@vmgump]: Project cocoon-rest (in module cocoon3) failed
[GUMP@vmgump]: Project cocoon-optional (in module cocoon3) failed
*********************************************************** G U M P
[GUMP@vmgump]: Project args4j-site (in module args4j) failed
To whom it may engage...
        
This is an automated request, but not an unsolicited one. For 
more information please visit http://gump.apache.org/nagged.html, 
and/or contact the folk at general@gump.apache.org.

Project args4j-site has an issue affecting its community integration.
This issue affects 4 projects.
The current state of this project is 'Failed', with reason 'Build Failed'.
For reference only, the following projects are affected by this:
    - args4j :  Java command line options parser
    - args4j-site :  Java command line options parser
    - args4j-tests :  Java command line options parser
    - args4j-tools :  Java command line options parser


Full details are available at:
    http://vmgump.apache.org/gump/public/args4j/args4j-site/index.html

That said, some information snippets are provided here.

The following annotations (debug/informational/warning/error messages) were provided:
 -DEBUG- Sole pom output [pom.xml] identifier set to project name
 -DEBUG- (Apache Gump generated) Apache Maven Settings in: /srv/gump/public/workspace/args4j/gump_mvn_settings.xml
 -INFO- Failed with reason build failed
 -DEBUG- Maven POM in: /srv/gump/public/workspace/args4j/pom.xml
 -INFO- Failed to extract fallback artifacts from Gump Repository



The following work was performed:
http://vmgump.apache.org/gump/public/args4j/args4j-site/gump_work/build_args4j_args4j-site.html
Work Name: build_args4j_args4j-site (Type: Build)
Work ended in a state of : Failed
Elapsed: 2 secs
Command Line: /opt/maven3/bin/mvn --batch-mode -Dpackaging=pom -DgroupId=args4j -Dfile=pom.xml
-DartifactId=args4j-site -Dversion=2.0.20-SNAPSHOT --settings /srv/gump/public/workspace/args4j/gump_mvn_settings.xml
install:install-file 
[Working Directory: /srv/gump/public/workspace/args4j]
M2_HOME: /opt/maven3
---------------------------------------------
[INFO] Scanning for projects...
Downloading: http://maven.glassfish.org/content/groups/public/org/kohsuke/pom/1/pom-1.pom
[WARNING] Checksum validation failed, expected <html> but is 6c9fd3d150b8a5f0ca676f49b8ed603793cabebb
for http://maven.glassfish.org/content/groups/public/org/kohsuke/pom/1/pom-1.pom
[WARNING] Checksum validation failed, expected <html> but is 6c9fd3d150b8a5f0ca676f49b8ed603793cabebb
for http://maven.glassfish.org/content/groups/public/org/kohsuke/pom/1/pom-1.pom
Downloaded: http://maven.glassfish.org/content/groups/public/org/kohsuke/pom/1/pom-1.pom (185
B at 0.2 KB/sec)
[ERROR] The build could not read 1 project -> [Help 1]
[ERROR]   
[ERROR]   The project args4j:args4j-site:2.0.20-SNAPSHOT (/srv/gump/public/workspace/args4j/pom.xml)
has 1 error
[ERROR]     Non-parseable POM /srv/gump/public/workspace/mvnlocalrepo/shared/org/kohsuke/pom/1/pom-1.pom:
Expected root element 'project' but found 'html' (position: START_TAG seen <html>...
@1:6)  @ /srv/gump/public/workspace/mvnlocalrepo/shared/org/kohsuke/pom/1/pom-1.pom, line
1, column 6 -> [Help 2]
[ERROR] 
[ERROR] To see the full stack trace of the errors, re-run Maven with the -e switch.
[ERROR] Re-run Maven using the -X switch to enable full debug logging.
[ERROR] 
[ERROR] For more information about the errors and possible solutions, please read the following
articles:
[ERROR] [Help 1] http://cwiki.apache.org/confluence/display/MAVEN/ProjectBuildingException
[ERROR] [Help 2] http://cwiki.apache.org/confluence/display/MAVEN/ModelParseException
---------------------------------------------

To subscribe to this information via syndicated feeds:
- RSS: http://vmgump.apache.org/gump/public/args4j/args4j-site/rss.xml
- Atom: http://vmgump.apache.org/gump/public/args4j/args4j-site/atom.xml

============================== Gump Tracking Only ===
Produced by Apache Gump(TM) version 2.3.
Gump Run 05001217042012, vmgump.apache.org:vmgump:05001217042012
Gump E-mail Identifier (unique within run) #1.

*********************************************************** G U M P
[GUMP@vmgump]: Project google-docbkx-maven-builder (in module google-docbkx) failed
To whom it may engage...
        
This is an automated request, but not an unsolicited one. For 
more information please visit http://gump.apache.org/nagged.html, 
and/or contact the folk at general@gump.apache.org.

Project google-docbkx-maven-builder has an issue affecting its community integration.
This issue affects 1 projects.
The current state of this project is 'Failed', with reason 'Build Failed'.
For reference only, the following projects are affected by this:
    - google-docbkx-maven-builder :  A number of tools for handling DocBook XML transformations.


Full details are available at:
    http://vmgump.apache.org/gump/public/google-docbkx/google-docbkx-maven-builder/index.html

That said, some information snippets are provided here.

The following annotations (debug/informational/warning/error messages) were provided:
 -DEBUG- (Apache Gump generated) Apache Maven Settings in: /srv/gump/public/workspace/google-docbkx/docbkx-builder-maven-plugin/gump_mvn_settings.xml
 -INFO- Failed with reason build failed
 -DEBUG- Maven POM in: /srv/gump/public/workspace/google-docbkx/docbkx-builder-maven-plugin/pom.xml
 -INFO- Failed to extract fallback artifacts from Gump Repository



The following work was performed:
http://vmgump.apache.org/gump/public/google-docbkx/google-docbkx-maven-builder/gump_work/build_google-docbkx_google-docbkx-maven-builder.html
Work Name: build_google-docbkx_google-docbkx-maven-builder (Type: Build)
Work ended in a state of : Failed
Elapsed: 18 secs
Command Line: /opt/maven2/bin/mvn --batch-mode --settings /srv/gump/public/workspace/google-docbkx/docbkx-builder-maven-plugin/gump_mvn_settings.xml
install 
[Working Directory: /srv/gump/public/workspace/google-docbkx/docbkx-builder-maven-plugin]
M2_HOME: /opt/maven2
---------------------------------------------
Downloading: http://localhost:8192/maven2/saxpath/saxpath/1.0-FCS/saxpath-1.0-FCS.jar
Downloading: http://localhost:8192/maven2/antlr/stringtemplate/2.2/stringtemplate-2.2.jar
221K downloaded  (jaxen-1.0-FCS.jar)
Downloading: http://localhost:8192/maven2/commons-io/commons-io/1.1/commons-io-1.1.jar
179K downloaded  (commons-io-1.1.jar)




Downloading: http://localhost:8192/maven2/antlr/antlr/2.7.2/antlr-2.7.2.jar

Downloading: http://localhost:8192/maven2/org/apache/maven/plugin-tools/maven-plugin-tools-api/2.4.3/maven-plugin-tools-api-2.4.3.pom

Downloading: http://localhost:8192/maven2/org/apache/maven/plugin-tools/maven-plugin-tools/2.4.3/maven-plugin-tools-2.4.3.pom

Downloading: http://localhost:8192/maven2/org/apache/maven/plugin-tools/maven-plugin-tools-java/2.4.3/maven-plugin-tools-java-2.4.3.pom

Downloading: http://localhost:8192/maven2/org/apache/maven/plugin-tools/maven-plugin-tools-beanshell/2.4.3/maven-plugin-tools-beanshell-2.4.3.pom

Downloading: http://localhost:8192/maven2/org/apache/maven/plugin-tools/maven-plugin-tools-api/2.4.3/maven-plugin-tools-api-2.4.3.jar

Downloading: http://localhost:8192/maven2/org/apache/maven/plugin-tools/maven-plugin-tools-java/2.4.3/maven-plugin-tools-java-2.4.3.jar

Downloading: http://localhost:8192/maven2/org/apache/maven/plugin-tools/maven-plugin-tools-beanshell/2.4.3/maven-plugin-tools-beanshell-2.4.3.jar

[INFO] [plugin:descriptor {execution: default-descriptor}]
[INFO] Using 2 extractors.
[INFO] Applying extractor for language: java
[INFO] Extractor for language: java found 1 mojo descriptors.
[INFO] Applying extractor for language: bsh
[INFO] Extractor for language: bsh found 0 mojo descriptors.
[INFO] [resources:resources {execution: default-resources}]
[WARNING] Using platform encoding (UTF-8 actually) to copy filtered resources, i.e. build
is platform dependent!
[INFO] Copying 2 resources
[INFO] [compiler:compile {execution: default-compile}]
[INFO] Compiling 5 source files to /srv/gump/public/workspace/google-docbkx/docbkx-builder-maven-plugin/target/classes
[INFO] ------------------------------------------------------------------------
[ERROR] BUILD FAILURE
[INFO] ------------------------------------------------------------------------
[INFO] Compilation failure
/srv/gump/public/workspace/google-docbkx/docbkx-builder-maven-plugin/src/main/java/com/agilejava/maven/docbkx/GeneratorMojo.java:[342,15]
reference to writeStringToFile is ambiguous, both method writeStringToFile(java.io.File,java.lang.String,java.nio.charset.Charset)
in org.apache.commons.io.FileUtils and method writeStringToFile(java.io.File,java.lang.String,java.lang.String)
in org.apache.commons.io.FileUtils match


[INFO] ------------------------------------------------------------------------
[INFO] For more information, run Maven with the -e switch
[INFO] ------------------------------------------------------------------------
[INFO] Total time: 17 seconds
[INFO] Finished at: Tue Apr 17 17:32:55 UTC 2012
[INFO] Final Memory: 17M/48M
[INFO] ------------------------------------------------------------------------
---------------------------------------------

To subscribe to this information via syndicated feeds:
- RSS: http://vmgump.apache.org/gump/public/google-docbkx/google-docbkx-maven-builder/rss.xml
- Atom: http://vmgump.apache.org/gump/public/google-docbkx/google-docbkx-maven-builder/atom.xml

============================== Gump Tracking Only ===
Produced by Apache Gump(TM) version 2.3.
Gump Run 05001217042012, vmgump.apache.org:vmgump:05001217042012
Gump E-mail Identifier (unique within run) #4.

*********************************************************** G U M P
[GUMP@vmgump]: Project google-docbkx-maven-plugin (in module google-docbkx) failed
To whom it may engage...
        
This is an automated request, but not an unsolicited one. For 
more information please visit http://gump.apache.org/nagged.html, 
and/or contact the folk at general@gump.apache.org.

Project google-docbkx-maven-plugin has an issue affecting its community integration.
This issue affects 1 projects.
The current state of this project is 'Failed', with reason 'Build Failed'.
For reference only, the following projects are affected by this:
    - google-docbkx-maven-plugin :  A number of tools for handling DocBook XML transformations.


Full details are available at:
    http://vmgump.apache.org/gump/public/google-docbkx/google-docbkx-maven-plugin/index.html

That said, some information snippets are provided here.

The following annotations (debug/informational/warning/error messages) were provided:
 -DEBUG- (Apache Gump generated) Apache Maven Settings in: /srv/gump/public/workspace/google-docbkx/docbkx-maven-plugin/gump_mvn_settings.xml
 -INFO- Failed with reason build failed
 -DEBUG- Maven POM in: /srv/gump/public/workspace/google-docbkx/docbkx-maven-plugin/pom.xml
 -INFO- Failed to extract fallback artifacts from Gump Repository



The following work was performed:
http://vmgump.apache.org/gump/public/google-docbkx/google-docbkx-maven-plugin/gump_work/build_google-docbkx_google-docbkx-maven-plugin.html
Work Name: build_google-docbkx_google-docbkx-maven-plugin (Type: Build)
Work ended in a state of : Failed
Elapsed: 4 secs
Command Line: /opt/maven2/bin/mvn --batch-mode --settings /srv/gump/public/workspace/google-docbkx/docbkx-maven-plugin/gump_mvn_settings.xml
package 
[Working Directory: /srv/gump/public/workspace/google-docbkx/docbkx-maven-plugin]
M2_HOME: /opt/maven2
---------------------------------------------
[INFO] Scanning for projects...
[INFO] ------------------------------------------------------------------------
[INFO] Building Docbkx Maven Plugin
[INFO]    task-segment: [package]
[INFO] ------------------------------------------------------------------------
[INFO] ------------------------------------------------------------------------
[ERROR] BUILD ERROR
[INFO] ------------------------------------------------------------------------
[INFO] Error building POM (may not be this project's POM).


Project ID: com.agilejava.docbkx:docbkx-builder-maven-plugin

Reason: POM 'com.agilejava.docbkx:docbkx-builder-maven-plugin' not found in repository: Unable
to download the artifact from any repository

  com.agilejava.docbkx:docbkx-builder-maven-plugin:pom:2.0.15-SNAPSHOT

from the specified remote repositories:
  gump-central (http://localhost:8192/maven2)

 for project com.agilejava.docbkx:docbkx-builder-maven-plugin


[INFO] ------------------------------------------------------------------------
[INFO] For more information, run Maven with the -e switch
[INFO] ------------------------------------------------------------------------
[INFO] Total time: 2 seconds
[INFO] Finished at: Tue Apr 17 20:31:34 UTC 2012
[INFO] Final Memory: 6M/16M
[INFO] ------------------------------------------------------------------------
---------------------------------------------

To subscribe to this information via syndicated feeds:
- RSS: http://vmgump.apache.org/gump/public/google-docbkx/google-docbkx-maven-plugin/rss.xml
- Atom: http://vmgump.apache.org/gump/public/google-docbkx/google-docbkx-maven-plugin/atom.xml

============================== Gump Tracking Only ===
Produced by Apache Gump(TM) version 2.3.
Gump Run 05001217042012, vmgump.apache.org:vmgump:05001217042012
Gump E-mail Identifier (unique within run) #5.

*********************************************************** G U M P
[GUMP@vmgump]: Project cocoon-rest (in module cocoon3) failed
To whom it may engage...
        
This is an automated request, but not an unsolicited one. For 
more information please visit http://gump.apache.org/nagged.html, 
and/or contact the folk at general@gump.apache.org.

Project cocoon-rest has an issue affecting its community integration.
This issue affects 7 projects.
The current state of this project is 'Failed', with reason 'Build Failed'.
For reference only, the following projects are affected by this:
    - cocoon-all :  Java XML Framework
    - cocoon-profiling :  Java XML Framework
    - cocoon-profiling-test :  Java XML Framework
    - cocoon-rest :  Java XML Framework
    - cocoon-rest-optional :  Java XML Framework
    - cocoon-rest-test :  Java XML Framework
    - cocoon-shiro :  Java XML Framework


Full details are available at:
    http://vmgump.apache.org/gump/public/cocoon3/cocoon-rest/index.html

That said, some information snippets are provided here.

The following annotations (debug/informational/warning/error messages) were provided:
 -DEBUG- Sole jar output [cocoon-rest-*[0-9T].jar] identifier set to project name
 -DEBUG- (Apache Gump generated) Apache Maven Settings in: /srv/gump/public/workspace/cocoon3/cocoon-rest/gump_mvn_settings.xml
 -INFO- Failed with reason build failed
 -DEBUG- Maven POM in: /srv/gump/public/workspace/cocoon3/cocoon-rest/pom.xml
 -DEBUG- Extracted fallback artifacts from Gump Repository



The following work was performed:
http://vmgump.apache.org/gump/public/cocoon3/cocoon-rest/gump_work/build_cocoon3_cocoon-rest.html
Work Name: build_cocoon3_cocoon-rest (Type: Build)
Work ended in a state of : Failed
Elapsed: 8 secs
Command Line: /opt/maven2/bin/mvn --batch-mode -DskipTests=true --settings /srv/gump/public/workspace/cocoon3/cocoon-rest/gump_mvn_settings.xml
install 
[Working Directory: /srv/gump/public/workspace/cocoon3/cocoon-rest]
M2_HOME: /opt/maven2
---------------------------------------------
[INFO] Scanning for projects...
[INFO] ------------------------------------------------------------------------
[INFO] Building Apache Cocoon 3: REST support
[INFO]    task-segment: [install]
[INFO] ------------------------------------------------------------------------
[INFO] snapshot org.apache.cocoon.servlet:cocoon-servlet:3.0.0-beta-1-SNAPSHOT: checking for
updates from maven2-repository.dev.java.net
[INFO] snapshot org.apache.cocoon.servlet:cocoon-servlet:3.0.0-beta-1-SNAPSHOT: checking for
updates from apache.snapshots
Downloading: http://localhost:8192/maven/2/com/sun/jersey/jersey-core/1.12/jersey-core-1.12.pom
[INFO] Unable to find resource 'com.sun.jersey:jersey-core:pom:1.12' in repository maven2-repository.dev.java.net
(http://download.java.net/maven/2/)
Downloading: http://localhost:8192/maven2/com/sun/jersey/jersey-core/1.12/jersey-core-1.12.pom

Downloading: http://localhost:8192/maven/2/com/sun/jersey/jersey-project/1.12/jersey-project-1.12.pom
[INFO] Unable to find resource 'com.sun.jersey:jersey-project:pom:1.12' in repository maven2-repository.dev.java.net
(http://download.java.net/maven/2/)
Downloading: http://localhost:8192/maven2/com/sun/jersey/jersey-project/1.12/jersey-project-1.12.pom

[INFO] ------------------------------------------------------------------------
[ERROR] BUILD ERROR
[INFO] ------------------------------------------------------------------------
[INFO] Error building POM (may not be this project's POM).


Project ID: com.sun.jersey:jersey-project:pom:1.12

Reason: Cannot find parent: net.java:jvnet-parent for project: com.sun.jersey:jersey-project:pom:1.12
for project com.sun.jersey:jersey-project:pom:1.12


[INFO] ------------------------------------------------------------------------
[INFO] For more information, run Maven with the -e switch
[INFO] ------------------------------------------------------------------------
[INFO] Total time: 7 seconds
[INFO] Finished at: Tue Apr 17 20:57:37 UTC 2012
[INFO] Final Memory: 25M/60M
[INFO] ------------------------------------------------------------------------
---------------------------------------------

To subscribe to this information via syndicated feeds:
- RSS: http://vmgump.apache.org/gump/public/cocoon3/cocoon-rest/rss.xml
- Atom: http://vmgump.apache.org/gump/public/cocoon3/cocoon-rest/atom.xml

============================== Gump Tracking Only ===
Produced by Apache Gump(TM) version 2.3.
Gump Run 05001217042012, vmgump.apache.org:vmgump:05001217042012
Gump E-mail Identifier (unique within run) #7.

*********************************************************** G U M P
[GUMP@vmgump]: Project cocoon-optional (in module cocoon3) failed
To whom it may engage...
        
This is an automated request, but not an unsolicited one. For 
more information please visit http://gump.apache.org/nagged.html, 
and/or contact the folk at general@gump.apache.org.

Project cocoon-optional has an issue affecting its community integration.
This issue affects 3 projects.
The current state of this project is 'Failed', with reason 'Build Failed'.
For reference only, the following projects are affected by this:
    - cocoon-databases :  Java XML Framework
    - cocoon-optional :  Java XML Framework
    - cocoon-optional-test :  Java XML Framework


Full details are available at:
    http://vmgump.apache.org/gump/public/cocoon3/cocoon-optional/index.html

That said, some information snippets are provided here.

The following annotations (debug/informational/warning/error messages) were provided:
 -DEBUG- Sole jar output [cocoon-optional-*[0-9T].jar] identifier set to project name
 -INFO- Optional dependency solr prerequisite failed with reason build failed
 -DEBUG- (Apache Gump generated) Apache Maven Settings in: /srv/gump/public/workspace/cocoon3/cocoon-optional/gump_mvn_settings.xml
 -INFO- Failed with reason build failed
 -DEBUG- Maven POM in: /srv/gump/public/workspace/cocoon3/cocoon-optional/pom.xml
 -DEBUG- Extracted fallback artifacts from Gump Repository



The following work was performed:
http://vmgump.apache.org/gump/public/cocoon3/cocoon-optional/gump_work/build_cocoon3_cocoon-optional.html
Work Name: build_cocoon3_cocoon-optional (Type: Build)
Work ended in a state of : Failed
Elapsed: 26 secs
Command Line: /opt/maven2/bin/mvn --batch-mode -DskipTests=true --settings /srv/gump/public/workspace/cocoon3/cocoon-optional/gump_mvn_settings.xml
install 
[Working Directory: /srv/gump/public/workspace/cocoon3/cocoon-optional]
M2_HOME: /opt/maven2
---------------------------------------------

Downloading: http://localhost:8192/maven/2/org/apache/lucene/lucene-queries/3.5.0/lucene-queries-3.5.0.pom
[INFO] Unable to find resource 'org.apache.lucene:lucene-queries:pom:3.5.0' in repository
maven2-repository.dev.java.net (http://download.java.net/maven/2/)
Downloading: http://localhost:8192/maven2/org/apache/lucene/lucene-queries/3.5.0/lucene-queries-3.5.0.pom

Downloading: http://localhost:8192/maven/2/org/apache/lucene/lucene-misc/3.5.0/lucene-misc-3.5.0.pom
[INFO] Unable to find resource 'org.apache.lucene:lucene-misc:pom:3.5.0' in repository maven2-repository.dev.java.net
(http://download.java.net/maven/2/)
Downloading: http://localhost:8192/maven2/org/apache/lucene/lucene-misc/3.5.0/lucene-misc-3.5.0.pom

Downloading: http://localhost:8192/maven/2/org/apache/lucene/lucene-spatial/3.5.0/lucene-spatial-3.5.0.pom
[INFO] Unable to find resource 'org.apache.lucene:lucene-spatial:pom:3.5.0' in repository
maven2-repository.dev.java.net (http://download.java.net/maven/2/)
Downloading: http://localhost:8192/maven2/org/apache/lucene/lucene-spatial/3.5.0/lucene-spatial-3.5.0.pom

Downloading: http://localhost:8192/maven/2/org/apache/lucene/lucene-spellchecker/3.5.0/lucene-spellchecker-3.5.0.pom
[INFO] Unable to find resource 'org.apache.lucene:lucene-spellchecker:pom:3.5.0' in repository
maven2-repository.dev.java.net (http://download.java.net/maven/2/)
Downloading: http://localhost:8192/maven2/org/apache/lucene/lucene-spellchecker/3.5.0/lucene-spellchecker-3.5.0.pom

Downloading: http://localhost:8192/maven/2/org/apache/lucene/lucene-grouping/3.5.0/lucene-grouping-3.5.0.pom
[INFO] Unable to find resource 'org.apache.lucene:lucene-grouping:pom:3.5.0' in repository
maven2-repository.dev.java.net (http://download.java.net/maven/2/)
Downloading: http://localhost:8192/maven2/org/apache/lucene/lucene-grouping/3.5.0/lucene-grouping-3.5.0.pom

Downloading: http://localhost:8192/maven/2/org/apache/solr/solr-commons-csv/3.5.0/solr-commons-csv-3.5.0.pom
[INFO] Unable to find resource 'org.apache.solr:solr-commons-csv:pom:3.5.0' in repository
maven2-repository.dev.java.net (http://download.java.net/maven/2/)
Downloading: http://localhost:8192/maven2/org/apache/solr/solr-commons-csv/3.5.0/solr-commons-csv-3.5.0.pom

Downloading: http://localhost:8192/maven/2/com/google/guava/guava/r05/guava-r05.pom
5K downloaded  (guava-r05.pom)
[INFO] snapshot com.google.guava:guava-parent:12.0-SNAPSHOT: checking for updates from maven2-repository.dev.java.net
Downloading: http://localhost:8192/maven/2/javax/xml/bind/jaxb-api/2.2.6/jaxb-api-2.2.6.pom
[INFO] Unable to find resource 'javax.xml.bind:jaxb-api:pom:2.2.6' in repository maven2-repository.dev.java.net
(http://download.java.net/maven/2/)
Downloading: http://localhost:8192/maven2/javax/xml/bind/jaxb-api/2.2.6/jaxb-api-2.2.6.pom

[INFO] ------------------------------------------------------------------------
[ERROR] BUILD ERROR
[INFO] ------------------------------------------------------------------------
[INFO] Error building POM (may not be this project's POM).


Project ID: javax.xml.bind:jaxb-api:jar:2.2.6

Reason: Cannot find parent: net.java:jvnet-parent for project: javax.xml.bind:jaxb-api:jar:2.2.6
for project javax.xml.bind:jaxb-api:jar:2.2.6


[INFO] ------------------------------------------------------------------------
[INFO] For more information, run Maven with the -e switch
[INFO] ------------------------------------------------------------------------
[INFO] Total time: 25 seconds
[INFO] Finished at: Tue Apr 17 20:59:35 UTC 2012
[INFO] Final Memory: 30M/73M
[INFO] ------------------------------------------------------------------------
---------------------------------------------

To subscribe to this information via syndicated feeds:
- RSS: http://vmgump.apache.org/gump/public/cocoon3/cocoon-optional/rss.xml
- Atom: http://vmgump.apache.org/gump/public/cocoon3/cocoon-optional/atom.xml

============================== Gump Tracking Only ===
Produced by Apache Gump(TM) version 2.3.
Gump Run 05001217042012, vmgump.apache.org:vmgump:05001217042012
Gump E-mail Identifier (unique within run) #8.


--
Apache Gump
http://gump.apache.org/ [Instance: vmgump]

---------------------------------------------------------------------
To unsubscribe, e-mail: general-unsubscribe@gump.apache.org
For additional commands, e-mail: general-help@gump.apache.org


Mime
View raw message