gump-general mailing list archives

Site index · List index
Message view « Date » · « Thread »
Top « Date » · « Thread »
From g...@vmgump.apache.org
Subject BATCH: All dressed up, with nowhere to go...
Date Sun, 26 Feb 2012 21:18:02 GMT
Dear Gumpmeisters,
            
The following 7 notifys should have been sent

*********************************************************** G U M P
[GUMP@vmgump]: Project taglibs-standard-spec (in module tomcat-taglibs) failed
[GUMP@vmgump]: Project apacheds-server-tools (in module apacheds) failed
[GUMP@vmgump]: Project syncrepl (in module apacheds) failed
[GUMP@vmgump]: Project apacheds-service (in module apacheds) failed
[GUMP@vmgump]: Project apacheds-all (in module apacheds) failed
[GUMP@vmgump]: Project apacheds-kerberos-test (in module apacheds) failed
[GUMP@vmgump]: Project apacheds-ldap-client-test (in module apacheds) failed
*********************************************************** G U M P
[GUMP@vmgump]: Project taglibs-standard-spec (in module tomcat-taglibs) failed
To whom it may engage...
        
This is an automated request, but not an unsolicited one. For 
more information please visit http://gump.apache.org/nagged.html, 
and/or contact the folk at general@gump.apache.org.

Project taglibs-standard-spec has an issue affecting its community integration.
This issue affects 37 projects.
The current state of this project is 'Failed', with reason 'Build Failed'.
For reference only, the following projects are affected by this:
    - commons-id :  Commons Identifier Package
    - commons-jelly :  Commons Jelly
    - commons-jelly-tags-ant :  Commons Jelly
    - commons-jelly-tags-ant-test :  Commons Jelly
    - commons-jelly-tags-antlr :  Commons Jelly
    - commons-jelly-tags-avalon :  Commons Jelly
    - commons-jelly-tags-bean :  Commons Jelly
    - commons-jelly-tags-beanshell :  Commons Jelly
    - commons-jelly-tags-betwixt :  Commons Jelly
    - commons-jelly-tags-bsf :  Commons Jelly
    - commons-jelly-tags-define :  Commons Jelly
    - commons-jelly-tags-define-test :  Commons Jelly
    - commons-jelly-tags-dynabean :  Commons Jelly
    - commons-jelly-tags-email :  Commons Jelly
    - commons-jelly-tags-fmt :  Commons Jelly
    - commons-jelly-tags-fmt-test :  Commons Jelly
    - commons-jelly-tags-html :  Commons Jelly
    - commons-jelly-tags-http :  Commons Jelly
    - commons-jelly-tags-interaction :  Commons Jelly
    - commons-jelly-tags-jface :  Commons Jelly
    - commons-jelly-tags-jms :  Commons Jelly
    - commons-jelly-tags-jsl :  Commons Jelly
    - commons-jelly-tags-jsl-test :  Commons Jelly
    - commons-jelly-tags-junit :  Commons Jelly
    - commons-jelly-tags-log :  Commons Jelly
    - commons-jelly-tags-memory :  Commons Jelly
    - commons-jelly-tags-regexp :  Commons Jelly
    - commons-jelly-tags-sql :  Commons Jelly
    - commons-jelly-tags-swing :  Commons Jelly
    - commons-jelly-tags-swt :  Commons Jelly
    - commons-jelly-tags-threads :  Commons Jelly
    - commons-jelly-tags-util :  Commons Jelly
    - commons-jelly-tags-velocity :  Commons Jelly
    - commons-jelly-tags-xml :  Commons Jelly
    - commons-jelly-tags-xmlunit :  Commons Jelly
    - commons-jelly-test :  Commons Jelly
    - taglibs-standard-spec :  JSP Taglibs


Full details are available at:
    http://vmgump.apache.org/gump/public/tomcat-taglibs/taglibs-standard-spec/index.html

That said, some information snippets are provided here.

The following annotations (debug/informational/warning/error messages) were provided:
 -DEBUG- Sole jar output [taglibs-standard-spec-1.2-SNAPSHOT.jar] identifier set to project
name
 -DEBUG- (Apache Gump generated) Apache Maven Settings in: /srv/gump/public/workspace/tomcat-taglibs/standard/spec/gump_mvn_settings.xml
 -INFO- Failed with reason build failed
 -DEBUG- Maven POM in: /srv/gump/public/workspace/tomcat-taglibs/standard/spec/pom.xml
 -INFO- Failed to extract fallback artifacts from Gump Repository



The following work was performed:
http://vmgump.apache.org/gump/public/tomcat-taglibs/taglibs-standard-spec/gump_work/build_tomcat-taglibs_taglibs-standard-spec.html
Work Name: build_tomcat-taglibs_taglibs-standard-spec (Type: Build)
Work ended in a state of : Failed
Elapsed: 1 sec
Command Line: /opt/maven2/bin/mvn --batch-mode --settings /srv/gump/public/workspace/tomcat-taglibs/standard/spec/gump_mvn_settings.xml
install 
[Working Directory: /srv/gump/public/workspace/tomcat-taglibs/standard/spec]
M2_HOME: /opt/maven2
---------------------------------------------
	at sun.reflect.NativeMethodAccessorImpl.invoke0(Native Method)
	at sun.reflect.NativeMethodAccessorImpl.invoke(NativeMethodAccessorImpl.java:57)
	at sun.reflect.DelegatingMethodAccessorImpl.invoke(DelegatingMethodAccessorImpl.java:43)
	at java.lang.reflect.Method.invoke(Method.java:616)
	at org.codehaus.classworlds.Launcher.launchEnhanced(Launcher.java:315)
	at org.codehaus.classworlds.Launcher.launch(Launcher.java:255)
	at org.codehaus.classworlds.Launcher.mainWithExitCode(Launcher.java:430)
	at org.codehaus.classworlds.Launcher.main(Launcher.java:375)
Caused by: org.apache.maven.project.ProjectBuildingException: Cannot find parent: org.apache.taglibs:taglibs-parent
for project: null:taglibs-standard:pom:1.2-SNAPSHOT for project null:taglibs-standard:pom:1.2-SNAPSHOT
	at org.apache.maven.project.DefaultMavenProjectBuilder.assembleLineage(DefaultMavenProjectBuilder.java:1396)
	at org.apache.maven.project.DefaultMavenProjectBuilder.assembleLineage(DefaultMavenProjectBuilder.java:1407)
	at org.apache.maven.project.DefaultMavenProjectBuilder.buildInternal(DefaultMavenProjectBuilder.java:823)
	at org.apache.maven.project.DefaultMavenProjectBuilder.buildFromSourceFileInternal(DefaultMavenProjectBuilder.java:508)
	at org.apache.maven.project.DefaultMavenProjectBuilder.build(DefaultMavenProjectBuilder.java:200)
	at org.apache.maven.DefaultMaven.getProject(DefaultMaven.java:604)
	at org.apache.maven.DefaultMaven.collectProjects(DefaultMaven.java:487)
	at org.apache.maven.DefaultMaven.getProjects(DefaultMaven.java:391)
	... 12 more
Caused by: org.apache.maven.project.ProjectBuildingException: POM 'org.apache.taglibs:taglibs-parent'
not found in repository: Unable to download the artifact from any repository

  org.apache.taglibs:taglibs-parent:pom:1-SNAPSHOT

from the specified remote repositories:
  gump-central (http://localhost:8192/maven2)

 for project org.apache.taglibs:taglibs-parent
	at org.apache.maven.project.DefaultMavenProjectBuilder.findModelFromRepository(DefaultMavenProjectBuilder.java:605)
	at org.apache.maven.project.DefaultMavenProjectBuilder.assembleLineage(DefaultMavenProjectBuilder.java:1392)
	... 19 more
Caused by: org.apache.maven.artifact.resolver.ArtifactNotFoundException: Unable to download
the artifact from any repository

  org.apache.taglibs:taglibs-parent:pom:1-SNAPSHOT

from the specified remote repositories:
  gump-central (http://localhost:8192/maven2)


	at org.apache.maven.artifact.resolver.DefaultArtifactResolver.resolve(DefaultArtifactResolver.java:228)
	at org.apache.maven.artifact.resolver.DefaultArtifactResolver.resolve(DefaultArtifactResolver.java:90)
	at org.apache.maven.project.DefaultMavenProjectBuilder.findModelFromRepository(DefaultMavenProjectBuilder.java:558)
	... 20 more
Caused by: org.apache.maven.wagon.ResourceDoesNotExistException: Unable to download the artifact
from any repository
	at org.apache.maven.artifact.manager.DefaultWagonManager.getArtifact(DefaultWagonManager.java:404)
	at org.apache.maven.artifact.resolver.DefaultArtifactResolver.resolve(DefaultArtifactResolver.java:216)
	... 22 more
[INFO] ------------------------------------------------------------------------
[INFO] Total time: < 1 second
[INFO] Finished at: Sun Feb 26 16:45:07 UTC 2012
[INFO] Final Memory: 1M/15M
[INFO] ------------------------------------------------------------------------
---------------------------------------------

To subscribe to this information via syndicated feeds:
- RSS: http://vmgump.apache.org/gump/public/tomcat-taglibs/taglibs-standard-spec/rss.xml
- Atom: http://vmgump.apache.org/gump/public/tomcat-taglibs/taglibs-standard-spec/atom.xml

============================== Gump Tracking Only ===
Produced by Apache Gump(TM) version 2.3.
Gump Run 06001226022012, vmgump.apache.org:vmgump:06001226022012
Gump E-mail Identifier (unique within run) #2.

*********************************************************** G U M P
[GUMP@vmgump]: Project apacheds-server-tools (in module apacheds) failed
To whom it may engage...
        
This is an automated request, but not an unsolicited one. For 
more information please visit http://gump.apache.org/nagged.html, 
and/or contact the folk at general@gump.apache.org.

Project apacheds-server-tools has an issue affecting its community integration.
This issue affects 1 projects.
The current state of this project is 'Failed', with reason 'Build Failed'.
For reference only, the following projects are affected by this:
    - apacheds-server-tools :  Apache Directory Server


Full details are available at:
    http://vmgump.apache.org/gump/public/apacheds/apacheds-server-tools/index.html

That said, some information snippets are provided here.

The following annotations (debug/informational/warning/error messages) were provided:
 -DEBUG- Sole jar output [apacheds-server-tools-*[0-9T].jar] identifier set to project name
 -DEBUG- (Apache Gump generated) Apache Maven Settings in: /srv/gump/public/workspace/apacheds/server-tools/gump_mvn_settings.xml
 -INFO- Failed with reason build failed
 -DEBUG- Maven POM in: /srv/gump/public/workspace/apacheds/server-tools/pom.xml
 -INFO- Failed to extract fallback artifacts from Gump Repository



The following work was performed:
http://vmgump.apache.org/gump/public/apacheds/apacheds-server-tools/gump_work/build_apacheds_apacheds-server-tools.html
Work Name: build_apacheds_apacheds-server-tools (Type: Build)
Work ended in a state of : Failed
Elapsed: 1 sec
Command Line: /opt/maven3/bin/mvn --batch-mode --settings /srv/gump/public/workspace/apacheds/server-tools/gump_mvn_settings.xml
install 
[Working Directory: /srv/gump/public/workspace/apacheds/server-tools]
M2_HOME: /opt/maven3
---------------------------------------------
[INFO] Scanning for projects...
[ERROR] The build could not read 1 project -> [Help 1]
[ERROR]   
[ERROR]   The project org.apache.directory.server:apacheds-server-tools:2.0.0-M3-SNAPSHOT
(/srv/gump/public/workspace/apacheds/server-tools/pom.xml) has 1 error
[ERROR]     Non-resolvable parent POM: Could not find artifact org.apache.directory.server:apacheds-parent:pom:2.0.0-M3-SNAPSHOT
and 'parent.relativePath' points at wrong local POM @ line 22, column 11 -> [Help 2]
[ERROR] 
[ERROR] To see the full stack trace of the errors, re-run Maven with the -e switch.
[ERROR] Re-run Maven using the -X switch to enable full debug logging.
[ERROR] 
[ERROR] For more information about the errors and possible solutions, please read the following
articles:
[ERROR] [Help 1] http://cwiki.apache.org/confluence/display/MAVEN/ProjectBuildingException
[ERROR] [Help 2] http://cwiki.apache.org/confluence/display/MAVEN/UnresolvableModelException
---------------------------------------------

To subscribe to this information via syndicated feeds:
- RSS: http://vmgump.apache.org/gump/public/apacheds/apacheds-server-tools/rss.xml
- Atom: http://vmgump.apache.org/gump/public/apacheds/apacheds-server-tools/atom.xml

============================== Gump Tracking Only ===
Produced by Apache Gump(TM) version 2.3.
Gump Run 06001226022012, vmgump.apache.org:vmgump:06001226022012
Gump E-mail Identifier (unique within run) #5.

*********************************************************** G U M P
[GUMP@vmgump]: Project syncrepl (in module apacheds) failed
To whom it may engage...
        
This is an automated request, but not an unsolicited one. For 
more information please visit http://gump.apache.org/nagged.html, 
and/or contact the folk at general@gump.apache.org.

Project syncrepl has an issue affecting its community integration.
This issue affects 1 projects.
The current state of this project is 'Failed', with reason 'Build Failed'.
For reference only, the following projects are affected by this:
    - syncrepl :  Apache Directory Server


Full details are available at:
    http://vmgump.apache.org/gump/public/apacheds/syncrepl/index.html

That said, some information snippets are provided here.

The following annotations (debug/informational/warning/error messages) were provided:
 -DEBUG- Sole jar output [syncrepl-*[0-9T].jar] identifier set to project name
 -DEBUG- (Apache Gump generated) Apache Maven Settings in: /srv/gump/public/workspace/apacheds/syncrepl/gump_mvn_settings.xml
 -INFO- Failed with reason build failed
 -DEBUG- Maven POM in: /srv/gump/public/workspace/apacheds/syncrepl/pom.xml
 -INFO- Failed to extract fallback artifacts from Gump Repository



The following work was performed:
http://vmgump.apache.org/gump/public/apacheds/syncrepl/gump_work/build_apacheds_syncrepl.html
Work Name: build_apacheds_syncrepl (Type: Build)
Work ended in a state of : Failed
Elapsed: 2 secs
Command Line: /opt/maven3/bin/mvn --batch-mode --settings /srv/gump/public/workspace/apacheds/syncrepl/gump_mvn_settings.xml
install 
[Working Directory: /srv/gump/public/workspace/apacheds/syncrepl]
M2_HOME: /opt/maven3
---------------------------------------------
[INFO] Scanning for projects...
[ERROR] The build could not read 1 project -> [Help 1]
[ERROR]   
[ERROR]   The project org.apache.directory.server:syncrepl:2.0.0-M3-SNAPSHOT (/srv/gump/public/workspace/apacheds/syncrepl/pom.xml)
has 1 error
[ERROR]     Non-resolvable parent POM: Could not find artifact org.apache.directory.server:apacheds-parent:pom:2.0.0-M3-SNAPSHOT
and 'parent.relativePath' points at wrong local POM @ line 24, column 11 -> [Help 2]
[ERROR] 
[ERROR] To see the full stack trace of the errors, re-run Maven with the -e switch.
[ERROR] Re-run Maven using the -X switch to enable full debug logging.
[ERROR] 
[ERROR] For more information about the errors and possible solutions, please read the following
articles:
[ERROR] [Help 1] http://cwiki.apache.org/confluence/display/MAVEN/ProjectBuildingException
[ERROR] [Help 2] http://cwiki.apache.org/confluence/display/MAVEN/UnresolvableModelException
---------------------------------------------

To subscribe to this information via syndicated feeds:
- RSS: http://vmgump.apache.org/gump/public/apacheds/syncrepl/rss.xml
- Atom: http://vmgump.apache.org/gump/public/apacheds/syncrepl/atom.xml

============================== Gump Tracking Only ===
Produced by Apache Gump(TM) version 2.3.
Gump Run 06001226022012, vmgump.apache.org:vmgump:06001226022012
Gump E-mail Identifier (unique within run) #6.

*********************************************************** G U M P
[GUMP@vmgump]: Project apacheds-service (in module apacheds) failed
To whom it may engage...
        
This is an automated request, but not an unsolicited one. For 
more information please visit http://gump.apache.org/nagged.html, 
and/or contact the folk at general@gump.apache.org.

Project apacheds-service has an issue affecting its community integration.
This issue affects 2 projects.
The current state of this project is 'Failed', with reason 'Build Failed'.
For reference only, the following projects are affected by this:
    - apacheds-service :  Apache Directory Server
    - apacheds-wrapper :  Apache Directory Server


Full details are available at:
    http://vmgump.apache.org/gump/public/apacheds/apacheds-service/index.html

That said, some information snippets are provided here.

The following annotations (debug/informational/warning/error messages) were provided:
 -DEBUG- Sole jar output [apacheds-service-*[0-9T].jar] identifier set to project name
 -DEBUG- (Apache Gump generated) Apache Maven Settings in: /srv/gump/public/workspace/apacheds/service/gump_mvn_settings.xml
 -INFO- Failed with reason build failed
 -DEBUG- Maven POM in: /srv/gump/public/workspace/apacheds/service/pom.xml
 -INFO- Failed to extract fallback artifacts from Gump Repository



The following work was performed:
http://vmgump.apache.org/gump/public/apacheds/apacheds-service/gump_work/build_apacheds_apacheds-service.html
Work Name: build_apacheds_apacheds-service (Type: Build)
Work ended in a state of : Failed
Elapsed: 7 secs
Command Line: /opt/maven3/bin/mvn --batch-mode --settings /srv/gump/public/workspace/apacheds/service/gump_mvn_settings.xml
install 
[Working Directory: /srv/gump/public/workspace/apacheds/service]
M2_HOME: /opt/maven3
---------------------------------------------
[INFO] Scanning for projects...
[INFO]                                                                         
[INFO] ------------------------------------------------------------------------
[INFO] Building ApacheDS Service 2.0.0-M7-SNAPSHOT
[INFO] ------------------------------------------------------------------------
[WARNING] The POM for org.apache.directory.jdbm:apacheds-jdbm2:bundle:2.0.0-M1 is missing,
no dependency information available
Downloading: http://localhost:8192/maven2/org/apache/directory/jdbm/apacheds-jdbm2/2.0.0-M1/apacheds-jdbm2-2.0.0-M1.bundle
[INFO] ------------------------------------------------------------------------
[INFO] BUILD FAILURE
[INFO] ------------------------------------------------------------------------
[INFO] Total time: 5.665s
[INFO] Finished at: Sun Feb 26 20:45:31 UTC 2012
[INFO] Final Memory: 7M/18M
[INFO] ------------------------------------------------------------------------
[ERROR] Failed to execute goal on project apacheds-service: Could not resolve dependencies
for project org.apache.directory.server:apacheds-service:jar:2.0.0-M7-SNAPSHOT: Could not
find artifact org.apache.directory.jdbm:apacheds-jdbm2:bundle:2.0.0-M1 in gump-central (http://localhost:8192/maven2)
-> [Help 1]
[ERROR] 
[ERROR] To see the full stack trace of the errors, re-run Maven with the -e switch.
[ERROR] Re-run Maven using the -X switch to enable full debug logging.
[ERROR] 
[ERROR] For more information about the errors and possible solutions, please read the following
articles:
[ERROR] [Help 1] http://cwiki.apache.org/confluence/display/MAVEN/DependencyResolutionException
---------------------------------------------

To subscribe to this information via syndicated feeds:
- RSS: http://vmgump.apache.org/gump/public/apacheds/apacheds-service/rss.xml
- Atom: http://vmgump.apache.org/gump/public/apacheds/apacheds-service/atom.xml

============================== Gump Tracking Only ===
Produced by Apache Gump(TM) version 2.3.
Gump Run 06001226022012, vmgump.apache.org:vmgump:06001226022012
Gump E-mail Identifier (unique within run) #7.

*********************************************************** G U M P
[GUMP@vmgump]: Project apacheds-all (in module apacheds) failed
To whom it may engage...
        
This is an automated request, but not an unsolicited one. For 
more information please visit http://gump.apache.org/nagged.html, 
and/or contact the folk at general@gump.apache.org.

Project apacheds-all has an issue affecting its community integration.
This issue affects 1 projects.
The current state of this project is 'Failed', with reason 'Build Failed'.
For reference only, the following projects are affected by this:
    - apacheds-all :  Apache Directory Server


Full details are available at:
    http://vmgump.apache.org/gump/public/apacheds/apacheds-all/index.html

That said, some information snippets are provided here.

The following annotations (debug/informational/warning/error messages) were provided:
 -DEBUG- Sole jar output [apacheds-all-*[0-9T].jar] identifier set to project name
 -DEBUG- (Apache Gump generated) Apache Maven Settings in: /srv/gump/public/workspace/apacheds/all/gump_mvn_settings.xml
 -INFO- Failed with reason build failed
 -DEBUG- Maven POM in: /srv/gump/public/workspace/apacheds/all/pom.xml
 -INFO- Failed to extract fallback artifacts from Gump Repository



The following work was performed:
http://vmgump.apache.org/gump/public/apacheds/apacheds-all/gump_work/build_apacheds_apacheds-all.html
Work Name: build_apacheds_apacheds-all (Type: Build)
Work ended in a state of : Failed
Elapsed: 7 secs
Command Line: /opt/maven3/bin/mvn --batch-mode --settings /srv/gump/public/workspace/apacheds/all/gump_mvn_settings.xml
install 
[Working Directory: /srv/gump/public/workspace/apacheds/all]
M2_HOME: /opt/maven3
---------------------------------------------
[INFO] Scanning for projects...
[INFO]                                                                         
[INFO] ------------------------------------------------------------------------
[INFO] Building ApacheDS All 2.0.0-M7-SNAPSHOT
[INFO] ------------------------------------------------------------------------
[WARNING] The POM for org.apache.directory.jdbm:apacheds-jdbm2:bundle:2.0.0-M1 is missing,
no dependency information available
[INFO] ------------------------------------------------------------------------
[INFO] BUILD FAILURE
[INFO] ------------------------------------------------------------------------
[INFO] Total time: 5.585s
[INFO] Finished at: Sun Feb 26 20:46:46 UTC 2012
[INFO] Final Memory: 7M/18M
[INFO] ------------------------------------------------------------------------
[ERROR] Failed to execute goal on project apacheds-all: Could not resolve dependencies for
project org.apache.directory.server:apacheds-all:jar:2.0.0-M7-SNAPSHOT: Failure to find org.apache.directory.jdbm:apacheds-jdbm2:bundle:2.0.0-M1
in http://localhost:8192/maven2 was cached in the local repository, resolution will not be
reattempted until the update interval of gump-central has elapsed or updates are forced ->
[Help 1]
[ERROR] 
[ERROR] To see the full stack trace of the errors, re-run Maven with the -e switch.
[ERROR] Re-run Maven using the -X switch to enable full debug logging.
[ERROR] 
[ERROR] For more information about the errors and possible solutions, please read the following
articles:
[ERROR] [Help 1] http://cwiki.apache.org/confluence/display/MAVEN/DependencyResolutionException
---------------------------------------------

To subscribe to this information via syndicated feeds:
- RSS: http://vmgump.apache.org/gump/public/apacheds/apacheds-all/rss.xml
- Atom: http://vmgump.apache.org/gump/public/apacheds/apacheds-all/atom.xml

============================== Gump Tracking Only ===
Produced by Apache Gump(TM) version 2.3.
Gump Run 06001226022012, vmgump.apache.org:vmgump:06001226022012
Gump E-mail Identifier (unique within run) #8.

*********************************************************** G U M P
[GUMP@vmgump]: Project apacheds-kerberos-test (in module apacheds) failed
To whom it may engage...
        
This is an automated request, but not an unsolicited one. For 
more information please visit http://gump.apache.org/nagged.html, 
and/or contact the folk at general@gump.apache.org.

Project apacheds-kerberos-test has an issue affecting its community integration.
This issue affects 1 projects.
The current state of this project is 'Failed', with reason 'Build Failed'.
For reference only, the following projects are affected by this:
    - apacheds-kerberos-test :  Apache Directory Server


Full details are available at:
    http://vmgump.apache.org/gump/public/apacheds/apacheds-kerberos-test/index.html

That said, some information snippets are provided here.

The following annotations (debug/informational/warning/error messages) were provided:
 -DEBUG- Sole jar output [apacheds-kerberos-test-*[0-9T].jar] identifier set to project name
 -WARNING- Bad *Optional* Dependency. Project: apacheds-apacheds-kerberos-codec : unknown
to *this* workspace
 -DEBUG- (Apache Gump generated) Apache Maven Settings in: /srv/gump/public/workspace/apacheds/kerberos-test/gump_mvn_settings.xml
 -INFO- Failed with reason build failed
 -DEBUG- Maven POM in: /srv/gump/public/workspace/apacheds/kerberos-test/pom.xml
 -INFO- Failed to extract fallback artifacts from Gump Repository



The following work was performed:
http://vmgump.apache.org/gump/public/apacheds/apacheds-kerberos-test/gump_work/build_apacheds_apacheds-kerberos-test.html
Work Name: build_apacheds_apacheds-kerberos-test (Type: Build)
Work ended in a state of : Failed
Elapsed: 7 secs
Command Line: /opt/maven3/bin/mvn --batch-mode --settings /srv/gump/public/workspace/apacheds/kerberos-test/gump_mvn_settings.xml
install 
[Working Directory: /srv/gump/public/workspace/apacheds/kerberos-test]
M2_HOME: /opt/maven3
---------------------------------------------
[INFO] Scanning for projects...
[INFO]                                                                         
[INFO] ------------------------------------------------------------------------
[INFO] Building ApacheDS Protocol Kerberos Test 2.0.0-M7-SNAPSHOT
[INFO] ------------------------------------------------------------------------
[WARNING] The POM for org.apache.directory.jdbm:apacheds-jdbm2:bundle:2.0.0-M1 is missing,
no dependency information available
[INFO] ------------------------------------------------------------------------
[INFO] BUILD FAILURE
[INFO] ------------------------------------------------------------------------
[INFO] Total time: 5.678s
[INFO] Finished at: Sun Feb 26 20:46:54 UTC 2012
[INFO] Final Memory: 7M/17M
[INFO] ------------------------------------------------------------------------
[ERROR] Failed to execute goal on project apacheds-kerberos-test: Could not resolve dependencies
for project org.apache.directory.server:apacheds-kerberos-test:jar:2.0.0-M7-SNAPSHOT: Failure
to find org.apache.directory.jdbm:apacheds-jdbm2:bundle:2.0.0-M1 in http://localhost:8192/maven2
was cached in the local repository, resolution will not be reattempted until the update interval
of gump-central has elapsed or updates are forced -> [Help 1]
[ERROR] 
[ERROR] To see the full stack trace of the errors, re-run Maven with the -e switch.
[ERROR] Re-run Maven using the -X switch to enable full debug logging.
[ERROR] 
[ERROR] For more information about the errors and possible solutions, please read the following
articles:
[ERROR] [Help 1] http://cwiki.apache.org/confluence/display/MAVEN/DependencyResolutionException
---------------------------------------------

To subscribe to this information via syndicated feeds:
- RSS: http://vmgump.apache.org/gump/public/apacheds/apacheds-kerberos-test/rss.xml
- Atom: http://vmgump.apache.org/gump/public/apacheds/apacheds-kerberos-test/atom.xml

============================== Gump Tracking Only ===
Produced by Apache Gump(TM) version 2.3.
Gump Run 06001226022012, vmgump.apache.org:vmgump:06001226022012
Gump E-mail Identifier (unique within run) #9.

*********************************************************** G U M P
[GUMP@vmgump]: Project apacheds-ldap-client-test (in module apacheds) failed
To whom it may engage...
        
This is an automated request, but not an unsolicited one. For 
more information please visit http://gump.apache.org/nagged.html, 
and/or contact the folk at general@gump.apache.org.

Project apacheds-ldap-client-test has an issue affecting its community integration.
This issue affects 1 projects.
The current state of this project is 'Failed', with reason 'Build Failed'.
For reference only, the following projects are affected by this:
    - apacheds-ldap-client-test :  Apache Directory Server


Full details are available at:
    http://vmgump.apache.org/gump/public/apacheds/apacheds-ldap-client-test/index.html

That said, some information snippets are provided here.

The following annotations (debug/informational/warning/error messages) were provided:
 -DEBUG- Sole jar output [apacheds-ldap-client-test-*[0-9T].jar] identifier set to project
name
 -DEBUG- (Apache Gump generated) Apache Maven Settings in: /srv/gump/public/workspace/apacheds/ldap-client-test/gump_mvn_settings.xml
 -INFO- Failed with reason build failed
 -DEBUG- Maven POM in: /srv/gump/public/workspace/apacheds/ldap-client-test/pom.xml
 -INFO- Failed to extract fallback artifacts from Gump Repository



The following work was performed:
http://vmgump.apache.org/gump/public/apacheds/apacheds-ldap-client-test/gump_work/build_apacheds_apacheds-ldap-client-test.html
Work Name: build_apacheds_apacheds-ldap-client-test (Type: Build)
Work ended in a state of : Failed
Elapsed: 6 secs
Command Line: /opt/maven3/bin/mvn --batch-mode --settings /srv/gump/public/workspace/apacheds/ldap-client-test/gump_mvn_settings.xml
install 
[Working Directory: /srv/gump/public/workspace/apacheds/ldap-client-test]
M2_HOME: /opt/maven3
---------------------------------------------
[INFO] Scanning for projects...
[INFO]                                                                         
[INFO] ------------------------------------------------------------------------
[INFO] Building Apache Directory LDAP Client API test 2.0.0-M7-SNAPSHOT
[INFO] ------------------------------------------------------------------------
[WARNING] The POM for org.apache.directory.jdbm:apacheds-jdbm2:bundle:2.0.0-M1 is missing,
no dependency information available
[INFO] ------------------------------------------------------------------------
[INFO] BUILD FAILURE
[INFO] ------------------------------------------------------------------------
[INFO] Total time: 4.774s
[INFO] Finished at: Sun Feb 26 20:52:07 UTC 2012
[INFO] Final Memory: 6M/16M
[INFO] ------------------------------------------------------------------------
[ERROR] Failed to execute goal on project ldap-client-test: Could not resolve dependencies
for project org.apache.directory.server:ldap-client-test:jar:2.0.0-M7-SNAPSHOT: Failure to
find org.apache.directory.jdbm:apacheds-jdbm2:bundle:2.0.0-M1 in http://localhost:8192/maven2
was cached in the local repository, resolution will not be reattempted until the update interval
of gump-central has elapsed or updates are forced -> [Help 1]
[ERROR] 
[ERROR] To see the full stack trace of the errors, re-run Maven with the -e switch.
[ERROR] Re-run Maven using the -X switch to enable full debug logging.
[ERROR] 
[ERROR] For more information about the errors and possible solutions, please read the following
articles:
[ERROR] [Help 1] http://cwiki.apache.org/confluence/display/MAVEN/DependencyResolutionException
---------------------------------------------

To subscribe to this information via syndicated feeds:
- RSS: http://vmgump.apache.org/gump/public/apacheds/apacheds-ldap-client-test/rss.xml
- Atom: http://vmgump.apache.org/gump/public/apacheds/apacheds-ldap-client-test/atom.xml

============================== Gump Tracking Only ===
Produced by Apache Gump(TM) version 2.3.
Gump Run 06001226022012, vmgump.apache.org:vmgump:06001226022012
Gump E-mail Identifier (unique within run) #10.


--
Apache Gump
http://gump.apache.org/ [Instance: vmgump]

---------------------------------------------------------------------
To unsubscribe, e-mail: general-unsubscribe@gump.apache.org
For additional commands, e-mail: general-help@gump.apache.org


Mime
View raw message