gump-general mailing list archives

Site index · List index
Message view « Date » · « Thread »
Top « Date » · « Thread »
From g...@vmgump.apache.org
Subject BATCH: All dressed up, with nowhere to go...
Date Mon, 20 Feb 2012 20:52:22 GMT
Dear Gumpmeisters,
            
The following 2 notifys should have been sent

*********************************************************** G U M P
[GUMP@vmgump]: Project lucene-java-test (in module lucene-java) failed
[GUMP@vmgump]: Project lucene-java-analyzers (in module lucene-java) failed
*********************************************************** G U M P
[GUMP@vmgump]: Project lucene-java-test (in module lucene-java) failed
To whom it may engage...
        
This is an automated request, but not an unsolicited one. For 
more information please visit http://gump.apache.org/nagged.html, 
and/or contact the folk at general@gump.apache.org.

Project lucene-java-test has an issue affecting its community integration.
This issue affects 1 projects.
The current state of this project is 'Failed', with reason 'Build Failed'.
For reference only, the following projects are affected by this:
    - lucene-java-test :  Java Based Search Engine


Full details are available at:
    http://vmgump.apache.org/gump/public/lucene-java/lucene-java-test/index.html

That said, some information snippets are provided here.

The following annotations (debug/informational/warning/error messages) were provided:
 -DEBUG- Dependency on javacc exists, no need to add for property javacc.home.
 -INFO- Failed with reason build failed



The following work was performed:
http://vmgump.apache.org/gump/public/lucene-java/lucene-java-test/gump_work/build_lucene-java_lucene-java-test.html
Work Name: build_lucene-java_lucene-java-test (Type: Build)
Work ended in a state of : Failed
Elapsed: 29 secs
Command Line: /usr/lib/jvm/java-6-openjdk/bin/java -Djava.awt.headless=true -Dbuild.sysclasspath=only
-Xbootclasspath/p:/srv/gump/public/workspace/xml-commons/java/external/build/xml-apis.jar:/srv/gump/public/workspace/xml-xerces2/build/xercesImpl.jar
org.apache.tools.ant.Main -Dgump.merge=/srv/gump/public/gump/work/merge.xml -Dversion=20022012
-Djavacc.home=/srv/gump/packages/javacc-3.1 test-core 
[Working Directory: /srv/gump/public/workspace/lucene-java/lucene]
CLASSPATH: /usr/lib/jvm/java-6-openjdk/lib/tools.jar:/srv/gump/public/workspace/lucene-java/lucene/build/classes/test:/srv/gump/public/workspace/lucene-java/lucene/build/classes/tools:/srv/gump/public/workspace/ant/dist/lib/ant.jar:/srv/gump/public/workspace/ant/dist/lib/ant-launcher.jar:/srv/gump/public/workspace/ant/dist/lib/ant-jmf.jar:/srv/gump/public/workspace/ant/dist/lib/ant-junit.jar:/srv/gump/public/workspace/ant/dist/lib/ant-swing.jar:/srv/gump/public/workspace/ant/dist/lib/ant-apache-resolver.jar:/srv/gump/public/workspace/ant/dist/lib/ant-apache-xalan2.jar:/srv/gump/public/workspace/xml-commons/java/build/resolver.jar:/srv/gump/packages/javacc-3.1/bin/lib/javacc.jar:/srv/gump/public/workspace/junit/dist/junit-20022012.jar:/srv/gump/public/workspace/junit/dist/junit-dep-20022012.jar:/srv/gump/public/workspace/lucene-java/lucene/build/core/lucene-core-20022012.jar:/srv/gump/public/workspace/lucene-java/lucene/build/test-framework/lucene-test-framework-20022012.jar:/
 srv/gump/public/workspace/xml-commons/java/external/build/xml-apis-ext.jar
---------------------------------------------
    [junit] TEST org.apache.lucene.util.fst.TestFSTs FAILED
    [junit] Testsuite: org.apache.lucene.util.junitcompat.TestSetupTeardownChaining
    [junit] Null Test: 	Caused an ERROR
    [junit] org.apache.lucene.util.junitcompat.TestSetupTeardownChaining
    [junit] java.lang.ClassNotFoundException: org.apache.lucene.util.junitcompat.TestSetupTeardownChaining
    [junit] 	at java.net.URLClassLoader$1.run(URLClassLoader.java:217)
    [junit] 	at java.security.AccessController.doPrivileged(Native Method)
    [junit] 	at java.net.URLClassLoader.findClass(URLClassLoader.java:205)
    [junit] 	at java.lang.ClassLoader.loadClass(ClassLoader.java:321)
    [junit] 	at sun.misc.Launcher$AppClassLoader.loadClass(Launcher.java:294)
    [junit] 	at java.lang.ClassLoader.loadClass(ClassLoader.java:266)
    [junit] 	at java.lang.Class.forName0(Native Method)
    [junit] 	at java.lang.Class.forName(Class.java:186)
    [junit] 
    [junit] 
    [junit] Tests run: 1, Failures: 0, Errors: 1, Time elapsed: 0 sec
    [junit] 
    [junit] TEST org.apache.lucene.util.junitcompat.TestSetupTeardownChaining FAILED
    [junit] Testsuite: org.apache.lucene.util.packed.TestPackedInts
    [junit] Null Test: 	Caused an ERROR
    [junit] org.apache.lucene.util.packed.TestPackedInts
    [junit] java.lang.ClassNotFoundException: org.apache.lucene.util.packed.TestPackedInts
    [junit] 	at java.net.URLClassLoader$1.run(URLClassLoader.java:217)
    [junit] 	at java.security.AccessController.doPrivileged(Native Method)
    [junit] 	at java.net.URLClassLoader.findClass(URLClassLoader.java:205)
    [junit] 	at java.lang.ClassLoader.loadClass(ClassLoader.java:321)
    [junit] 	at sun.misc.Launcher$AppClassLoader.loadClass(Launcher.java:294)
    [junit] 	at java.lang.ClassLoader.loadClass(ClassLoader.java:266)
    [junit] 	at java.lang.Class.forName0(Native Method)
    [junit] 	at java.lang.Class.forName(Class.java:186)
    [junit] 
    [junit] 
    [junit] Tests run: 1, Failures: 0, Errors: 1, Time elapsed: 0 sec
    [junit] 
    [junit] TEST org.apache.lucene.util.packed.TestPackedInts FAILED
    [junit] Tests FAILED

BUILD FAILED
/srv/gump/public/workspace/lucene-java/lucene/build.xml:43: The following error occurred while
executing this line:
/srv/gump/public/workspace/lucene-java/lucene/common-build.xml:697: 
The following error occurred while executing this line:
/srv/gump/public/workspace/lucene-java/lucene/common-build.xml:681: Tests failed!
The following error occurred while executing this line:
/srv/gump/public/workspace/lucene-java/lucene/common-build.xml:681: Tests failed!
The following error occurred while executing this line:
/srv/gump/public/workspace/lucene-java/lucene/common-build.xml:681: Tests failed!
The following error occurred while executing this line:
/srv/gump/public/workspace/lucene-java/lucene/common-build.xml:681: Tests failed!

Total time: 29 seconds
---------------------------------------------

To subscribe to this information via syndicated feeds:
- RSS: http://vmgump.apache.org/gump/public/lucene-java/lucene-java-test/rss.xml
- Atom: http://vmgump.apache.org/gump/public/lucene-java/lucene-java-test/atom.xml

============================== Gump Tracking Only ===
Produced by Apache Gump(TM) version 2.3.
Gump Run 06001220022012, vmgump.apache.org:vmgump:06001220022012
Gump E-mail Identifier (unique within run) #1.

*********************************************************** G U M P
[GUMP@vmgump]: Project lucene-java-analyzers (in module lucene-java) failed
To whom it may engage...
        
This is an automated request, but not an unsolicited one. For 
more information please visit http://gump.apache.org/nagged.html, 
and/or contact the folk at general@gump.apache.org.

Project lucene-java-analyzers has an issue affecting its community integration.
This issue affects 6 projects.
The current state of this project is 'Failed', with reason 'Build Failed'.
For reference only, the following projects are affected by this:
    - lucene-java-analyzers :  Java Based Search Engine
    - lucene-java-analyzers-test :  Java Based Search Engine
    - lucene-java-contrib :  Java Based Search Engine
    - lucene-java-contrib-test :  Java Based Search Engine
    - solr :  Java Based Search Engine
    - solr-test :  Java Based Search Engine


Full details are available at:
    http://vmgump.apache.org/gump/public/lucene-java/lucene-java-analyzers/index.html

That said, some information snippets are provided here.

The following annotations (debug/informational/warning/error messages) were provided:
 -INFO- Failed with reason build failed
 -INFO- Failed to extract fallback artifacts from Gump Repository



The following work was performed:
http://vmgump.apache.org/gump/public/lucene-java/lucene-java-analyzers/gump_work/build_lucene-java_lucene-java-analyzers.html
Work Name: build_lucene-java_lucene-java-analyzers (Type: Build)
Work ended in a state of : Failed
Elapsed: 25 secs
Command Line: /usr/lib/jvm/java-6-openjdk/bin/java -Djava.awt.headless=true -Dbuild.sysclasspath=only
-Xbootclasspath/p:/srv/gump/public/workspace/xml-commons/java/external/build/xml-apis.jar:/srv/gump/public/workspace/xml-xerces2/build/xercesImpl.jar
org.apache.tools.ant.Main -Dgump.merge=/srv/gump/public/gump/work/merge.xml -Dversion=20022012

[Working Directory: /srv/gump/public/workspace/lucene-java/modules/analysis]
CLASSPATH: /usr/lib/jvm/java-6-openjdk/lib/tools.jar:/srv/gump/public/workspace/lucene-java/modules/analysis/build/common/classes/java:/srv/gump/public/workspace/lucene-java/modules/analysis/morfologik/lib/morfologik-fsa-1.5.2.jar:/srv/gump/public/workspace/lucene-java/modules/analysis/morfologik/lib/morfologik-polish-1.5.2.jar:/srv/gump/public/workspace/lucene-java/modules/analysis/morfologik/lib/morfologik-stemming-1.5.2.jar:/srv/gump/public/workspace/ant/dist/lib/ant.jar:/srv/gump/public/workspace/ant/dist/lib/ant-launcher.jar:/srv/gump/public/workspace/ant/dist/lib/ant-jmf.jar:/srv/gump/public/workspace/ant/dist/lib/ant-junit.jar:/srv/gump/public/workspace/ant/dist/lib/ant-swing.jar:/srv/gump/public/workspace/ant/dist/lib/ant-apache-resolver.jar:/srv/gump/public/workspace/ant/dist/lib/ant-apache-xalan2.jar:/srv/gump/public/workspace/xml-commons/java/build/resolver.jar:/srv/gump/public/workspace/commons-codec-1.x/dist/commons-codec-20022012.jar:/srv/gump/public/workspace/i
 cu4j/main/classes/core/out/lib/icu4j-core.jar:/srv/gump/public/workspace/icu4j/main/classes/collate/out/lib/icu4j-collate.jar:/srv/gump/public/workspace/icu4j/main/classes/currdata/out/lib/icu4j-currdata.jar:/srv/gump/public/workspace/icu4j/main/classes/langdata/out/lib/icu4j-langdata.jar:/srv/gump/public/workspace/icu4j/main/classes/regiondata/out/lib/icu4j-regiondata.jar:/srv/gump/public/workspace/icu4j/main/classes/translit/out/lib/icu4j-translit.jar:/srv/gump/public/workspace/icu4j/main/classes/charset/out/lib/icu4j-charset.jar:/srv/gump/public/workspace/icu4j/main/classes/localespi/out/lib/icu4j-localespi.jar:/srv/gump/public/workspace/junit/dist/junit-20022012.jar:/srv/gump/public/workspace/junit/dist/junit-dep-20022012.jar:/srv/gump/public/workspace/lucene-java/lucene/build/core/lucene-core-20022012.jar:/srv/gump/public/workspace/lucene-java/lucene/build/test-framework/lucene-test-framework-20022012.jar:/srv/gump/public/workspace/xml-commons/java/external/build/xml-ap
 is-ext.jar
---------------------------------------------

clover:

common.compile-core:
    [mkdir] Created dir: /srv/gump/public/workspace/lucene-java/modules/analysis/build/phonetic/classes/java
    [javac] Compiling 3 source files to /srv/gump/public/workspace/lucene-java/modules/analysis/build/phonetic/classes/java
    [javac] warning: [path] bad path element "/srv/gump/public/workspace/lucene-java/modules/analysis/morfologik/lib/hppc-0.4.0.jar":
no such file or directory
    [javac] /srv/gump/public/workspace/lucene-java/modules/analysis/phonetic/src/java/org/apache/lucene/analysis/phonetic/BeiderMorseFilter.java:24:
package org.apache.commons.codec.language.bm does not exist
    [javac] import org.apache.commons.codec.language.bm.BeiderMorseEncoder; // javadocs
    [javac]                                            ^
    [javac] /srv/gump/public/workspace/lucene-java/modules/analysis/phonetic/src/java/org/apache/lucene/analysis/phonetic/BeiderMorseFilter.java:25:
package org.apache.commons.codec.language.bm.Languages does not exist
    [javac] import org.apache.commons.codec.language.bm.Languages.LanguageSet;
    [javac]                                                      ^
    [javac] /srv/gump/public/workspace/lucene-java/modules/analysis/phonetic/src/java/org/apache/lucene/analysis/phonetic/BeiderMorseFilter.java:26:
package org.apache.commons.codec.language.bm does not exist
    [javac] import org.apache.commons.codec.language.bm.PhoneticEngine;
    [javac]                                            ^
    [javac] /srv/gump/public/workspace/lucene-java/modules/analysis/phonetic/src/java/org/apache/lucene/analysis/phonetic/BeiderMorseFilter.java:45:
cannot find symbol
    [javac] symbol  : class PhoneticEngine
    [javac] location: class org.apache.lucene.analysis.phonetic.BeiderMorseFilter
    [javac]   private final PhoneticEngine engine;
    [javac]                 ^
    [javac] /srv/gump/public/workspace/lucene-java/modules/analysis/phonetic/src/java/org/apache/lucene/analysis/phonetic/BeiderMorseFilter.java:46:
cannot find symbol
    [javac] symbol  : class LanguageSet
    [javac] location: class org.apache.lucene.analysis.phonetic.BeiderMorseFilter
    [javac]   private final LanguageSet languages;
    [javac]                 ^
    [javac] /srv/gump/public/workspace/lucene-java/modules/analysis/phonetic/src/java/org/apache/lucene/analysis/phonetic/BeiderMorseFilter.java:69:
cannot find symbol
    [javac] symbol  : class PhoneticEngine
    [javac] location: class org.apache.lucene.analysis.phonetic.BeiderMorseFilter
    [javac]   public BeiderMorseFilter(TokenStream input, PhoneticEngine engine) {
    [javac]                                               ^
    [javac] /srv/gump/public/workspace/lucene-java/modules/analysis/phonetic/src/java/org/apache/lucene/analysis/phonetic/BeiderMorseFilter.java:79:
cannot find symbol
    [javac] symbol  : class PhoneticEngine
    [javac] location: class org.apache.lucene.analysis.phonetic.BeiderMorseFilter
    [javac]   public BeiderMorseFilter(TokenStream input, PhoneticEngine engine, LanguageSet
languages) {
    [javac]                                               ^
    [javac] /srv/gump/public/workspace/lucene-java/modules/analysis/phonetic/src/java/org/apache/lucene/analysis/phonetic/BeiderMorseFilter.java:79:
cannot find symbol
    [javac] symbol  : class LanguageSet
    [javac] location: class org.apache.lucene.analysis.phonetic.BeiderMorseFilter
    [javac]   public BeiderMorseFilter(TokenStream input, PhoneticEngine engine, LanguageSet
languages) {
    [javac]                                                                      ^
    [javac] 8 errors
    [javac] 1 warning

BUILD FAILED
/srv/gump/public/workspace/lucene-java/modules/analysis/build.xml:50: The following error
occurred while executing this line:
/srv/gump/public/workspace/lucene-java/lucene/common-build.xml:329: The following error occurred
while executing this line:
/srv/gump/public/workspace/lucene-java/lucene/common-build.xml:845: Compile failed; see the
compiler error output for details.

Total time: 24 seconds
---------------------------------------------

To subscribe to this information via syndicated feeds:
- RSS: http://vmgump.apache.org/gump/public/lucene-java/lucene-java-analyzers/rss.xml
- Atom: http://vmgump.apache.org/gump/public/lucene-java/lucene-java-analyzers/atom.xml

============================== Gump Tracking Only ===
Produced by Apache Gump(TM) version 2.3.
Gump Run 06001220022012, vmgump.apache.org:vmgump:06001220022012
Gump E-mail Identifier (unique within run) #2.


--
Apache Gump
http://gump.apache.org/ [Instance: vmgump]

---------------------------------------------------------------------
To unsubscribe, e-mail: general-unsubscribe@gump.apache.org
For additional commands, e-mail: general-help@gump.apache.org


Mime
View raw message