gump-general mailing list archives

Site index · List index
Message view « Date » · « Thread »
Top « Date » · « Thread »
From g...@vmgump.apache.org
Subject BATCH: All dressed up, with nowhere to go...
Date Tue, 10 Jan 2012 20:48:03 GMT
Dear Gumpmeisters,
            
The following 17 notifys should have been sent

*********************************************************** G U M P
[GUMP@vmgump]: Project apacheds-core-api-test (in module apacheds) failed
[GUMP@vmgump]: Project apacheds-xdbm-partition-test (in module apacheds) failed
[GUMP@vmgump]: Project apacheds-interceptors-authn-test (in module apacheds) failed
[GUMP@vmgump]: Project apacheds-interceptors-changelog-test (in module apacheds) failed
[GUMP@vmgump]: Project apacheds-interceptors-normalization-test (in module apacheds) failed
[GUMP@vmgump]: Project apacheds-interceptors-schema-test (in module apacheds) failed
[GUMP@vmgump]: Project apacheds-interceptors-subtree-test (in module apacheds) failed
[GUMP@vmgump]: Project apacheds-interceptors-authz-test (in module apacheds) failed
[GUMP@vmgump]: Project apacheds-core-jndi (in module apacheds) failed
[GUMP@vmgump]: Project apacheds-core-test (in module apacheds) failed
[GUMP@vmgump]: Project apacheds-ldif-partition-test (in module apacheds) failed
[GUMP@vmgump]: Project apacheds-server-config (in module apacheds) failed
[GUMP@vmgump]: Project apacheds-core-annotations-test (in module apacheds) failed
[GUMP@vmgump]: Project apacheds-jdbm-partition-test (in module apacheds) failed
[GUMP@vmgump]: Project apacheds-protocol-ldap-test (in module apacheds) failed
[GUMP@vmgump]: Project apacheds-test-framework (in module apacheds) failed
[GUMP@vmgump]: Project activemq-jaas-test (in module activemq) failed
*********************************************************** G U M P
[GUMP@vmgump]: Project apacheds-core-api-test (in module apacheds) failed
To whom it may engage...
        
This is an automated request, but not an unsolicited one. For 
more information please visit http://gump.apache.org/nagged.html, 
and/or contact the folk at general@gump.apache.org.

Project apacheds-core-api-test has an issue affecting its community integration.
This issue affects 1 projects.
The current state of this project is 'Failed', with reason 'Build Failed'.
For reference only, the following projects are affected by this:
    - apacheds-core-api-test :  Apache Directory Server


Full details are available at:
    http://vmgump.apache.org/gump/public/apacheds/apacheds-core-api-test/index.html

That said, some information snippets are provided here.

The following annotations (debug/informational/warning/error messages) were provided:
 -WARNING- Overriding Maven settings: [/srv/gump/public/workspace/apacheds/core-api/gump_mvn_settings.xml]
 -DEBUG- (Apache Gump generated) Apache Maven Settings in: /srv/gump/public/workspace/apacheds/core-api/gump_mvn_settings.xml
 -INFO- Failed with reason build failed
 -DEBUG- Maven POM in: /srv/gump/public/workspace/apacheds/core-api/pom.xml



The following work was performed:
http://vmgump.apache.org/gump/public/apacheds/apacheds-core-api-test/gump_work/build_apacheds_apacheds-core-api-test.html
Work Name: build_apacheds_apacheds-core-api-test (Type: Build)
Work ended in a state of : Failed
Elapsed: 12 secs
Command Line: /opt/maven3/bin/mvn --batch-mode --settings /srv/gump/public/workspace/apacheds/core-api/gump_mvn_settings.xml package 
[Working Directory: /srv/gump/public/workspace/apacheds/core-api]
M2_HOME: /opt/maven3
---------------------------------------------
[INFO] Using 'UTF-8' encoding to copy filtered resources.
[INFO] Copying 1 resource
[INFO] Copying 3 resources
[INFO] 
[INFO] --- maven-compiler-plugin:2.3.2:testCompile (default-testCompile) @ apacheds-core-api ---
[INFO] Nothing to compile - all classes are up to date
[INFO] 
[INFO] --- maven-surefire-plugin:2.10:test (default-test) @ apacheds-core-api ---
[INFO] Surefire report directory: /srv/gump/public/workspace/apacheds/core-api/target/surefire-reports

-------------------------------------------------------
 T E S T S
-------------------------------------------------------
Running org.apache.directory.server.core.api.changelog.TagTest
Tests run: 8, Failures: 0, Errors: 0, Skipped: 0, Time elapsed: 0.089 sec
Running org.apache.directory.server.core.api.sp.StoredProcUtilsTest
Tests run: 1, Failures: 0, Errors: 0, Skipped: 0, Time elapsed: 0.008 sec
Running org.apache.directory.server.core.api.entry.SchemaAwareModificationTest
Tests run: 1, Failures: 0, Errors: 1, Skipped: 0, Time elapsed: 1.013 sec <<< FAILURE!
Running org.apache.directory.server.core.api.entry.ClonedServerEntryTest
Tests run: 1, Failures: 0, Errors: 1, Skipped: 0, Time elapsed: 0.019 sec <<< FAILURE!
Running org.apache.directory.server.core.api.entry.SchemaAwareEntryTest
Tests run: 1, Failures: 0, Errors: 1, Skipped: 0, Time elapsed: 0.589 sec <<< FAILURE!

Results :

Tests in error: 
  org.apache.directory.server.core.api.entry.SchemaAwareModificationTest: org/apache/commons/collections/MultiMap
  org.apache.directory.server.core.api.entry.ClonedServerEntryTest: org/apache/commons/collections/MultiMap
  org.apache.directory.server.core.api.entry.SchemaAwareEntryTest: org/apache/commons/collections/MultiMap

Tests run: 12, Failures: 0, Errors: 3, Skipped: 0

[INFO] ------------------------------------------------------------------------
[INFO] BUILD FAILURE
[INFO] ------------------------------------------------------------------------
[INFO] Total time: 10.216s
[INFO] Finished at: Tue Jan 10 19:44:51 UTC 2012
[INFO] Final Memory: 10M/24M
[INFO] ------------------------------------------------------------------------
[ERROR] Failed to execute goal org.apache.maven.plugins:maven-surefire-plugin:2.10:test (default-test) on project apacheds-core-api: There are test failures.
[ERROR] 
[ERROR] Please refer to /srv/gump/public/workspace/apacheds/core-api/target/surefire-reports for the individual test results.
[ERROR] -> [Help 1]
[ERROR] 
[ERROR] To see the full stack trace of the errors, re-run Maven with the -e switch.
[ERROR] Re-run Maven using the -X switch to enable full debug logging.
[ERROR] 
[ERROR] For more information about the errors and possible solutions, please read the following articles:
[ERROR] [Help 1] http://cwiki.apache.org/confluence/display/MAVEN/MojoFailureException
---------------------------------------------

To subscribe to this information via syndicated feeds:
- RSS: http://vmgump.apache.org/gump/public/apacheds/apacheds-core-api-test/rss.xml
- Atom: http://vmgump.apache.org/gump/public/apacheds/apacheds-core-api-test/atom.xml

============================== Gump Tracking Only ===
Produced by Apache Gump(TM) version 2.3.
Gump Run 06001210012012, vmgump.apache.org:vmgump:06001210012012
Gump E-mail Identifier (unique within run) #2.

*********************************************************** G U M P
[GUMP@vmgump]: Project apacheds-xdbm-partition-test (in module apacheds) failed
To whom it may engage...
        
This is an automated request, but not an unsolicited one. For 
more information please visit http://gump.apache.org/nagged.html, 
and/or contact the folk at general@gump.apache.org.

Project apacheds-xdbm-partition-test has an issue affecting its community integration.
This issue affects 1 projects.
The current state of this project is 'Failed', with reason 'Build Failed'.
For reference only, the following projects are affected by this:
    - apacheds-xdbm-partition-test :  Apache Directory Server


Full details are available at:
    http://vmgump.apache.org/gump/public/apacheds/apacheds-xdbm-partition-test/index.html

That said, some information snippets are provided here.

The following annotations (debug/informational/warning/error messages) were provided:
 -WARNING- Overriding Maven settings: [/srv/gump/public/workspace/apacheds/xdbm-partition/gump_mvn_settings.xml]
 -DEBUG- (Apache Gump generated) Apache Maven Settings in: /srv/gump/public/workspace/apacheds/xdbm-partition/gump_mvn_settings.xml
 -INFO- Failed with reason build failed
 -DEBUG- Maven POM in: /srv/gump/public/workspace/apacheds/xdbm-partition/pom.xml
 -INFO- Project Reports in: /srv/gump/public/workspace/apacheds/xdbm-partition/target/surefire-reports



The following work was performed:
http://vmgump.apache.org/gump/public/apacheds/apacheds-xdbm-partition-test/gump_work/build_apacheds_apacheds-xdbm-partition-test.html
Work Name: build_apacheds_apacheds-xdbm-partition-test (Type: Build)
Work ended in a state of : Failed
Elapsed: 16 secs
Command Line: /opt/maven3/bin/mvn --batch-mode --settings /srv/gump/public/workspace/apacheds/xdbm-partition/gump_mvn_settings.xml package 
[Working Directory: /srv/gump/public/workspace/apacheds/xdbm-partition]
M2_HOME: /opt/maven3
---------------------------------------------
Tests run: 9, Failures: 0, Errors: 0, Skipped: 0, Time elapsed: 0.033 sec
Running org.apache.directory.server.xdbm.impl.avl.AvlPartitionTest
Tests run: 1, Failures: 0, Errors: 1, Skipped: 0, Time elapsed: 0.165 sec <<< FAILURE!
Running org.apache.directory.server.xdbm.impl.avl.AvlRdnIndexTest
Tests run: 1, Failures: 0, Errors: 1, Skipped: 0, Time elapsed: 0.119 sec <<< FAILURE!
Running org.apache.directory.server.xdbm.impl.avl.AvlTableTest
Tests run: 5, Failures: 0, Errors: 0, Skipped: 0, Time elapsed: 0.037 sec
Running org.apache.directory.server.xdbm.GenericIndexTest
Tests run: 38, Failures: 0, Errors: 0, Skipped: 0, Time elapsed: 0.039 sec
Running org.apache.directory.server.xdbm.PartitionTest
Tests run: 1, Failures: 0, Errors: 1, Skipped: 0, Time elapsed: 0.141 sec <<< FAILURE!
Running org.apache.directory.server.xdbm.ReverseIndexEntryTest
Tests run: 7, Failures: 0, Errors: 0, Skipped: 0, Time elapsed: 0.006 sec

Results :

Tests in error: 
  org.apache.directory.server.xdbm.search.impl.PresenceTest: org/apache/commons/collections/MultiMap
  org.apache.directory.server.xdbm.search.impl.SubstringTest: org/apache/commons/collections/MultiMap
  org.apache.directory.server.xdbm.search.impl.NestedFilterTest: org/apache/commons/collections/MultiMap
  org.apache.directory.server.xdbm.search.impl.GreaterEqTest: org/apache/commons/collections/MultiMap
  org.apache.directory.server.xdbm.search.impl.OneLevelScopeTest: org/apache/commons/collections/MultiMap
  org.apache.directory.server.xdbm.search.impl.LessEqTest: org/apache/commons/collections/MultiMap
  org.apache.directory.server.xdbm.search.impl.NotCursorTest: org/apache/commons/collections/MultiMap
  org.apache.directory.server.xdbm.search.impl.SubtreeScopeTest: org/apache/commons/collections/MultiMap
  org.apache.directory.server.xdbm.search.impl.AndCursorTest: org/apache/commons/collections/MultiMap
  org.apache.directory.server.xdbm.search.impl.OrCursorTest: org/apache/commons/collections/MultiMap
  org.apache.directory.server.xdbm.impl.avl.AvlPartitionTest: org/apache/commons/collections/MultiMap
  org.apache.directory.server.xdbm.impl.avl.AvlRdnIndexTest: org/apache/commons/collections/MultiMap
  org.apache.directory.server.xdbm.PartitionTest: org/apache/commons/collections/MultiMap

Tests run: 124, Failures: 0, Errors: 13, Skipped: 0

[INFO] ------------------------------------------------------------------------
[INFO] BUILD FAILURE
[INFO] ------------------------------------------------------------------------
[INFO] Total time: 14.407s
[INFO] Finished at: Tue Jan 10 19:46:13 UTC 2012
[INFO] Final Memory: 10M/24M
[INFO] ------------------------------------------------------------------------
[ERROR] Failed to execute goal org.apache.maven.plugins:maven-surefire-plugin:2.10:test (default-test) on project apacheds-xdbm-partition: There are test failures.
[ERROR] 
[ERROR] Please refer to /srv/gump/public/workspace/apacheds/xdbm-partition/target/surefire-reports for the individual test results.
[ERROR] -> [Help 1]
[ERROR] 
[ERROR] To see the full stack trace of the errors, re-run Maven with the -e switch.
[ERROR] Re-run Maven using the -X switch to enable full debug logging.
[ERROR] 
[ERROR] For more information about the errors and possible solutions, please read the following articles:
[ERROR] [Help 1] http://cwiki.apache.org/confluence/display/MAVEN/MojoFailureException
---------------------------------------------

To subscribe to this information via syndicated feeds:
- RSS: http://vmgump.apache.org/gump/public/apacheds/apacheds-xdbm-partition-test/rss.xml
- Atom: http://vmgump.apache.org/gump/public/apacheds/apacheds-xdbm-partition-test/atom.xml

============================== Gump Tracking Only ===
Produced by Apache Gump(TM) version 2.3.
Gump Run 06001210012012, vmgump.apache.org:vmgump:06001210012012
Gump E-mail Identifier (unique within run) #3.

*********************************************************** G U M P
[GUMP@vmgump]: Project apacheds-interceptors-authn-test (in module apacheds) failed
To whom it may engage...
        
This is an automated request, but not an unsolicited one. For 
more information please visit http://gump.apache.org/nagged.html, 
and/or contact the folk at general@gump.apache.org.

Project apacheds-interceptors-authn-test has an issue affecting its community integration.
This issue affects 1 projects.
The current state of this project is 'Failed', with reason 'Build Failed'.
For reference only, the following projects are affected by this:
    - apacheds-interceptors-authn-test :  Apache Directory Server


Full details are available at:
    http://vmgump.apache.org/gump/public/apacheds/apacheds-interceptors-authn-test/index.html

That said, some information snippets are provided here.

The following annotations (debug/informational/warning/error messages) were provided:
 -WARNING- Overriding Maven settings: [/srv/gump/public/workspace/apacheds/interceptors/authn/gump_mvn_settings.xml]
 -DEBUG- (Apache Gump generated) Apache Maven Settings in: /srv/gump/public/workspace/apacheds/interceptors/authn/gump_mvn_settings.xml
 -INFO- Failed with reason build failed
 -DEBUG- Maven POM in: /srv/gump/public/workspace/apacheds/interceptors/authn/pom.xml
 -INFO- Project Reports in: /srv/gump/public/workspace/apacheds/interceptors/authn/target/surefire-reports



The following work was performed:
http://vmgump.apache.org/gump/public/apacheds/apacheds-interceptors-authn-test/gump_work/build_apacheds_apacheds-interceptors-authn-test.html
Work Name: build_apacheds_apacheds-interceptors-authn-test (Type: Build)
Work ended in a state of : Failed
Elapsed: 11 secs
Command Line: /opt/maven3/bin/mvn --batch-mode --settings /srv/gump/public/workspace/apacheds/interceptors/authn/gump_mvn_settings.xml install 
[Working Directory: /srv/gump/public/workspace/apacheds/interceptors/authn]
M2_HOME: /opt/maven3
---------------------------------------------
[INFO] --- maven-compiler-plugin:2.3.2:compile (default-compile) @ apacheds-interceptors-authn ---
[INFO] Nothing to compile - all classes are up to date
[INFO] 
[INFO] --- maven-resources-plugin:2.5:testResources (default-testResources) @ apacheds-interceptors-authn ---
[debug] execute contextualize
[INFO] Using 'UTF-8' encoding to copy filtered resources.
[INFO] skip non existing resourceDirectory /srv/gump/public/workspace/apacheds/interceptors/authn/src/test/resources
[INFO] Copying 3 resources
[INFO] 
[INFO] --- maven-compiler-plugin:2.3.2:testCompile (default-testCompile) @ apacheds-interceptors-authn ---
[INFO] Nothing to compile - all classes are up to date
[INFO] 
[INFO] --- maven-surefire-plugin:2.10:test (default-test) @ apacheds-interceptors-authn ---
[INFO] Surefire report directory: /srv/gump/public/workspace/apacheds/interceptors/authn/target/surefire-reports

-------------------------------------------------------
 T E S T S
-------------------------------------------------------
Running org.apache.directory.server.core.authn.SimpleAuthenticatorOneWayEncryptedTest
log4j:WARN No appenders could be found for logger (org.apache.directory.server.core.authn.AbstractAuthenticator).
log4j:WARN Please initialize the log4j system properly.
log4j:WARN See http://logging.apache.org/log4j/1.2/faq.html#noconfig for more info.
Tests run: 2, Failures: 0, Errors: 0, Skipped: 0, Time elapsed: 0.263 sec
Running org.apache.directory.server.core.authn.LdapPrincipalTest
Tests run: 1, Failures: 0, Errors: 1, Skipped: 0, Time elapsed: 0.634 sec <<< FAILURE!

Results :

Tests in error: 
  org.apache.directory.server.core.authn.LdapPrincipalTest: antlr/TokenStream

Tests run: 3, Failures: 0, Errors: 1, Skipped: 0

[INFO] ------------------------------------------------------------------------
[INFO] BUILD FAILURE
[INFO] ------------------------------------------------------------------------
[INFO] Total time: 9.944s
[INFO] Finished at: Tue Jan 10 19:51:21 UTC 2012
[INFO] Final Memory: 10M/24M
[INFO] ------------------------------------------------------------------------
[ERROR] Failed to execute goal org.apache.maven.plugins:maven-surefire-plugin:2.10:test (default-test) on project apacheds-interceptors-authn: There are test failures.
[ERROR] 
[ERROR] Please refer to /srv/gump/public/workspace/apacheds/interceptors/authn/target/surefire-reports for the individual test results.
[ERROR] -> [Help 1]
[ERROR] 
[ERROR] To see the full stack trace of the errors, re-run Maven with the -e switch.
[ERROR] Re-run Maven using the -X switch to enable full debug logging.
[ERROR] 
[ERROR] For more information about the errors and possible solutions, please read the following articles:
[ERROR] [Help 1] http://cwiki.apache.org/confluence/display/MAVEN/MojoFailureException
---------------------------------------------

To subscribe to this information via syndicated feeds:
- RSS: http://vmgump.apache.org/gump/public/apacheds/apacheds-interceptors-authn-test/rss.xml
- Atom: http://vmgump.apache.org/gump/public/apacheds/apacheds-interceptors-authn-test/atom.xml

============================== Gump Tracking Only ===
Produced by Apache Gump(TM) version 2.3.
Gump Run 06001210012012, vmgump.apache.org:vmgump:06001210012012
Gump E-mail Identifier (unique within run) #4.

*********************************************************** G U M P
[GUMP@vmgump]: Project apacheds-interceptors-changelog-test (in module apacheds) failed
To whom it may engage...
        
This is an automated request, but not an unsolicited one. For 
more information please visit http://gump.apache.org/nagged.html, 
and/or contact the folk at general@gump.apache.org.

Project apacheds-interceptors-changelog-test has an issue affecting its community integration.
This issue affects 1 projects.
The current state of this project is 'Failed', with reason 'Build Failed'.
For reference only, the following projects are affected by this:
    - apacheds-interceptors-changelog-test :  Apache Directory Server


Full details are available at:
    http://vmgump.apache.org/gump/public/apacheds/apacheds-interceptors-changelog-test/index.html

That said, some information snippets are provided here.

The following annotations (debug/informational/warning/error messages) were provided:
 -WARNING- Overriding Maven settings: [/srv/gump/public/workspace/apacheds/interceptors/changelog/gump_mvn_settings.xml]
 -DEBUG- (Apache Gump generated) Apache Maven Settings in: /srv/gump/public/workspace/apacheds/interceptors/changelog/gump_mvn_settings.xml
 -INFO- Failed with reason build failed
 -DEBUG- Maven POM in: /srv/gump/public/workspace/apacheds/interceptors/changelog/pom.xml
 -INFO- Project Reports in: /srv/gump/public/workspace/apacheds/interceptors/changelog/target/surefire-reports



The following work was performed:
http://vmgump.apache.org/gump/public/apacheds/apacheds-interceptors-changelog-test/gump_work/build_apacheds_apacheds-interceptors-changelog-test.html
Work Name: build_apacheds_apacheds-interceptors-changelog-test (Type: Build)
Work ended in a state of : Failed
Elapsed: 12 secs
Command Line: /opt/maven3/bin/mvn --batch-mode --settings /srv/gump/public/workspace/apacheds/interceptors/changelog/gump_mvn_settings.xml install 
[Working Directory: /srv/gump/public/workspace/apacheds/interceptors/changelog]
M2_HOME: /opt/maven3
---------------------------------------------
[INFO] Copying 3 resources
[INFO] 
[INFO] --- maven-compiler-plugin:2.3.2:compile (default-compile) @ apacheds-interceptors-changelog ---
[INFO] Compiling 1 source file to /srv/gump/public/workspace/apacheds/interceptors/changelog/target/classes
[INFO] 
[INFO] --- maven-resources-plugin:2.5:testResources (default-testResources) @ apacheds-interceptors-changelog ---
[debug] execute contextualize
[INFO] Using 'UTF-8' encoding to copy filtered resources.
[INFO] skip non existing resourceDirectory /srv/gump/public/workspace/apacheds/interceptors/changelog/src/test/resources
[INFO] Copying 3 resources
[INFO] 
[INFO] --- maven-compiler-plugin:2.3.2:testCompile (default-testCompile) @ apacheds-interceptors-changelog ---
[INFO] Nothing to compile - all classes are up to date
[INFO] 
[INFO] --- maven-surefire-plugin:2.10:test (default-test) @ apacheds-interceptors-changelog ---
[INFO] Surefire report directory: /srv/gump/public/workspace/apacheds/interceptors/changelog/target/surefire-reports

-------------------------------------------------------
 T E S T S
-------------------------------------------------------
Running org.apache.directory.server.core.changelog.MemoryChangeLogStoreTest
log4j:WARN No appenders could be found for logger (org.apache.directory.shared.ldap.schemaloader.JarLdifSchemaLoader).
log4j:WARN Please initialize the log4j system properly.
log4j:WARN See http://logging.apache.org/log4j/1.2/faq.html#noconfig for more info.
Tests run: 1, Failures: 0, Errors: 1, Skipped: 0, Time elapsed: 0.364 sec <<< FAILURE!

Results :

Tests in error: 
  org.apache.directory.server.core.changelog.MemoryChangeLogStoreTest: org/apache/commons/collections/MultiMap

Tests run: 1, Failures: 0, Errors: 1, Skipped: 0

[INFO] ------------------------------------------------------------------------
[INFO] BUILD FAILURE
[INFO] ------------------------------------------------------------------------
[INFO] Total time: 10.628s
[INFO] Finished at: Tue Jan 10 19:51:34 UTC 2012
[INFO] Final Memory: 14M/33M
[INFO] ------------------------------------------------------------------------
[ERROR] Failed to execute goal org.apache.maven.plugins:maven-surefire-plugin:2.10:test (default-test) on project apacheds-interceptors-changelog: There are test failures.
[ERROR] 
[ERROR] Please refer to /srv/gump/public/workspace/apacheds/interceptors/changelog/target/surefire-reports for the individual test results.
[ERROR] -> [Help 1]
[ERROR] 
[ERROR] To see the full stack trace of the errors, re-run Maven with the -e switch.
[ERROR] Re-run Maven using the -X switch to enable full debug logging.
[ERROR] 
[ERROR] For more information about the errors and possible solutions, please read the following articles:
[ERROR] [Help 1] http://cwiki.apache.org/confluence/display/MAVEN/MojoFailureException
---------------------------------------------

To subscribe to this information via syndicated feeds:
- RSS: http://vmgump.apache.org/gump/public/apacheds/apacheds-interceptors-changelog-test/rss.xml
- Atom: http://vmgump.apache.org/gump/public/apacheds/apacheds-interceptors-changelog-test/atom.xml

============================== Gump Tracking Only ===
Produced by Apache Gump(TM) version 2.3.
Gump Run 06001210012012, vmgump.apache.org:vmgump:06001210012012
Gump E-mail Identifier (unique within run) #5.

*********************************************************** G U M P
[GUMP@vmgump]: Project apacheds-interceptors-normalization-test (in module apacheds) failed
To whom it may engage...
        
This is an automated request, but not an unsolicited one. For 
more information please visit http://gump.apache.org/nagged.html, 
and/or contact the folk at general@gump.apache.org.

Project apacheds-interceptors-normalization-test has an issue affecting its community integration.
This issue affects 1 projects.
The current state of this project is 'Failed', with reason 'Build Failed'.
For reference only, the following projects are affected by this:
    - apacheds-interceptors-normalization-test :  Apache Directory Server


Full details are available at:
    http://vmgump.apache.org/gump/public/apacheds/apacheds-interceptors-normalization-test/index.html

That said, some information snippets are provided here.

The following annotations (debug/informational/warning/error messages) were provided:
 -WARNING- Overriding Maven settings: [/srv/gump/public/workspace/apacheds/interceptors/normalization/gump_mvn_settings.xml]
 -DEBUG- (Apache Gump generated) Apache Maven Settings in: /srv/gump/public/workspace/apacheds/interceptors/normalization/gump_mvn_settings.xml
 -INFO- Failed with reason build failed
 -DEBUG- Maven POM in: /srv/gump/public/workspace/apacheds/interceptors/normalization/pom.xml
 -INFO- Project Reports in: /srv/gump/public/workspace/apacheds/interceptors/normalization/target/surefire-reports



The following work was performed:
http://vmgump.apache.org/gump/public/apacheds/apacheds-interceptors-normalization-test/gump_work/build_apacheds_apacheds-interceptors-normalization-test.html
Work Name: build_apacheds_apacheds-interceptors-normalization-test (Type: Build)
Work ended in a state of : Failed
Elapsed: 11 secs
Command Line: /opt/maven3/bin/mvn --batch-mode --settings /srv/gump/public/workspace/apacheds/interceptors/normalization/gump_mvn_settings.xml install 
[Working Directory: /srv/gump/public/workspace/apacheds/interceptors/normalization]
M2_HOME: /opt/maven3
---------------------------------------------
[INFO] Copying 3 resources
[INFO] 
[INFO] --- maven-compiler-plugin:2.3.2:compile (default-compile) @ apacheds-interceptors-normalization ---
[INFO] Nothing to compile - all classes are up to date
[INFO] 
[INFO] --- maven-resources-plugin:2.5:testResources (default-testResources) @ apacheds-interceptors-normalization ---
[debug] execute contextualize
[INFO] Using 'UTF-8' encoding to copy filtered resources.
[INFO] skip non existing resourceDirectory /srv/gump/public/workspace/apacheds/interceptors/normalization/src/test/resources
[INFO] Copying 3 resources
[INFO] 
[INFO] --- maven-compiler-plugin:2.3.2:testCompile (default-testCompile) @ apacheds-interceptors-normalization ---
[INFO] Nothing to compile - all classes are up to date
[INFO] 
[INFO] --- maven-surefire-plugin:2.10:test (default-test) @ apacheds-interceptors-normalization ---
[INFO] Surefire report directory: /srv/gump/public/workspace/apacheds/interceptors/normalization/target/surefire-reports

-------------------------------------------------------
 T E S T S
-------------------------------------------------------
Running org.apache.directory.server.core.normalization.NormalizationVisitorTest
log4j:WARN No appenders could be found for logger (org.apache.directory.shared.ldap.schemaloader.JarLdifSchemaLoader).
log4j:WARN Please initialize the log4j system properly.
log4j:WARN See http://logging.apache.org/log4j/1.2/faq.html#noconfig for more info.
Tests run: 1, Failures: 0, Errors: 1, Skipped: 0, Time elapsed: 0.357 sec <<< FAILURE!

Results :

Tests in error: 
  org.apache.directory.server.core.normalization.NormalizationVisitorTest: org/apache/commons/collections/MultiMap

Tests run: 1, Failures: 0, Errors: 1, Skipped: 0

[INFO] ------------------------------------------------------------------------
[INFO] BUILD FAILURE
[INFO] ------------------------------------------------------------------------
[INFO] Total time: 9.110s
[INFO] Finished at: Tue Jan 10 19:52:24 UTC 2012
[INFO] Final Memory: 10M/25M
[INFO] ------------------------------------------------------------------------
[ERROR] Failed to execute goal org.apache.maven.plugins:maven-surefire-plugin:2.10:test (default-test) on project apacheds-interceptors-normalization: There are test failures.
[ERROR] 
[ERROR] Please refer to /srv/gump/public/workspace/apacheds/interceptors/normalization/target/surefire-reports for the individual test results.
[ERROR] -> [Help 1]
[ERROR] 
[ERROR] To see the full stack trace of the errors, re-run Maven with the -e switch.
[ERROR] Re-run Maven using the -X switch to enable full debug logging.
[ERROR] 
[ERROR] For more information about the errors and possible solutions, please read the following articles:
[ERROR] [Help 1] http://cwiki.apache.org/confluence/display/MAVEN/MojoFailureException
---------------------------------------------

To subscribe to this information via syndicated feeds:
- RSS: http://vmgump.apache.org/gump/public/apacheds/apacheds-interceptors-normalization-test/rss.xml
- Atom: http://vmgump.apache.org/gump/public/apacheds/apacheds-interceptors-normalization-test/atom.xml

============================== Gump Tracking Only ===
Produced by Apache Gump(TM) version 2.3.
Gump Run 06001210012012, vmgump.apache.org:vmgump:06001210012012
Gump E-mail Identifier (unique within run) #6.

*********************************************************** G U M P
[GUMP@vmgump]: Project apacheds-interceptors-schema-test (in module apacheds) failed
To whom it may engage...
        
This is an automated request, but not an unsolicited one. For 
more information please visit http://gump.apache.org/nagged.html, 
and/or contact the folk at general@gump.apache.org.

Project apacheds-interceptors-schema-test has an issue affecting its community integration.
This issue affects 1 projects.
The current state of this project is 'Failed', with reason 'Build Failed'.
For reference only, the following projects are affected by this:
    - apacheds-interceptors-schema-test :  Apache Directory Server


Full details are available at:
    http://vmgump.apache.org/gump/public/apacheds/apacheds-interceptors-schema-test/index.html

That said, some information snippets are provided here.

The following annotations (debug/informational/warning/error messages) were provided:
 -WARNING- Overriding Maven settings: [/srv/gump/public/workspace/apacheds/interceptors/schema/gump_mvn_settings.xml]
 -DEBUG- (Apache Gump generated) Apache Maven Settings in: /srv/gump/public/workspace/apacheds/interceptors/schema/gump_mvn_settings.xml
 -INFO- Failed with reason build failed
 -DEBUG- Maven POM in: /srv/gump/public/workspace/apacheds/interceptors/schema/pom.xml
 -INFO- Project Reports in: /srv/gump/public/workspace/apacheds/interceptors/schema/target/surefire-reports



The following work was performed:
http://vmgump.apache.org/gump/public/apacheds/apacheds-interceptors-schema-test/gump_work/build_apacheds_apacheds-interceptors-schema-test.html
Work Name: build_apacheds_apacheds-interceptors-schema-test (Type: Build)
Work ended in a state of : Failed
Elapsed: 13 secs
Command Line: /opt/maven3/bin/mvn --batch-mode --settings /srv/gump/public/workspace/apacheds/interceptors/schema/gump_mvn_settings.xml install 
[Working Directory: /srv/gump/public/workspace/apacheds/interceptors/schema]
M2_HOME: /opt/maven3
---------------------------------------------
[INFO] Copying 3 resources
[INFO] 
[INFO] --- maven-compiler-plugin:2.3.2:compile (default-compile) @ apacheds-interceptors-schema ---
[INFO] Compiling 1 source file to /srv/gump/public/workspace/apacheds/interceptors/schema/target/classes
[INFO] 
[INFO] --- maven-resources-plugin:2.5:testResources (default-testResources) @ apacheds-interceptors-schema ---
[debug] execute contextualize
[INFO] Using 'UTF-8' encoding to copy filtered resources.
[INFO] skip non existing resourceDirectory /srv/gump/public/workspace/apacheds/interceptors/schema/src/test/resources
[INFO] Copying 3 resources
[INFO] 
[INFO] --- maven-compiler-plugin:2.3.2:testCompile (default-testCompile) @ apacheds-interceptors-schema ---
[INFO] Nothing to compile - all classes are up to date
[INFO] 
[INFO] --- maven-surefire-plugin:2.10:test (default-test) @ apacheds-interceptors-schema ---
[INFO] Surefire report directory: /srv/gump/public/workspace/apacheds/interceptors/schema/target/surefire-reports

-------------------------------------------------------
 T E S T S
-------------------------------------------------------
Running org.apache.directory.server.core.schema.SchemaServiceTest
log4j:WARN No appenders could be found for logger (org.apache.directory.shared.ldap.schemaextractor.impl.DefaultSchemaLdifExtractor).
log4j:WARN Please initialize the log4j system properly.
log4j:WARN See http://logging.apache.org/log4j/1.2/faq.html#noconfig for more info.
Tests run: 1, Failures: 0, Errors: 1, Skipped: 0, Time elapsed: 1.042 sec <<< FAILURE!

Results :

Tests in error: 
  org.apache.directory.server.core.schema.SchemaServiceTest: org/apache/commons/collections/MultiMap

Tests run: 1, Failures: 0, Errors: 1, Skipped: 0

[INFO] ------------------------------------------------------------------------
[INFO] BUILD FAILURE
[INFO] ------------------------------------------------------------------------
[INFO] Total time: 11.202s
[INFO] Finished at: Tue Jan 10 19:52:37 UTC 2012
[INFO] Final Memory: 14M/34M
[INFO] ------------------------------------------------------------------------
[ERROR] Failed to execute goal org.apache.maven.plugins:maven-surefire-plugin:2.10:test (default-test) on project apacheds-interceptors-schema: There are test failures.
[ERROR] 
[ERROR] Please refer to /srv/gump/public/workspace/apacheds/interceptors/schema/target/surefire-reports for the individual test results.
[ERROR] -> [Help 1]
[ERROR] 
[ERROR] To see the full stack trace of the errors, re-run Maven with the -e switch.
[ERROR] Re-run Maven using the -X switch to enable full debug logging.
[ERROR] 
[ERROR] For more information about the errors and possible solutions, please read the following articles:
[ERROR] [Help 1] http://cwiki.apache.org/confluence/display/MAVEN/MojoFailureException
---------------------------------------------

To subscribe to this information via syndicated feeds:
- RSS: http://vmgump.apache.org/gump/public/apacheds/apacheds-interceptors-schema-test/rss.xml
- Atom: http://vmgump.apache.org/gump/public/apacheds/apacheds-interceptors-schema-test/atom.xml

============================== Gump Tracking Only ===
Produced by Apache Gump(TM) version 2.3.
Gump Run 06001210012012, vmgump.apache.org:vmgump:06001210012012
Gump E-mail Identifier (unique within run) #7.

*********************************************************** G U M P
[GUMP@vmgump]: Project apacheds-interceptors-subtree-test (in module apacheds) failed
To whom it may engage...
        
This is an automated request, but not an unsolicited one. For 
more information please visit http://gump.apache.org/nagged.html, 
and/or contact the folk at general@gump.apache.org.

Project apacheds-interceptors-subtree-test has an issue affecting its community integration.
This issue affects 1 projects.
The current state of this project is 'Failed', with reason 'Build Failed'.
For reference only, the following projects are affected by this:
    - apacheds-interceptors-subtree-test :  Apache Directory Server


Full details are available at:
    http://vmgump.apache.org/gump/public/apacheds/apacheds-interceptors-subtree-test/index.html

That said, some information snippets are provided here.

The following annotations (debug/informational/warning/error messages) were provided:
 -WARNING- Overriding Maven settings: [/srv/gump/public/workspace/apacheds/interceptors/subtree/gump_mvn_settings.xml]
 -DEBUG- (Apache Gump generated) Apache Maven Settings in: /srv/gump/public/workspace/apacheds/interceptors/subtree/gump_mvn_settings.xml
 -INFO- Failed with reason build failed
 -DEBUG- Maven POM in: /srv/gump/public/workspace/apacheds/interceptors/subtree/pom.xml
 -INFO- Project Reports in: /srv/gump/public/workspace/apacheds/interceptors/subtree/target/surefire-reports



The following work was performed:
http://vmgump.apache.org/gump/public/apacheds/apacheds-interceptors-subtree-test/gump_work/build_apacheds_apacheds-interceptors-subtree-test.html
Work Name: build_apacheds_apacheds-interceptors-subtree-test (Type: Build)
Work ended in a state of : Failed
Elapsed: 12 secs
Command Line: /opt/maven3/bin/mvn --batch-mode --settings /srv/gump/public/workspace/apacheds/interceptors/subtree/gump_mvn_settings.xml install 
[Working Directory: /srv/gump/public/workspace/apacheds/interceptors/subtree]
M2_HOME: /opt/maven3
---------------------------------------------
[INFO] Using 'UTF-8' encoding to copy filtered resources.
[INFO] skip non existing resourceDirectory /srv/gump/public/workspace/apacheds/interceptors/subtree/src/test/resources
[INFO] Copying 3 resources
[INFO] 
[INFO] --- maven-compiler-plugin:2.3.2:testCompile (default-testCompile) @ apacheds-interceptors-subtree ---
[INFO] Nothing to compile - all classes are up to date
[INFO] 
[INFO] --- maven-surefire-plugin:2.10:test (default-test) @ apacheds-interceptors-subtree ---
[INFO] Surefire report directory: /srv/gump/public/workspace/apacheds/interceptors/subtree/target/surefire-reports

-------------------------------------------------------
 T E S T S
-------------------------------------------------------
Running org.apache.directory.server.core.subtree.RefinementLeafEvaluatorTest
log4j:WARN No appenders could be found for logger (org.apache.directory.shared.ldap.schemaloader.JarLdifSchemaLoader).
log4j:WARN Please initialize the log4j system properly.
log4j:WARN See http://logging.apache.org/log4j/1.2/faq.html#noconfig for more info.
Tests run: 1, Failures: 0, Errors: 1, Skipped: 0, Time elapsed: 0.352 sec <<< FAILURE!
Running org.apache.directory.server.core.subtree.SubtreeEvaluatorTest
Tests run: 2, Failures: 0, Errors: 2, Skipped: 0, Time elapsed: 1.267 sec <<< FAILURE!
Running org.apache.directory.server.core.subtree.RefinementEvaluatorTest
Tests run: 1, Failures: 0, Errors: 1, Skipped: 0, Time elapsed: 0.003 sec <<< FAILURE!

Results :

Tests in error: 
  org.apache.directory.server.core.subtree.RefinementLeafEvaluatorTest: org/apache/commons/collections/MultiMap
  org.apache.directory.server.core.subtree.SubtreeEvaluatorTest: org/apache/commons/collections/MultiMap
  org.apache.directory.server.core.subtree.SubtreeEvaluatorTest
  org.apache.directory.server.core.subtree.RefinementEvaluatorTest: org/apache/commons/collections/MultiMap

Tests run: 4, Failures: 0, Errors: 4, Skipped: 0

[INFO] ------------------------------------------------------------------------
[INFO] BUILD FAILURE
[INFO] ------------------------------------------------------------------------
[INFO] Total time: 10.511s
[INFO] Finished at: Tue Jan 10 19:55:53 UTC 2012
[INFO] Final Memory: 10M/24M
[INFO] ------------------------------------------------------------------------
[ERROR] Failed to execute goal org.apache.maven.plugins:maven-surefire-plugin:2.10:test (default-test) on project apacheds-interceptors-subtree: There are test failures.
[ERROR] 
[ERROR] Please refer to /srv/gump/public/workspace/apacheds/interceptors/subtree/target/surefire-reports for the individual test results.
[ERROR] -> [Help 1]
[ERROR] 
[ERROR] To see the full stack trace of the errors, re-run Maven with the -e switch.
[ERROR] Re-run Maven using the -X switch to enable full debug logging.
[ERROR] 
[ERROR] For more information about the errors and possible solutions, please read the following articles:
[ERROR] [Help 1] http://cwiki.apache.org/confluence/display/MAVEN/MojoFailureException
---------------------------------------------

To subscribe to this information via syndicated feeds:
- RSS: http://vmgump.apache.org/gump/public/apacheds/apacheds-interceptors-subtree-test/rss.xml
- Atom: http://vmgump.apache.org/gump/public/apacheds/apacheds-interceptors-subtree-test/atom.xml

============================== Gump Tracking Only ===
Produced by Apache Gump(TM) version 2.3.
Gump Run 06001210012012, vmgump.apache.org:vmgump:06001210012012
Gump E-mail Identifier (unique within run) #8.

*********************************************************** G U M P
[GUMP@vmgump]: Project apacheds-interceptors-authz-test (in module apacheds) failed
To whom it may engage...
        
This is an automated request, but not an unsolicited one. For 
more information please visit http://gump.apache.org/nagged.html, 
and/or contact the folk at general@gump.apache.org.

Project apacheds-interceptors-authz-test has an issue affecting its community integration.
This issue affects 1 projects.
The current state of this project is 'Failed', with reason 'Build Failed'.
For reference only, the following projects are affected by this:
    - apacheds-interceptors-authz-test :  Apache Directory Server


Full details are available at:
    http://vmgump.apache.org/gump/public/apacheds/apacheds-interceptors-authz-test/index.html

That said, some information snippets are provided here.

The following annotations (debug/informational/warning/error messages) were provided:
 -WARNING- Overriding Maven settings: [/srv/gump/public/workspace/apacheds/interceptors/authz/gump_mvn_settings.xml]
 -DEBUG- (Apache Gump generated) Apache Maven Settings in: /srv/gump/public/workspace/apacheds/interceptors/authz/gump_mvn_settings.xml
 -INFO- Failed with reason build failed
 -DEBUG- Maven POM in: /srv/gump/public/workspace/apacheds/interceptors/authz/pom.xml
 -INFO- Project Reports in: /srv/gump/public/workspace/apacheds/interceptors/authz/target/surefire-reports



The following work was performed:
http://vmgump.apache.org/gump/public/apacheds/apacheds-interceptors-authz-test/gump_work/build_apacheds_apacheds-interceptors-authz-test.html
Work Name: build_apacheds_apacheds-interceptors-authz-test (Type: Build)
Work ended in a state of : Failed
Elapsed: 12 secs
Command Line: /opt/maven3/bin/mvn --batch-mode --settings /srv/gump/public/workspace/apacheds/interceptors/authz/gump_mvn_settings.xml install 
[Working Directory: /srv/gump/public/workspace/apacheds/interceptors/authz]
M2_HOME: /opt/maven3
---------------------------------------------
-------------------------------------------------------
Running org.apache.directory.server.core.authz.support.RelatedProtectedItemFilterTest
log4j:WARN No appenders could be found for logger (org.apache.directory.shared.ldap.schemaloader.JarLdifSchemaLoader).
log4j:WARN Please initialize the log4j system properly.
log4j:WARN See http://logging.apache.org/log4j/1.2/faq.html#noconfig for more info.
Tests run: 1, Failures: 0, Errors: 1, Skipped: 0, Time elapsed: 0.346 sec <<< FAILURE!
Running org.apache.directory.server.core.authz.support.MicroOperationFilterTest
Tests run: 2, Failures: 0, Errors: 0, Skipped: 0, Time elapsed: 0.014 sec
Running org.apache.directory.server.core.authz.support.MostSpecificProtectedItemFilterTest
Tests run: 6, Failures: 0, Errors: 0, Skipped: 0, Time elapsed: 0.026 sec
Running org.apache.directory.server.core.authz.support.HighestPrecedenceFilterTest
Tests run: 3, Failures: 0, Errors: 0, Skipped: 0, Time elapsed: 0.01 sec
Running org.apache.directory.server.core.authz.support.RelatedUserClassFilterTest
Tests run: 1, Failures: 0, Errors: 1, Skipped: 0, Time elapsed: 0.009 sec <<< FAILURE!
Running org.apache.directory.server.core.authz.support.RestrictedByFilterTest
Tests run: 1, Failures: 0, Errors: 1, Skipped: 0, Time elapsed: 0.018 sec <<< FAILURE!
Running org.apache.directory.server.core.authz.support.OperationScopeTest
Tests run: 2, Failures: 0, Errors: 0, Skipped: 0, Time elapsed: 0.019 sec
Running org.apache.directory.server.core.authz.support.MaxValueCountFilterTest
Tests run: 1, Failures: 0, Errors: 1, Skipped: 0, Time elapsed: 0.017 sec <<< FAILURE!
Running org.apache.directory.server.core.authz.support.MostSpecificUserClassFilterTest
Tests run: 6, Failures: 0, Errors: 0, Skipped: 0, Time elapsed: 0.012 sec

Results :

Tests in error: 
  org.apache.directory.server.core.authz.support.RelatedProtectedItemFilterTest: org/apache/commons/collections/MultiMap
  org.apache.directory.server.core.authz.support.RelatedUserClassFilterTest: org/apache/commons/collections/MultiMap
  org.apache.directory.server.core.authz.support.RestrictedByFilterTest: org/apache/commons/collections/MultiMap
  org.apache.directory.server.core.authz.support.MaxValueCountFilterTest: org/apache/commons/collections/MultiMap

Tests run: 23, Failures: 0, Errors: 4, Skipped: 0

[INFO] ------------------------------------------------------------------------
[INFO] BUILD FAILURE
[INFO] ------------------------------------------------------------------------
[INFO] Total time: 10.246s
[INFO] Finished at: Tue Jan 10 19:57:04 UTC 2012
[INFO] Final Memory: 14M/34M
[INFO] ------------------------------------------------------------------------
[ERROR] Failed to execute goal org.apache.maven.plugins:maven-surefire-plugin:2.10:test (default-test) on project apacheds-interceptors-authz: There are test failures.
[ERROR] 
[ERROR] Please refer to /srv/gump/public/workspace/apacheds/interceptors/authz/target/surefire-reports for the individual test results.
[ERROR] -> [Help 1]
[ERROR] 
[ERROR] To see the full stack trace of the errors, re-run Maven with the -e switch.
[ERROR] Re-run Maven using the -X switch to enable full debug logging.
[ERROR] 
[ERROR] For more information about the errors and possible solutions, please read the following articles:
[ERROR] [Help 1] http://cwiki.apache.org/confluence/display/MAVEN/MojoFailureException
---------------------------------------------

To subscribe to this information via syndicated feeds:
- RSS: http://vmgump.apache.org/gump/public/apacheds/apacheds-interceptors-authz-test/rss.xml
- Atom: http://vmgump.apache.org/gump/public/apacheds/apacheds-interceptors-authz-test/atom.xml

============================== Gump Tracking Only ===
Produced by Apache Gump(TM) version 2.3.
Gump Run 06001210012012, vmgump.apache.org:vmgump:06001210012012
Gump E-mail Identifier (unique within run) #9.

*********************************************************** G U M P
[GUMP@vmgump]: Project apacheds-core-jndi (in module apacheds) failed
To whom it may engage...
        
This is an automated request, but not an unsolicited one. For 
more information please visit http://gump.apache.org/nagged.html, 
and/or contact the folk at general@gump.apache.org.

Project apacheds-core-jndi has an issue affecting its community integration.
This issue affects 8 projects.
The current state of this project is 'Failed', with reason 'Build Failed'.
For reference only, the following projects are affected by this:
    - apacheds-all :  Apache Directory Server
    - apacheds-core-jndi :  Apache Directory Server
    - apacheds-protocol-dns :  Apache Directory Server
    - apacheds-server-integ :  Apache Directory Server
    - apacheds-server-integ-test :  Apache Directory Server
    - apacheds-service :  Apache Directory Server
    - apacheds-service-builder :  Apache Directory Server
    - apacheds-wrapper :  Apache Directory Server


Full details are available at:
    http://vmgump.apache.org/gump/public/apacheds/apacheds-core-jndi/index.html

That said, some information snippets are provided here.

The following annotations (debug/informational/warning/error messages) were provided:
 -DEBUG- Sole jar output [apacheds-core-jndi-*[0-9T].jar] identifier set to project name
 -DEBUG- (Apache Gump generated) Apache Maven Settings in: /srv/gump/public/workspace/apacheds/core-jndi/gump_mvn_settings.xml
 -INFO- Failed with reason build failed
 -DEBUG- Maven POM in: /srv/gump/public/workspace/apacheds/core-jndi/pom.xml
 -INFO- Failed to extract fallback artifacts from Gump Repository



The following work was performed:
http://vmgump.apache.org/gump/public/apacheds/apacheds-core-jndi/gump_work/build_apacheds_apacheds-core-jndi.html
Work Name: build_apacheds_apacheds-core-jndi (Type: Build)
Work ended in a state of : Failed
Elapsed: 12 secs
Command Line: /opt/maven3/bin/mvn --batch-mode --settings /srv/gump/public/workspace/apacheds/core-jndi/gump_mvn_settings.xml install 
[Working Directory: /srv/gump/public/workspace/apacheds/core-jndi]
M2_HOME: /opt/maven3
---------------------------------------------
[ERROR] /srv/gump/public/workspace/apacheds/core-jndi/src/main/java/org/apache/directory/server/core/jndi/ServerContext.java:[87,63] package org.apache.directory.shared.ldap.extras.controls.ppolicy does not exist
[ERROR] /srv/gump/public/workspace/apacheds/core-jndi/src/main/java/org/apache/directory/server/core/jndi/ServerContext.java:[88,63] package org.apache.directory.shared.ldap.extras.controls.ppolicy does not exist
[ERROR] /srv/gump/public/workspace/apacheds/core-jndi/src/main/java/org/apache/directory/server/core/jndi/ServerContext.java:[89,63] package org.apache.directory.shared.ldap.extras.controls.ppolicy does not exist
[ERROR] /srv/gump/public/workspace/apacheds/core-jndi/src/main/java/org/apache/directory/server/core/jndi/ServerContext.java:[181,26] cannot find symbol
[ERROR] symbol  : variable PasswordPolicy
[ERROR] location: class org.apache.directory.server.core.jndi.ServerContext
[ERROR] /srv/gump/public/workspace/apacheds/core-jndi/src/main/java/org/apache/directory/server/core/jndi/ServerContext.java:[184,26] cannot find symbol
[ERROR] symbol  : variable SyncDoneValue
[ERROR] location: class org.apache.directory.server.core.jndi.ServerContext
[ERROR] /srv/gump/public/workspace/apacheds/core-jndi/src/main/java/org/apache/directory/server/core/jndi/ServerContext.java:[185,26] cannot find symbol
[ERROR] symbol  : variable SyncInfoValue
[ERROR] location: class org.apache.directory.server.core.jndi.ServerContext
[ERROR] /srv/gump/public/workspace/apacheds/core-jndi/src/main/java/org/apache/directory/server/core/jndi/ServerContext.java:[186,26] cannot find symbol
[ERROR] symbol  : variable SyncRequestValue
[ERROR] location: class org.apache.directory.server.core.jndi.ServerContext
[ERROR] /srv/gump/public/workspace/apacheds/core-jndi/src/main/java/org/apache/directory/server/core/jndi/ServerContext.java:[187,26] cannot find symbol
[ERROR] symbol  : variable SyncStateValue
[ERROR] location: class org.apache.directory.server.core.jndi.ServerContext
[ERROR] /srv/gump/public/workspace/apacheds/core-jndi/src/main/java/org/apache/directory/server/core/jndi/ServerContext.java:[414,28] cannot find symbol
[ERROR] symbol  : class PasswordPolicyImpl
[ERROR] location: class org.apache.directory.server.core.jndi.ServerContext
[ERROR] /srv/gump/public/workspace/apacheds/core-jndi/src/main/java/org/apache/directory/server/core/jndi/ServerContext.java:[413,30] cannot access org.apache.directory.shared.ldap.extras.controls.ppolicy.PasswordPolicy
[ERROR] class file for org.apache.directory.shared.ldap.extras.controls.ppolicy.PasswordPolicy not found
[ERROR] control = new PasswordPolicyDecorator( getDirectoryService().getLdapCodecService(),
[ERROR] /srv/gump/public/workspace/apacheds/core-jndi/src/main/java/org/apache/directory/server/core/jndi/ServerContext.java:[419,28] cannot find symbol
[ERROR] symbol  : class PasswordPolicyImpl
[ERROR] location: class org.apache.directory.server.core.jndi.ServerContext
[ERROR] /srv/gump/public/workspace/apacheds/core-jndi/src/main/java/org/apache/directory/server/core/jndi/ServerContext.java:[419,52] cannot find symbol
[ERROR] symbol  : class PasswordPolicyResponseImpl
[ERROR] location: class org.apache.directory.server.core.jndi.ServerContext
[ERROR] /srv/gump/public/workspace/apacheds/core-jndi/src/main/java/org/apache/directory/server/core/jndi/ServerContext.java:[418,30] internal error; cannot instantiate PasswordPolicyDecorator(org.apache.directory.shared.ldap.codec.api.LdapApiService,boolean) at org.apache.directory.shared.ldap.extras.controls.ppolicy_impl.PasswordPolicyDecorator to ()
[ERROR] /srv/gump/public/workspace/apacheds/core-jndi/src/main/java/org/apache/directory/server/core/jndi/ServerContext.java:[435,26] cannot access org.apache.directory.shared.ldap.extras.controls.SyncDoneValue
[ERROR] class file for org.apache.directory.shared.ldap.extras.controls.SyncDoneValue not found
[ERROR] control = new SyncDoneValueDecorator( getDirectoryService().getLdapCodecService() );
[ERROR] /srv/gump/public/workspace/apacheds/core-jndi/src/main/java/org/apache/directory/server/core/jndi/ServerContext.java:[440,26] cannot access org.apache.directory.shared.ldap.extras.controls.SyncInfoValue
[ERROR] class file for org.apache.directory.shared.ldap.extras.controls.SyncInfoValue not found
[ERROR] control = new SyncInfoValueDecorator( getDirectoryService().getLdapCodecService() );
[ERROR] /srv/gump/public/workspace/apacheds/core-jndi/src/main/java/org/apache/directory/server/core/jndi/ServerContext.java:[445,26] cannot access org.apache.directory.shared.ldap.extras.controls.SyncRequestValue
[ERROR] class file for org.apache.directory.shared.ldap.extras.controls.SyncRequestValue not found
[ERROR] control = new SyncRequestValueDecorator( getDirectoryService().getLdapCodecService() );
[ERROR] /srv/gump/public/workspace/apacheds/core-jndi/src/main/java/org/apache/directory/server/core/jndi/ServerContext.java:[450,26] cannot access org.apache.directory.shared.ldap.extras.controls.SyncStateValue
[ERROR] class file for org.apache.directory.shared.ldap.extras.controls.SyncStateValue not found
[ERROR] control = new SyncStateValueDecorator( getDirectoryService().getLdapCodecService() );
[ERROR] -> [Help 1]
[ERROR] 
[ERROR] To see the full stack trace of the errors, re-run Maven with the -e switch.
[ERROR] Re-run Maven using the -X switch to enable full debug logging.
[ERROR] 
[ERROR] For more information about the errors and possible solutions, please read the following articles:
[ERROR] [Help 1] http://cwiki.apache.org/confluence/display/MAVEN/MojoFailureException
---------------------------------------------

To subscribe to this information via syndicated feeds:
- RSS: http://vmgump.apache.org/gump/public/apacheds/apacheds-core-jndi/rss.xml
- Atom: http://vmgump.apache.org/gump/public/apacheds/apacheds-core-jndi/atom.xml

============================== Gump Tracking Only ===
Produced by Apache Gump(TM) version 2.3.
Gump Run 06001210012012, vmgump.apache.org:vmgump:06001210012012
Gump E-mail Identifier (unique within run) #10.

*********************************************************** G U M P
[GUMP@vmgump]: Project apacheds-core-test (in module apacheds) failed
To whom it may engage...
        
This is an automated request, but not an unsolicited one. For 
more information please visit http://gump.apache.org/nagged.html, 
and/or contact the folk at general@gump.apache.org.

Project apacheds-core-test has an issue affecting its community integration.
This issue affects 1 projects.
The current state of this project is 'Failed', with reason 'Build Failed'.
For reference only, the following projects are affected by this:
    - apacheds-core-test :  Apache Directory Server


Full details are available at:
    http://vmgump.apache.org/gump/public/apacheds/apacheds-core-test/index.html

That said, some information snippets are provided here.

The following annotations (debug/informational/warning/error messages) were provided:
 -WARNING- Overriding Maven settings: [/srv/gump/public/workspace/apacheds/core/gump_mvn_settings.xml]
 -DEBUG- (Apache Gump generated) Apache Maven Settings in: /srv/gump/public/workspace/apacheds/core/gump_mvn_settings.xml
 -INFO- Failed with reason build failed
 -DEBUG- Maven POM in: /srv/gump/public/workspace/apacheds/core/pom.xml
 -INFO- Project Reports in: /srv/gump/public/workspace/apacheds/core/target/surefire-reports



The following work was performed:
http://vmgump.apache.org/gump/public/apacheds/apacheds-core-test/gump_work/build_apacheds_apacheds-core-test.html
Work Name: build_apacheds_apacheds-core-test (Type: Build)
Work ended in a state of : Failed
Elapsed: 16 secs
Command Line: /opt/maven3/bin/mvn --batch-mode --settings /srv/gump/public/workspace/apacheds/core/gump_mvn_settings.xml package 
[Working Directory: /srv/gump/public/workspace/apacheds/core]
M2_HOME: /opt/maven3
---------------------------------------------
[INFO] Copying 0 resource
[INFO] Copying 3 resources
[INFO] 
[INFO] --- maven-compiler-plugin:2.3.2:compile (default-compile) @ apacheds-core ---
[INFO] Compiling 1 source file to /srv/gump/public/workspace/apacheds/core/target/classes
[INFO] 
[INFO] --- maven-resources-plugin:2.5:testResources (default-testResources) @ apacheds-core ---
[debug] execute contextualize
[INFO] Using 'UTF-8' encoding to copy filtered resources.
[INFO] Copying 1 resource
[INFO] Copying 3 resources
[INFO] 
[INFO] --- maven-compiler-plugin:2.3.2:testCompile (default-testCompile) @ apacheds-core ---
[INFO] Nothing to compile - all classes are up to date
[INFO] 
[INFO] --- maven-surefire-plugin:2.10:test (default-test) @ apacheds-core ---
[INFO] Surefire report directory: /srv/gump/public/workspace/apacheds/core/target/surefire-reports

-------------------------------------------------------
 T E S T S
-------------------------------------------------------
Running org.apache.directory.server.core.prefs.PreferencesUtilsTest
Tests run: 1, Failures: 0, Errors: 0, Skipped: 0, Time elapsed: 0.11 sec
Running org.apache.directory.server.core.security.TlsKeyGeneratorTest
Tests run: 1, Failures: 0, Errors: 1, Skipped: 0, Time elapsed: 0.824 sec <<< FAILURE!

Results :

Tests in error: 
  org.apache.directory.server.core.security.TlsKeyGeneratorTest: antlr/TokenStream

Tests run: 2, Failures: 0, Errors: 1, Skipped: 0

[INFO] ------------------------------------------------------------------------
[INFO] BUILD FAILURE
[INFO] ------------------------------------------------------------------------
[INFO] Total time: 14.456s
[INFO] Finished at: Tue Jan 10 19:59:44 UTC 2012
[INFO] Final Memory: 16M/40M
[INFO] ------------------------------------------------------------------------
[ERROR] Failed to execute goal org.apache.maven.plugins:maven-surefire-plugin:2.10:test (default-test) on project apacheds-core: There are test failures.
[ERROR] 
[ERROR] Please refer to /srv/gump/public/workspace/apacheds/core/target/surefire-reports for the individual test results.
[ERROR] -> [Help 1]
[ERROR] 
[ERROR] To see the full stack trace of the errors, re-run Maven with the -e switch.
[ERROR] Re-run Maven using the -X switch to enable full debug logging.
[ERROR] 
[ERROR] For more information about the errors and possible solutions, please read the following articles:
[ERROR] [Help 1] http://cwiki.apache.org/confluence/display/MAVEN/MojoFailureException
---------------------------------------------

To subscribe to this information via syndicated feeds:
- RSS: http://vmgump.apache.org/gump/public/apacheds/apacheds-core-test/rss.xml
- Atom: http://vmgump.apache.org/gump/public/apacheds/apacheds-core-test/atom.xml

============================== Gump Tracking Only ===
Produced by Apache Gump(TM) version 2.3.
Gump Run 06001210012012, vmgump.apache.org:vmgump:06001210012012
Gump E-mail Identifier (unique within run) #11.

*********************************************************** G U M P
[GUMP@vmgump]: Project apacheds-ldif-partition-test (in module apacheds) failed
To whom it may engage...
        
This is an automated request, but not an unsolicited one. For 
more information please visit http://gump.apache.org/nagged.html, 
and/or contact the folk at general@gump.apache.org.

Project apacheds-ldif-partition-test has an issue affecting its community integration.
This issue affects 1 projects.
The current state of this project is 'Failed', with reason 'Build Failed'.
For reference only, the following projects are affected by this:
    - apacheds-ldif-partition-test :  Apache Directory Server


Full details are available at:
    http://vmgump.apache.org/gump/public/apacheds/apacheds-ldif-partition-test/index.html

That said, some information snippets are provided here.

The following annotations (debug/informational/warning/error messages) were provided:
 -WARNING- Overriding Maven settings: [/srv/gump/public/workspace/apacheds/ldif-partition/gump_mvn_settings.xml]
 -DEBUG- (Apache Gump generated) Apache Maven Settings in: /srv/gump/public/workspace/apacheds/ldif-partition/gump_mvn_settings.xml
 -INFO- Failed with reason build failed
 -DEBUG- Maven POM in: /srv/gump/public/workspace/apacheds/ldif-partition/pom.xml
 -INFO- Project Reports in: /srv/gump/public/workspace/apacheds/core/target/surefire-reports



The following work was performed:
http://vmgump.apache.org/gump/public/apacheds/apacheds-ldif-partition-test/gump_work/build_apacheds_apacheds-ldif-partition-test.html
Work Name: build_apacheds_apacheds-ldif-partition-test (Type: Build)
Work ended in a state of : Failed
Elapsed: 12 secs
Command Line: /opt/maven3/bin/mvn --batch-mode --settings /srv/gump/public/workspace/apacheds/ldif-partition/gump_mvn_settings.xml package 
[Working Directory: /srv/gump/public/workspace/apacheds/ldif-partition]
M2_HOME: /opt/maven3
---------------------------------------------
[INFO] Copying 3 resources
[INFO] 
[INFO] --- maven-compiler-plugin:2.3.2:compile (default-compile) @ apacheds-ldif-partition ---
[INFO] Nothing to compile - all classes are up to date
[INFO] 
[INFO] --- maven-resources-plugin:2.5:testResources (default-testResources) @ apacheds-ldif-partition ---
[debug] execute contextualize
[INFO] Using 'UTF-8' encoding to copy filtered resources.
[INFO] Copying 1 resource
[INFO] Copying 3 resources
[INFO] 
[INFO] --- maven-compiler-plugin:2.3.2:testCompile (default-testCompile) @ apacheds-ldif-partition ---
[INFO] Nothing to compile - all classes are up to date
[INFO] 
[INFO] --- maven-surefire-plugin:2.10:test (default-test) @ apacheds-ldif-partition ---
[INFO] Surefire report directory: /srv/gump/public/workspace/apacheds/ldif-partition/target/surefire-reports

-------------------------------------------------------
 T E S T S
-------------------------------------------------------
Running org.apache.directory.server.core.partition.ldif.SingleFileLdifPartitionTest
Tests run: 1, Failures: 0, Errors: 1, Skipped: 0, Time elapsed: 1.201 sec <<< FAILURE!
Running org.apache.directory.server.core.partition.ldif.LdifPartitionTest
Tests run: 1, Failures: 0, Errors: 1, Skipped: 0, Time elapsed: 0.653 sec <<< FAILURE!

Results :

Tests in error: 
  org.apache.directory.server.core.partition.ldif.SingleFileLdifPartitionTest: org/apache/commons/collections/MultiMap
  org.apache.directory.server.core.partition.ldif.LdifPartitionTest: org/apache/commons/collections/MultiMap

Tests run: 2, Failures: 0, Errors: 2, Skipped: 0

[INFO] ------------------------------------------------------------------------
[INFO] BUILD FAILURE
[INFO] ------------------------------------------------------------------------
[INFO] Total time: 10.806s
[INFO] Finished at: Tue Jan 10 20:00:05 UTC 2012
[INFO] Final Memory: 10M/24M
[INFO] ------------------------------------------------------------------------
[ERROR] Failed to execute goal org.apache.maven.plugins:maven-surefire-plugin:2.10:test (default-test) on project apacheds-ldif-partition: There are test failures.
[ERROR] 
[ERROR] Please refer to /srv/gump/public/workspace/apacheds/ldif-partition/target/surefire-reports for the individual test results.
[ERROR] -> [Help 1]
[ERROR] 
[ERROR] To see the full stack trace of the errors, re-run Maven with the -e switch.
[ERROR] Re-run Maven using the -X switch to enable full debug logging.
[ERROR] 
[ERROR] For more information about the errors and possible solutions, please read the following articles:
[ERROR] [Help 1] http://cwiki.apache.org/confluence/display/MAVEN/MojoFailureException
---------------------------------------------

To subscribe to this information via syndicated feeds:
- RSS: http://vmgump.apache.org/gump/public/apacheds/apacheds-ldif-partition-test/rss.xml
- Atom: http://vmgump.apache.org/gump/public/apacheds/apacheds-ldif-partition-test/atom.xml

============================== Gump Tracking Only ===
Produced by Apache Gump(TM) version 2.3.
Gump Run 06001210012012, vmgump.apache.org:vmgump:06001210012012
Gump E-mail Identifier (unique within run) #12.

*********************************************************** G U M P
[GUMP@vmgump]: Project apacheds-server-config (in module apacheds) failed
To whom it may engage...
        
This is an automated request, but not an unsolicited one. For 
more information please visit http://gump.apache.org/nagged.html, 
and/or contact the folk at general@gump.apache.org.

Project apacheds-server-config has an issue affecting its community integration.
This issue affects 1 projects.
The current state of this project is 'Failed', with reason 'Build Failed'.
For reference only, the following projects are affected by this:
    - apacheds-server-config :  Apache Directory Server


Full details are available at:
    http://vmgump.apache.org/gump/public/apacheds/apacheds-server-config/index.html

That said, some information snippets are provided here.

The following annotations (debug/informational/warning/error messages) were provided:
 -DEBUG- Sole jar output [apacheds-server-config-*[0-9T].jar] identifier set to project name
 -DEBUG- (Apache Gump generated) Apache Maven Settings in: /srv/gump/public/workspace/apacheds/server-config/gump_mvn_settings.xml
 -INFO- Failed with reason build failed
 -DEBUG- Maven POM in: /srv/gump/public/workspace/apacheds/server-config/pom.xml
 -INFO- Failed to extract fallback artifacts from Gump Repository



The following work was performed:
http://vmgump.apache.org/gump/public/apacheds/apacheds-server-config/gump_work/build_apacheds_apacheds-server-config.html
Work Name: build_apacheds_apacheds-server-config (Type: Build)
Work ended in a state of : Failed
Elapsed: 21 secs
Command Line: /opt/maven3/bin/mvn --batch-mode --settings /srv/gump/public/workspace/apacheds/server-config/gump_mvn_settings.xml install 
[Working Directory: /srv/gump/public/workspace/apacheds/server-config]
M2_HOME: /opt/maven3
---------------------------------------------
Tests run: 1, Failures: 0, Errors: 1, Skipped: 0, Time elapsed: 1.493 sec <<< FAILURE!
Running org.apache.directory.server.config.LdapServerConfigReaderTest
Tests run: 1, Failures: 0, Errors: 1, Skipped: 0, Time elapsed: 0.536 sec <<< FAILURE!
Running org.apache.directory.server.config.DnsServerConfigReaderTest
Tests run: 1, Failures: 0, Errors: 1, Skipped: 0, Time elapsed: 0.606 sec <<< FAILURE!
Running org.apache.directory.server.config.HttpServerConfigReaderTest
Tests run: 1, Failures: 0, Errors: 1, Skipped: 0, Time elapsed: 0.479 sec <<< FAILURE!
Running org.apache.directory.server.config.DhcpServerConfigReaderTest
Tests run: 1, Failures: 0, Errors: 1, Skipped: 0, Time elapsed: 0.318 sec <<< FAILURE!
Running org.apache.directory.server.config.ChangePasswordConfigReaderTest
Tests run: 1, Failures: 0, Errors: 1, Skipped: 0, Time elapsed: 0.474 sec <<< FAILURE!
Running org.apache.directory.server.config.KerberosServerConfigReaderTest
Tests run: 1, Failures: 0, Errors: 1, Skipped: 0, Time elapsed: 0.35 sec <<< FAILURE!
Running org.apache.directory.server.config.NtpServerConfigReaderTest
Tests run: 1, Failures: 0, Errors: 1, Skipped: 0, Time elapsed: 0.591 sec <<< FAILURE!
Running org.apache.directory.server.config.ConfigWriterTest
Tests run: 1, Failures: 0, Errors: 1, Skipped: 0, Time elapsed: 0.465 sec <<< FAILURE!

Results :

Tests in error: 
  org.apache.directory.server.config.ConfigPartitionReaderTest: org/apache/commons/collections/MultiMap
  org.apache.directory.server.config.LdapServerConfigReaderTest: org/apache/commons/collections/MultiMap
  org.apache.directory.server.config.DnsServerConfigReaderTest: org/apache/commons/collections/MultiMap
  org.apache.directory.server.config.HttpServerConfigReaderTest: org/apache/commons/collections/MultiMap
  org.apache.directory.server.config.DhcpServerConfigReaderTest: org/apache/commons/collections/MultiMap
  org.apache.directory.server.config.ChangePasswordConfigReaderTest: org/apache/commons/collections/MultiMap
  org.apache.directory.server.config.KerberosServerConfigReaderTest: org/apache/commons/collections/MultiMap
  org.apache.directory.server.config.NtpServerConfigReaderTest: org/apache/commons/collections/MultiMap
  org.apache.directory.server.config.ConfigWriterTest: org/apache/commons/collections/MultiMap

Tests run: 9, Failures: 0, Errors: 9, Skipped: 0

[INFO] ------------------------------------------------------------------------
[INFO] BUILD FAILURE
[INFO] ------------------------------------------------------------------------
[INFO] Total time: 19.865s
[INFO] Finished at: Tue Jan 10 20:01:12 UTC 2012
[INFO] Final Memory: 17M/46M
[INFO] ------------------------------------------------------------------------
[ERROR] Failed to execute goal org.apache.maven.plugins:maven-surefire-plugin:2.10:test (default-test) on project apacheds-server-config: There are test failures.
[ERROR] 
[ERROR] Please refer to /srv/gump/public/workspace/apacheds/server-config/target/surefire-reports for the individual test results.
[ERROR] -> [Help 1]
[ERROR] 
[ERROR] To see the full stack trace of the errors, re-run Maven with the -e switch.
[ERROR] Re-run Maven using the -X switch to enable full debug logging.
[ERROR] 
[ERROR] For more information about the errors and possible solutions, please read the following articles:
[ERROR] [Help 1] http://cwiki.apache.org/confluence/display/MAVEN/MojoFailureException
---------------------------------------------

To subscribe to this information via syndicated feeds:
- RSS: http://vmgump.apache.org/gump/public/apacheds/apacheds-server-config/rss.xml
- Atom: http://vmgump.apache.org/gump/public/apacheds/apacheds-server-config/atom.xml

============================== Gump Tracking Only ===
Produced by Apache Gump(TM) version 2.3.
Gump Run 06001210012012, vmgump.apache.org:vmgump:06001210012012
Gump E-mail Identifier (unique within run) #13.

*********************************************************** G U M P
[GUMP@vmgump]: Project apacheds-core-annotations-test (in module apacheds) failed
To whom it may engage...
        
This is an automated request, but not an unsolicited one. For 
more information please visit http://gump.apache.org/nagged.html, 
and/or contact the folk at general@gump.apache.org.

Project apacheds-core-annotations-test has an issue affecting its community integration.
This issue affects 1 projects.
The current state of this project is 'Failed', with reason 'Build Failed'.
For reference only, the following projects are affected by this:
    - apacheds-core-annotations-test :  Apache Directory Server


Full details are available at:
    http://vmgump.apache.org/gump/public/apacheds/apacheds-core-annotations-test/index.html

That said, some information snippets are provided here.

The following annotations (debug/informational/warning/error messages) were provided:
 -WARNING- Overriding Maven settings: [/srv/gump/public/workspace/apacheds/core-annotations/gump_mvn_settings.xml]
 -DEBUG- (Apache Gump generated) Apache Maven Settings in: /srv/gump/public/workspace/apacheds/core-annotations/gump_mvn_settings.xml
 -INFO- Failed with reason build failed
 -DEBUG- Maven POM in: /srv/gump/public/workspace/apacheds/core-annotations/pom.xml



The following work was performed:
http://vmgump.apache.org/gump/public/apacheds/apacheds-core-annotations-test/gump_work/build_apacheds_apacheds-core-annotations-test.html
Work Name: build_apacheds_apacheds-core-annotations-test (Type: Build)
Work ended in a state of : Failed
Elapsed: 15 secs
Command Line: /opt/maven3/bin/mvn --batch-mode --settings /srv/gump/public/workspace/apacheds/core-annotations/gump_mvn_settings.xml package 
[Working Directory: /srv/gump/public/workspace/apacheds/core-annotations]
M2_HOME: /opt/maven3
---------------------------------------------
[INFO] Nothing to compile - all classes are up to date
[INFO] 
[INFO] --- maven-resources-plugin:2.5:testResources (default-testResources) @ apacheds-core-annotations ---
[debug] execute contextualize
[INFO] Using 'UTF-8' encoding to copy filtered resources.
[INFO] Copying 1 resource
[INFO] Copying 3 resources
[INFO] 
[INFO] --- maven-compiler-plugin:2.3.2:testCompile (default-testCompile) @ apacheds-core-annotations ---
[INFO] Nothing to compile - all classes are up to date
[INFO] 
[INFO] --- maven-surefire-plugin:2.10:test (default-test) @ apacheds-core-annotations ---
[INFO] Surefire report directory: /srv/gump/public/workspace/apacheds/core-annotations/target/surefire-reports

-------------------------------------------------------
 T E S T S
-------------------------------------------------------
Running org.apache.directory.server.core.factory.DirectoryServiceAnnotationTest
Tests run: 4, Failures: 0, Errors: 4, Skipped: 0, Time elapsed: 0.423 sec <<< FAILURE!
Running org.apache.directory.server.core.factory.DirectoryServiceFactoryTest
Tests run: 1, Failures: 0, Errors: 1, Skipped: 0, Time elapsed: 0.009 sec <<< FAILURE!

Results :

Tests in error: 
  testCreateDS(org.apache.directory.server.core.factory.DirectoryServiceAnnotationTest): org/apache/directory/shared/asn1/ber/Asn1Container
  testCreateMethodDS(org.apache.directory.server.core.factory.DirectoryServiceAnnotationTest): org/apache/directory/shared/asn1/ber/Asn1Container
  testCreateMethodDSWithPartition(org.apache.directory.server.core.factory.DirectoryServiceAnnotationTest): org/apache/directory/shared/asn1/ber/Asn1Container
  testCreateMethodDSWithAvlPartition(org.apache.directory.server.core.factory.DirectoryServiceAnnotationTest): org/apache/directory/shared/asn1/ber/Asn1Container
  testCreateDS(org.apache.directory.server.core.factory.DirectoryServiceFactoryTest): org/apache/directory/shared/asn1/ber/Asn1Container

Tests run: 5, Failures: 0, Errors: 5, Skipped: 0

[INFO] ------------------------------------------------------------------------
[INFO] BUILD FAILURE
[INFO] ------------------------------------------------------------------------
[INFO] Total time: 13.883s
[INFO] Finished at: Tue Jan 10 20:02:21 UTC 2012
[INFO] Final Memory: 12M/41M
[INFO] ------------------------------------------------------------------------
[ERROR] Failed to execute goal org.apache.maven.plugins:maven-surefire-plugin:2.10:test (default-test) on project apacheds-core-annotations: There are test failures.
[ERROR] 
[ERROR] Please refer to /srv/gump/public/workspace/apacheds/core-annotations/target/surefire-reports for the individual test results.
[ERROR] -> [Help 1]
[ERROR] 
[ERROR] To see the full stack trace of the errors, re-run Maven with the -e switch.
[ERROR] Re-run Maven using the -X switch to enable full debug logging.
[ERROR] 
[ERROR] For more information about the errors and possible solutions, please read the following articles:
[ERROR] [Help 1] http://cwiki.apache.org/confluence/display/MAVEN/MojoFailureException
---------------------------------------------

To subscribe to this information via syndicated feeds:
- RSS: http://vmgump.apache.org/gump/public/apacheds/apacheds-core-annotations-test/rss.xml
- Atom: http://vmgump.apache.org/gump/public/apacheds/apacheds-core-annotations-test/atom.xml

============================== Gump Tracking Only ===
Produced by Apache Gump(TM) version 2.3.
Gump Run 06001210012012, vmgump.apache.org:vmgump:06001210012012
Gump E-mail Identifier (unique within run) #14.

*********************************************************** G U M P
[GUMP@vmgump]: Project apacheds-jdbm-partition-test (in module apacheds) failed
To whom it may engage...
        
This is an automated request, but not an unsolicited one. For 
more information please visit http://gump.apache.org/nagged.html, 
and/or contact the folk at general@gump.apache.org.

Project apacheds-jdbm-partition-test has an issue affecting its community integration.
This issue affects 1 projects.
The current state of this project is 'Failed', with reason 'Build Failed'.
For reference only, the following projects are affected by this:
    - apacheds-jdbm-partition-test :  Apache Directory Server


Full details are available at:
    http://vmgump.apache.org/gump/public/apacheds/apacheds-jdbm-partition-test/index.html

That said, some information snippets are provided here.

The following annotations (debug/informational/warning/error messages) were provided:
 -WARNING- Overriding Maven settings: [/srv/gump/public/workspace/apacheds/jdbm-partition/gump_mvn_settings.xml]
 -DEBUG- (Apache Gump generated) Apache Maven Settings in: /srv/gump/public/workspace/apacheds/jdbm-partition/gump_mvn_settings.xml
 -INFO- Failed with reason build failed
 -DEBUG- Maven POM in: /srv/gump/public/workspace/apacheds/jdbm-partition/pom.xml
 -INFO- Project Reports in: /srv/gump/public/workspace/apacheds/jdbm-partition/target/surefire-reports



The following work was performed:
http://vmgump.apache.org/gump/public/apacheds/apacheds-jdbm-partition-test/gump_work/build_apacheds_apacheds-jdbm-partition-test.html
Work Name: build_apacheds_apacheds-jdbm-partition-test (Type: Build)
Work ended in a state of : Failed
Elapsed: 16 secs
Command Line: /opt/maven3/bin/mvn --batch-mode --settings /srv/gump/public/workspace/apacheds/jdbm-partition/gump_mvn_settings.xml package 
[Working Directory: /srv/gump/public/workspace/apacheds/jdbm-partition]
M2_HOME: /opt/maven3
---------------------------------------------
Running org.apache.directory.server.core.partition.impl.btree.jdbm.JdbmRdnIndexTest
Tests run: 1, Failures: 0, Errors: 1, Skipped: 0, Time elapsed: 0.396 sec <<< FAILURE!
Running org.apache.directory.server.core.partition.impl.btree.jdbm.KeyBTreeCursorTest
Tests run: 5, Failures: 0, Errors: 0, Skipped: 0, Time elapsed: 0.233 sec
Running org.apache.directory.server.core.partition.impl.btree.jdbm.JdbmMasterTableTest
Tests run: 1, Failures: 0, Errors: 1, Skipped: 0, Time elapsed: 0.118 sec <<< FAILURE!
Running org.apache.directory.server.core.partition.impl.btree.jdbm.KeyCursorTest
Tests run: 5, Failures: 0, Errors: 0, Skipped: 0, Time elapsed: 0.182 sec
Running org.apache.directory.server.core.partition.impl.btree.jdbm.StringSerializerTest
Tests run: 2, Failures: 0, Errors: 0, Skipped: 0, Time elapsed: 0.042 sec
Running org.apache.directory.server.core.partition.impl.btree.jdbm.JdbmIndexTest
Tests run: 1, Failures: 0, Errors: 1, Skipped: 0, Time elapsed: 0.123 sec <<< FAILURE!
Running org.apache.directory.server.core.partition.impl.btree.jdbm.JdbmBrowserBugTest
Tests run: 1, Failures: 0, Errors: 0, Skipped: 0, Time elapsed: 0.016 sec

Results :

Tests in error: 
  org.apache.directory.server.core.partition.tree.PartitionTreeTest: org/apache/commons/collections/MultiMap
  org.apache.directory.server.core.partition.impl.btree.jdbm.DupsContainerCursorTest: org/apache/commons/collections/MultiMap
  org.apache.directory.server.core.partition.impl.btree.jdbm.JdbmTableWithDuplicatesTest: org/apache/commons/collections/MultiMap
  org.apache.directory.server.core.partition.impl.btree.jdbm.NoDupsCursorTest: org/apache/commons/collections/MultiMap
  org.apache.directory.server.core.partition.impl.btree.jdbm.DupsCursorTest: org/apache/commons/collections/MultiMap
  org.apache.directory.server.core.partition.impl.btree.jdbm.JdbmTableNoDuplicatesTest: org/apache/commons/collections/MultiMap
  org.apache.directory.server.core.partition.impl.btree.jdbm.KeyTupleBTreeCursorTest: org/apache/commons/collections/MultiMap
  org.apache.directory.server.core.partition.impl.btree.jdbm.JdbmStoreTest: org/apache/commons/collections/MultiMap
  org.apache.directory.server.core.partition.impl.btree.jdbm.ServerEntrySerializerTest: org/apache/commons/collections/MultiMap
  org.apache.directory.server.core.partition.impl.btree.jdbm.JdbmRdnIndexTest: org/apache/commons/collections/MultiMap
  testAll(org.apache.directory.server.core.partition.impl.btree.jdbm.JdbmMasterTableTest): org/apache/commons/collections/MultiMap
  org.apache.directory.server.core.partition.impl.btree.jdbm.JdbmIndexTest: org/apache/commons/collections/MultiMap

Tests run: 34, Failures: 0, Errors: 12, Skipped: 0

[INFO] ------------------------------------------------------------------------
[INFO] BUILD FAILURE
[INFO] ------------------------------------------------------------------------
[INFO] Total time: 14.743s
[INFO] Finished at: Tue Jan 10 20:02:38 UTC 2012
[INFO] Final Memory: 10M/25M
[INFO] ------------------------------------------------------------------------
[ERROR] Failed to execute goal org.apache.maven.plugins:maven-surefire-plugin:2.10:test (default-test) on project apacheds-jdbm-partition: There are test failures.
[ERROR] 
[ERROR] Please refer to /srv/gump/public/workspace/apacheds/jdbm-partition/target/surefire-reports for the individual test results.
[ERROR] -> [Help 1]
[ERROR] 
[ERROR] To see the full stack trace of the errors, re-run Maven with the -e switch.
[ERROR] Re-run Maven using the -X switch to enable full debug logging.
[ERROR] 
[ERROR] For more information about the errors and possible solutions, please read the following articles:
[ERROR] [Help 1] http://cwiki.apache.org/confluence/display/MAVEN/MojoFailureException
---------------------------------------------

To subscribe to this information via syndicated feeds:
- RSS: http://vmgump.apache.org/gump/public/apacheds/apacheds-jdbm-partition-test/rss.xml
- Atom: http://vmgump.apache.org/gump/public/apacheds/apacheds-jdbm-partition-test/atom.xml

============================== Gump Tracking Only ===
Produced by Apache Gump(TM) version 2.3.
Gump Run 06001210012012, vmgump.apache.org:vmgump:06001210012012
Gump E-mail Identifier (unique within run) #15.

*********************************************************** G U M P
[GUMP@vmgump]: Project apacheds-protocol-ldap-test (in module apacheds) failed
To whom it may engage...
        
This is an automated request, but not an unsolicited one. For 
more information please visit http://gump.apache.org/nagged.html, 
and/or contact the folk at general@gump.apache.org.

Project apacheds-protocol-ldap-test has an issue affecting its community integration.
This issue affects 1 projects.
The current state of this project is 'Failed', with reason 'Build Failed'.
For reference only, the following projects are affected by this:
    - apacheds-protocol-ldap-test :  Apache Directory Server


Full details are available at:
    http://vmgump.apache.org/gump/public/apacheds/apacheds-protocol-ldap-test/index.html

That said, some information snippets are provided here.

The following annotations (debug/informational/warning/error messages) were provided:
 -WARNING- Overriding Maven settings: [/srv/gump/public/workspace/apacheds/protocol-ldap/gump_mvn_settings.xml]
 -DEBUG- (Apache Gump generated) Apache Maven Settings in: /srv/gump/public/workspace/apacheds/protocol-ldap/gump_mvn_settings.xml
 -INFO- Failed with reason build failed
 -DEBUG- Maven POM in: /srv/gump/public/workspace/apacheds/protocol-ldap/pom.xml
 -INFO- Project Reports in: /srv/gump/public/workspace/apacheds/protocol-ldap/target/surefire-reports



The following work was performed:
http://vmgump.apache.org/gump/public/apacheds/apacheds-protocol-ldap-test/gump_work/build_apacheds_apacheds-protocol-ldap-test.html
Work Name: build_apacheds_apacheds-protocol-ldap-test (Type: Build)
Work ended in a state of : Failed
Elapsed: 18 secs
Command Line: /opt/maven3/bin/mvn --batch-mode --settings /srv/gump/public/workspace/apacheds/protocol-ldap/gump_mvn_settings.xml install 
[Working Directory: /srv/gump/public/workspace/apacheds/protocol-ldap]
M2_HOME: /opt/maven3
---------------------------------------------
[INFO] Copying 3 resources
[INFO] 
[INFO] --- maven-compiler-plugin:2.3.2:testCompile (default-testCompile) @ apacheds-protocol-ldap ---
[INFO] Nothing to compile - all classes are up to date
[INFO] 
[INFO] --- maven-surefire-plugin:2.10:test (default-test) @ apacheds-protocol-ldap ---
[INFO] Surefire report directory: /srv/gump/public/workspace/apacheds/protocol-ldap/target/surefire-reports

-------------------------------------------------------
 T E S T S
-------------------------------------------------------
Running org.apache.directory.server.ldap.SettingAlternativeHandlersTest
log4j:WARN No appenders could be found for logger (org.apache.directory.shared.ldap.codec.api.LdapApiServiceFactory).
log4j:WARN Please initialize the log4j system properly.
log4j:WARN See http://logging.apache.org/log4j/1.2/faq.html#noconfig for more info.
Tests run: 2, Failures: 0, Errors: 2, Skipped: 0, Time elapsed: 0.25 sec <<< FAILURE!
Running org.apache.directory.server.ldap.LdapServerSettingsTest
Tests run: 3, Failures: 0, Errors: 3, Skipped: 0, Time elapsed: 0.032 sec <<< FAILURE!
Running org.apache.directory.server.ldap.JournalTest
Tests run: 1, Failures: 0, Errors: 1, Skipped: 0, Time elapsed: 1.308 sec <<< FAILURE!

Results :

Tests in error: 
  testAlternativeConfiguration(org.apache.directory.server.ldap.SettingAlternativeHandlersTest)
  testDefaultOperation(org.apache.directory.server.ldap.SettingAlternativeHandlersTest)
  testAddExtendedOperationHandler(org.apache.directory.server.ldap.LdapServerSettingsTest)
  testSetExtendedOperationHandlers(org.apache.directory.server.ldap.LdapServerSettingsTest)
  testSetSaslMechanismHandlers(org.apache.directory.server.ldap.LdapServerSettingsTest)
  org.apache.directory.server.ldap.JournalTest: antlr/RecognitionException

Tests run: 6, Failures: 0, Errors: 6, Skipped: 0

[INFO] ------------------------------------------------------------------------
[INFO] BUILD FAILURE
[INFO] ------------------------------------------------------------------------
[INFO] Total time: 16.393s
[INFO] Finished at: Tue Jan 10 20:03:59 UTC 2012
[INFO] Final Memory: 16M/41M
[INFO] ------------------------------------------------------------------------
[ERROR] Failed to execute goal org.apache.maven.plugins:maven-surefire-plugin:2.10:test (default-test) on project apacheds-protocol-ldap: There are test failures.
[ERROR] 
[ERROR] Please refer to /srv/gump/public/workspace/apacheds/protocol-ldap/target/surefire-reports for the individual test results.
[ERROR] -> [Help 1]
[ERROR] 
[ERROR] To see the full stack trace of the errors, re-run Maven with the -e switch.
[ERROR] Re-run Maven using the -X switch to enable full debug logging.
[ERROR] 
[ERROR] For more information about the errors and possible solutions, please read the following articles:
[ERROR] [Help 1] http://cwiki.apache.org/confluence/display/MAVEN/MojoFailureException
---------------------------------------------

To subscribe to this information via syndicated feeds:
- RSS: http://vmgump.apache.org/gump/public/apacheds/apacheds-protocol-ldap-test/rss.xml
- Atom: http://vmgump.apache.org/gump/public/apacheds/apacheds-protocol-ldap-test/atom.xml

============================== Gump Tracking Only ===
Produced by Apache Gump(TM) version 2.3.
Gump Run 06001210012012, vmgump.apache.org:vmgump:06001210012012
Gump E-mail Identifier (unique within run) #16.

*********************************************************** G U M P
[GUMP@vmgump]: Project apacheds-test-framework (in module apacheds) failed
To whom it may engage...
        
This is an automated request, but not an unsolicited one. For 
more information please visit http://gump.apache.org/nagged.html, 
and/or contact the folk at general@gump.apache.org.

Project apacheds-test-framework has an issue affecting its community integration.
This issue affects 5 projects.
The current state of this project is 'Failed', with reason 'Build Failed'.
For reference only, the following projects are affected by this:
    - apacheds-core-integ :  Apache Directory Server
    - apacheds-core-integ-test :  Apache Directory Server
    - apacheds-kerberos-test :  Apache Directory Server
    - apacheds-ldap-client-test :  Apache Directory Server
    - apacheds-test-framework :  Apache Directory Server


Full details are available at:
    http://vmgump.apache.org/gump/public/apacheds/apacheds-test-framework/index.html

That said, some information snippets are provided here.

The following annotations (debug/informational/warning/error messages) were provided:
 -DEBUG- Sole jar output [apacheds-test-framework-*[0-9T].jar] identifier set to project name
 -DEBUG- (Apache Gump generated) Apache Maven Settings in: /srv/gump/public/workspace/apacheds/test-framework/gump_mvn_settings.xml
 -INFO- Failed with reason build failed
 -DEBUG- Maven POM in: /srv/gump/public/workspace/apacheds/test-framework/pom.xml
 -INFO- Failed to extract fallback artifacts from Gump Repository



The following work was performed:
http://vmgump.apache.org/gump/public/apacheds/apacheds-test-framework/gump_work/build_apacheds_apacheds-test-framework.html
Work Name: build_apacheds_apacheds-test-framework (Type: Build)
Work ended in a state of : Failed
Elapsed: 25 secs
Command Line: /opt/maven3/bin/mvn --batch-mode --settings /srv/gump/public/workspace/apacheds/test-framework/gump_mvn_settings.xml install 
[Working Directory: /srv/gump/public/workspace/apacheds/test-framework]
M2_HOME: /opt/maven3
---------------------------------------------
Tests run: 1, Failures: 0, Errors: 1, Skipped: 0, Time elapsed: 2.016 sec <<< FAILURE!
Running org.apache.directory.server.core.integ.TestWithClassLevelLdapServer
Tests run: 1, Failures: 0, Errors: 1, Skipped: 0, Time elapsed: 0.898 sec <<< FAILURE!
Running org.apache.directory.server.core.integ.TestClassB
Tests run: 1, Failures: 0, Errors: 1, Skipped: 0, Time elapsed: 0.565 sec <<< FAILURE!
Running org.apache.directory.server.core.integ.TestSuite
Tests run: 1, Failures: 0, Errors: 1, Skipped: 0, Time elapsed: 0.735 sec <<< FAILURE!
Running org.apache.directory.server.core.integ.TestClassServer
Tests run: 1, Failures: 0, Errors: 1, Skipped: 0, Time elapsed: 0.368 sec <<< FAILURE!
Running org.apache.directory.server.core.integ.TestMultiLevelDS
Tests run: 1, Failures: 0, Errors: 1, Skipped: 0, Time elapsed: 0.63 sec <<< FAILURE!
Running org.apache.directory.server.core.integ.TestSuiteWithoutFactory
Tests run: 1, Failures: 0, Errors: 1, Skipped: 0, Time elapsed: 0.54 sec <<< FAILURE!
Running org.apache.directory.server.core.integ.TestSuiteServer
Tests run: 1, Failures: 0, Errors: 1, Skipped: 0, Time elapsed: 0.837 sec <<< FAILURE!
Running org.apache.directory.server.core.integ.TestClassC
Tests run: 1, Failures: 0, Errors: 1, Skipped: 0, Time elapsed: 0.498 sec <<< FAILURE!

Results :

Tests in error: 
  org.apache.directory.server.core.integ.TestClassA: antlr/RecognitionException
  org.apache.directory.server.core.integ.TestWithClassLevelLdapServer: antlr/RecognitionException
  org.apache.directory.server.core.integ.TestClassB: antlr/RecognitionException
  org.apache.directory.server.core.integ.TestSuite: antlr/RecognitionException
  org.apache.directory.server.core.integ.TestClassServer: antlr/RecognitionException
  org.apache.directory.server.core.integ.TestMultiLevelDS: antlr/RecognitionException
  org.apache.directory.server.core.integ.TestSuiteWithoutFactory: antlr/RecognitionException
  org.apache.directory.server.core.integ.TestSuiteServer: antlr/RecognitionException
  org.apache.directory.server.core.integ.TestClassC: antlr/RecognitionException

Tests run: 9, Failures: 0, Errors: 9, Skipped: 0

[INFO] ------------------------------------------------------------------------
[INFO] BUILD FAILURE
[INFO] ------------------------------------------------------------------------
[INFO] Total time: 23.877s
[INFO] Finished at: Tue Jan 10 20:05:02 UTC 2012
[INFO] Final Memory: 19M/47M
[INFO] ------------------------------------------------------------------------
[ERROR] Failed to execute goal org.apache.maven.plugins:maven-surefire-plugin:2.10:test (default-test) on project apacheds-test-framework: There are test failures.
[ERROR] 
[ERROR] Please refer to /srv/gump/public/workspace/apacheds/test-framework/target/surefire-reports for the individual test results.
[ERROR] -> [Help 1]
[ERROR] 
[ERROR] To see the full stack trace of the errors, re-run Maven with the -e switch.
[ERROR] Re-run Maven using the -X switch to enable full debug logging.
[ERROR] 
[ERROR] For more information about the errors and possible solutions, please read the following articles:
[ERROR] [Help 1] http://cwiki.apache.org/confluence/display/MAVEN/MojoFailureException
---------------------------------------------

To subscribe to this information via syndicated feeds:
- RSS: http://vmgump.apache.org/gump/public/apacheds/apacheds-test-framework/rss.xml
- Atom: http://vmgump.apache.org/gump/public/apacheds/apacheds-test-framework/atom.xml

============================== Gump Tracking Only ===
Produced by Apache Gump(TM) version 2.3.
Gump Run 06001210012012, vmgump.apache.org:vmgump:06001210012012
Gump E-mail Identifier (unique within run) #17.

*********************************************************** G U M P
[GUMP@vmgump]: Project activemq-jaas-test (in module activemq) failed
To whom it may engage...
        
This is an automated request, but not an unsolicited one. For 
more information please visit http://gump.apache.org/nagged.html, 
and/or contact the folk at general@gump.apache.org.

Project activemq-jaas-test has an issue affecting its community integration.
This issue affects 1 projects.
The current state of this project is 'Failed', with reason 'Build Failed'.
For reference only, the following projects are affected by this:
    - activemq-jaas-test :  ActiveMQ message broker and enterprise integration patterns ...


Full details are available at:
    http://vmgump.apache.org/gump/public/activemq/activemq-jaas-test/index.html

That said, some information snippets are provided here.

The following annotations (debug/informational/warning/error messages) were provided:
 -WARNING- Overriding Maven settings: [/srv/gump/public/workspace/activemq/activemq-jaas/gump_mvn_settings.xml]
 -DEBUG- (Apache Gump generated) Apache Maven Settings in: /srv/gump/public/workspace/activemq/activemq-jaas/gump_mvn_settings.xml
 -INFO- Failed with reason build failed
 -DEBUG- Maven POM in: /srv/gump/public/workspace/activemq/activemq-jaas/pom.xml



The following work was performed:
http://vmgump.apache.org/gump/public/activemq/activemq-jaas-test/gump_work/build_activemq_activemq-jaas-test.html
Work Name: build_activemq_activemq-jaas-test (Type: Build)
Work ended in a state of : Failed
Elapsed: 14 secs
Command Line: /opt/maven2/bin/mvn --batch-mode --settings /srv/gump/public/workspace/activemq/activemq-jaas/gump_mvn_settings.xml package 
[Working Directory: /srv/gump/public/workspace/activemq/activemq-jaas]
M2_HOME: /opt/maven2
---------------------------------------------
[INFO] skip non existing resourceDirectory /srv/gump/public/workspace/activemq/activemq-jaas/src/main/resources
[INFO] Copying 3 resources
[INFO] [compiler:compile {execution: default-compile}]
[INFO] Nothing to compile - all classes are up to date
[INFO] [resources:testResources {execution: default-testResources}]
[INFO] Using 'UTF-8' encoding to copy filtered resources.
[INFO] Copying 6 resources
[INFO] Copying 3 resources
[INFO] [compiler:testCompile {execution: default-testCompile}]
[INFO] Nothing to compile - all classes are up to date
[WARNING] DEPRECATED [systemProperties]: Use systemPropertyVariables instead.
[INFO] [surefire:test {execution: default-test}]
[INFO] Surefire report directory: /srv/gump/public/workspace/activemq/activemq-jaas/target/surefire-reports

-------------------------------------------------------
 T E S T S
-------------------------------------------------------
Running org.apache.activemq.jaas.CertificateLoginModuleTest
Tests run: 3, Failures: 0, Errors: 0, Skipped: 0, Time elapsed: 0.378 sec
Running org.apache.activemq.jaas.LDAPLoginModuleTest
Tests run: 1, Failures: 0, Errors: 1, Skipped: 0, Time elapsed: 0.02 sec <<< FAILURE!
Running org.apache.activemq.jaas.GroupPrincipalTest
Tests run: 3, Failures: 0, Errors: 0, Skipped: 0, Time elapsed: 0 sec
Running org.apache.activemq.jaas.PropertiesLoginModuleTest
Tests run: 3, Failures: 0, Errors: 0, Skipped: 0, Time elapsed: 0.086 sec
Running org.apache.activemq.jaas.GuestLoginModuleTest
Tests run: 2, Failures: 0, Errors: 0, Skipped: 0, Time elapsed: 0.005 sec
Running org.apache.activemq.jaas.UserPrincipalTest
Tests run: 3, Failures: 0, Errors: 0, Skipped: 0, Time elapsed: 0.002 sec

Results :

Tests in error: 
  initializationError(org.apache.activemq.jaas.LDAPLoginModuleTest): org/apache/directory/server/core/DirectoryService

Tests run: 15, Failures: 0, Errors: 1, Skipped: 0

[INFO] ------------------------------------------------------------------------
[ERROR] BUILD FAILURE
[INFO] ------------------------------------------------------------------------
[INFO] There are test failures.

Please refer to /srv/gump/public/workspace/activemq/activemq-jaas/target/surefire-reports for the individual test results.
[INFO] ------------------------------------------------------------------------
[INFO] For more information, run Maven with the -e switch
[INFO] ------------------------------------------------------------------------
[INFO] Total time: 13 seconds
[INFO] Finished at: Tue Jan 10 20:12:48 UTC 2012
[INFO] Final Memory: 43M/104M
[INFO] ------------------------------------------------------------------------
---------------------------------------------

To subscribe to this information via syndicated feeds:
- RSS: http://vmgump.apache.org/gump/public/activemq/activemq-jaas-test/rss.xml
- Atom: http://vmgump.apache.org/gump/public/activemq/activemq-jaas-test/atom.xml

============================== Gump Tracking Only ===
Produced by Apache Gump(TM) version 2.3.
Gump Run 06001210012012, vmgump.apache.org:vmgump:06001210012012
Gump E-mail Identifier (unique within run) #18.


--
Apache Gump
http://gump.apache.org/ [Instance: vmgump]

---------------------------------------------------------------------
To unsubscribe, e-mail: general-unsubscribe@gump.apache.org
For additional commands, e-mail: general-help@gump.apache.org


Mime
View raw message