gump-general mailing list archives

Site index · List index
Message view « Date » · « Thread »
Top « Date » · « Thread »
From g...@vmgump.apache.org
Subject BATCH: All dressed up, with nowhere to go...
Date Sat, 31 Dec 2011 09:43:49 GMT
Dear Gumpmeisters,
            
The following 48 notifys should have been sent

*********************************************************** G U M P
[GUMP@vmgump]: Module pcre success, but with warnings.
[GUMP@vmgump]: Module nant success, but with warnings.
[GUMP@vmgump]: Project nant (in module nant) failed
[GUMP@vmgump]: Module xpp success, but with warnings.
[GUMP@vmgump]: Project expat-configure (in module expat) failed
[GUMP@vmgump]: Module junit success, but with warnings.
[GUMP@vmgump]: Module jline success, but with warnings.
[GUMP@vmgump]: Module xz-java success, but with warnings.
[GUMP@vmgump]: Module msv success, but with warnings.
[GUMP@vmgump]: Project lucene-java-test (in module lucene-java) failed
[GUMP@vmgump]: Project lucene-java-analyzers (in module lucene-java) failed
[GUMP@vmgump]: Module args4j success, but with warnings.
[GUMP@vmgump]: Project santuario-tests (in module santuario) failed
[GUMP@vmgump]: Project jmock2-test (in module jmock2) failed
[GUMP@vmgump]: Project objenesis-all (in module objenesis) failed
[GUMP@vmgump]: Module jgroups success, but with warnings.
[GUMP@vmgump]: Project pdfbox-lucene (in module pdfbox) failed
[GUMP@vmgump]: Module slf4j success, but with warnings.
[GUMP@vmgump]: Project httpcomponents-client (in module httpcomponents) failed
[GUMP@vmgump]: Project jtidy-svn (in module jtidy) failed
[GUMP@vmgump]: Project camel-spring-test (in module camel) failed
[GUMP@vmgump]: Project commons-jci-reactor (in module apache-commons) failed
[GUMP@vmgump]: Project jetty-util-test (in module jetty) failed
[GUMP@vmgump]: Project castor-reactor (in module castor) failed
[GUMP@vmgump]: Project velocity-tools-generic-test (in module velocity-tools) failed
[GUMP@vmgump]: Project james-jsieve (in module james-jsieve) failed
[GUMP@vmgump]: Project cocoon22-blocks-modules (in module cocoon) failed
[GUMP@vmgump]: Project htmlunit (in module htmlunit) failed
[GUMP@vmgump]: Project commons-jelly-tags-ant-test (in module commons-jelly) failed
[GUMP@vmgump]: Module jakarta-tomcat-catalina success, but with warnings.
[GUMP@vmgump]: Project velocity-tools-reactor (in module velocity-tools) failed
[GUMP@vmgump]: Project turbine-core (in module turbine-core) failed
[GUMP@vmgump]: Project cocoon22-reactor (in module cocoon) failed
[GUMP@vmgump]: Project ws-commons-axiom (in module ws-axis2-commons) failed
[GUMP@vmgump]: Project portals-pluto-trunk-test (in module portals-pluto-trunk) failed
[GUMP@vmgump]: Project openjpa-kernel (in module openjpa) failed
[GUMP@vmgump]: Project tapestry (in module tapestry) failed
[GUMP@vmgump]: Project ws-axis2 (in module ws-axis2) failed
[GUMP@vmgump]: Project cocoon3-reactor (in module cocoon3) failed
[GUMP@vmgump]: Project portals-bridges-script-test (in module portals-bridges) failed
[GUMP@vmgump]: Project apacheds-protocol-changepw (in module apacheds) failed
[GUMP@vmgump]: Project cocoon-optional-test (in module cocoon3) failed
[GUMP@vmgump]: Project james-mailbox (in module james-mailbox) failed
[GUMP@vmgump]: Project apacheds-server-tools (in module apacheds) failed
[GUMP@vmgump]: Project syncrepl (in module apacheds) failed
[GUMP@vmgump]: Project apacheds-ldap-client-test (in module apacheds) failed
[GUMP@vmgump]: Project james-server (in module james-server) failed
[GUMP@vmgump]: Project camel-jms-test (in module camel) failed
*********************************************************** G U M P
[GUMP@vmgump]: Module pcre success, but with warnings.
To whom it may engage...
        
This is an automated request, but not an unsolicited one. For 
more information please visit http://gump.apache.org/nagged.html, 
and/or contact the folk at general@gump.apache.org.

Module pcre contains errors.
The current state of this module is 'Success'.

Full details are available at:
    http://vmgump.apache.org/gump/public/pcre/index.html

That said, some information snippets are provided here.

The following annotations (debug/informational/warning/error messages) were provided:
 -ERROR- *** Failed to update from source control.Stale contents ***



The following work was performed:
http://vmgump.apache.org/gump/public/pcre/gump_work/update_pcre.html
Work Name: update_pcre (Type: Update)
Work ended in a state of : Failed
Elapsed: 
Command Line: svn --quiet update --non-interactive pcre 
[Working Directory: /srv/gump/public/workspace/cvs]
---------------------------------------------
svn: Working copy 'pcre' locked
svn: run 'svn cleanup' to remove locks (type 'svn help cleanup' for details)
---------------------------------------------

To subscribe to this information via syndicated feeds:
- RSS: http://vmgump.apache.org/gump/public/pcre/rss.xml
- Atom: http://vmgump.apache.org/gump/public/pcre/atom.xml

============================== Gump Tracking Only ===
Produced by Apache Gump(TM) version 2.3.
Gump Run 11000031122011, vmgump.apache.org:vmgump:11000031122011
Gump E-mail Identifier (unique within run) #1.

*********************************************************** G U M P
[GUMP@vmgump]: Module nant success, but with warnings.
To whom it may engage...
        
This is an automated request, but not an unsolicited one. For 
more information please visit http://gump.apache.org/nagged.html, 
and/or contact the folk at general@gump.apache.org.

Module nant contains errors.
The current state of this module is 'Success'.

Full details are available at:
    http://vmgump.apache.org/gump/public/nant/index.html

That said, some information snippets are provided here.

The following annotations (debug/informational/warning/error messages) were provided:
 -ERROR- *** Failed to update from source control.Stale contents ***



The following work was performed:
http://vmgump.apache.org/gump/public/nant/gump_work/update_nant.html
Work Name: update_nant (Type: Update)
Work ended in a state of : Failed
Elapsed: 
Command Line: git pull --quiet git://github.com/nant/nant.git 
[Working Directory: /srv/gump/public/workspace/cvs/nant]
---------------------------------------------
You asked to pull from the remote 'git://github.com/nant/nant.git', but did not specify
a branch. Because this is not the default configured remote
for your current branch, you must specify a branch on the command line.
---------------------------------------------

To subscribe to this information via syndicated feeds:
- RSS: http://vmgump.apache.org/gump/public/nant/rss.xml
- Atom: http://vmgump.apache.org/gump/public/nant/atom.xml

============================== Gump Tracking Only ===
Produced by Apache Gump(TM) version 2.3.
Gump Run 11000031122011, vmgump.apache.org:vmgump:11000031122011
Gump E-mail Identifier (unique within run) #2.

*********************************************************** G U M P
[GUMP@vmgump]: Project nant (in module nant) failed
To whom it may engage...
        
This is an automated request, but not an unsolicited one. For 
more information please visit http://gump.apache.org/nagged.html, 
and/or contact the folk at general@gump.apache.org.

Project nant has an issue affecting its community integration.
This issue affects 1 projects,
 and has been outstanding for 430 runs.
The current state of this project is 'Failed', with reason 'Build Failed'.
For reference only, the following projects are affected by this:
    - nant :  NAnt is a free .NET build tool. In theory it is kind of like...


Full details are available at:
    http://vmgump.apache.org/gump/public/nant/nant/index.html

That said, some information snippets are provided here.

The following annotations (debug/informational/warning/error messages) were provided:
 -INFO- Failed with reason build failed



The following work was performed:
http://vmgump.apache.org/gump/public/nant/nant/gump_work/build_nant_nant.html
Work Name: build_nant_nant (Type: Build)
Work ended in a state of : Failed
Elapsed: 20 secs
Command Line: make MCS=gmcs TARGET=mono-2.0 
[Working Directory: /srv/gump/public/workspace/nant]
---------------------------------------------
            
                  [csc] Compiling 14 files to '/srv/gump/public/workspace/nant/build/mono-2.0.unix/nant-0.92-debug/bin/NAnt.VisualCppTasks.dll'.
            
            BUILD SUCCEEDED
            
            Total time: 0.8 seconds.
            
     [nant] /srv/gump/public/workspace/nant/src/NAnt.VSNet/NAnt.VSNet.build build
            Buildfile: file:///srv/gump/public/workspace/nant/src/NAnt.VSNet/NAnt.VSNet.build
            Target framework: Mono 2.0 Profile
            Target(s) specified: build 
            
            
            build:
            
                  [csc] Compiling 53 files to '/srv/gump/public/workspace/nant/build/mono-2.0.unix/nant-0.92-debug/bin/NAnt.VSNetTasks.dll'.
            
            BUILD SUCCEEDED
            
            Total time: 1.7 seconds.
            
     [nant] /srv/gump/public/workspace/nant/src/NAnt.MSBuild/NAnt.MSBuild.build build
            Buildfile: file:///srv/gump/public/workspace/nant/src/NAnt.MSBuild/NAnt.MSBuild.build
            Target framework: Mono 2.0 Profile
            Target(s) specified: build 
            
            
            build:
            
                [mkdir] Creating directory '/srv/gump/public/workspace/nant/build/mono-2.0.unix/nant-0.92-debug/bin/extensions/common/2.0'.
                  [csc] Compiling 22 files to '/srv/gump/public/workspace/nant/build/mono-2.0.unix/nant-0.92-debug/bin/extensions/common/2.0/NAnt.MSBuild.dll'.
                  [csc] /srv/gump/public/workspace/nant/src/NAnt.MSBuild/BuildEngine/Engine.cs(100,21): error CS0169: The private method `NAnt.MSBuild.BuildEngine.Engine.executionAD_AssemblyLoad(object, System.AssemblyLoadEventArgs)' is never used
                  [csc] /srv/gump/public/workspace/nant/src/NAnt.MSBuild/BuildEngine/Engine.cs(103,21): error CS0169: The private method `NAnt.MSBuild.BuildEngine.Engine.CurrentDomain_AssemblyLoad(object, System.AssemblyLoadEventArgs)' is never used
                  [csc] Compilation failed: 2 error(s), 0 warnings
            
            BUILD FAILED - 0 non-fatal error(s), 2 warning(s)
            
            /srv/gump/public/workspace/nant/src/NAnt.MSBuild/NAnt.MSBuild.build(28,10):
            External Program Failed: /usr/lib/mono/2.0/gmcs.exe (return code was 1)
            
            Total time: 0.8 seconds.
            

BUILD FAILED

Nested build failed.  Refer to build log for exact reason.

Total time: 14.7 seconds.

make: *** [build-nant] Error 1
---------------------------------------------

To subscribe to this information via syndicated feeds:
- RSS: http://vmgump.apache.org/gump/public/nant/nant/rss.xml
- Atom: http://vmgump.apache.org/gump/public/nant/nant/atom.xml

============================== Gump Tracking Only ===
Produced by Apache Gump(TM) version 2.3.
Gump Run 11000031122011, vmgump.apache.org:vmgump:11000031122011
Gump E-mail Identifier (unique within run) #3.

*********************************************************** G U M P
[GUMP@vmgump]: Module xpp success, but with warnings.
To whom it may engage...
        
This is an automated request, but not an unsolicited one. For 
more information please visit http://gump.apache.org/nagged.html, 
and/or contact the folk at general@gump.apache.org.

Module xpp contains errors.
The current state of this module is 'Success'.

Full details are available at:
    http://vmgump.apache.org/gump/public/xpp/index.html

That said, some information snippets are provided here.

The following annotations (debug/informational/warning/error messages) were provided:
 -ERROR- *** Failed to update from source control.Stale contents ***



The following work was performed:
http://vmgump.apache.org/gump/public/xpp/gump_work/update_xpp.html
Work Name: update_xpp (Type: Update)
Work ended in a state of : Failed
Elapsed: 9 secs
Command Line: cvs -q -z3 -d :pserver:anonymous@cvs.extreme.indiana.edu:/l/extreme/cvspub update -P -d 
[Working Directory: /srv/gump/public/workspace/cvs/xpp]
---------------------------------------------
Fatal error, aborting.
anonymous: no such user
---------------------------------------------

To subscribe to this information via syndicated feeds:
- RSS: http://vmgump.apache.org/gump/public/xpp/rss.xml
- Atom: http://vmgump.apache.org/gump/public/xpp/atom.xml

============================== Gump Tracking Only ===
Produced by Apache Gump(TM) version 2.3.
Gump Run 11000031122011, vmgump.apache.org:vmgump:11000031122011
Gump E-mail Identifier (unique within run) #4.

*********************************************************** G U M P
[GUMP@vmgump]: Project expat-configure (in module expat) failed
To whom it may engage...
        
This is an automated request, but not an unsolicited one. For 
more information please visit http://gump.apache.org/nagged.html, 
and/or contact the folk at general@gump.apache.org.

Project expat-configure has an issue affecting its community integration.
This issue affects 22 projects,
 and has been outstanding for 915 runs.
The current state of this project is 'Failed', with reason 'Build Failed'.
For reference only, the following projects are affected by this:
    - apache-httpd-buildconf :  Apache HTTP Server
    - apache-httpd-configure :  Apache HTTP Server
    - apache-httpd-make :  Apache HTTP Server
    - apache-httpd-make-install :  Apache HTTP Server
    - apr-configure :  Apache Portable Runtime
    - apr-iconv-buildconf :  Apache Portable Runtime
    - apr-iconv-configure :  Apache Portable Runtime
    - apr-iconv-make :  Apache Portable Runtime
    - apr-make :  Apache Portable Runtime
    - apr-make-install :  Apache Portable Runtime
    - expat :  The Expat XML Parser
    - expat-configure :  The Expat XML Parser
    - expat-make :  The Expat XML Parser
    - jakarta-tomcat-jk-native :  Connectors to various web servers
    - jakarta-tomcat-jk-native-buildconf :  Connectors to various web servers
    - jakarta-tomcat-jk-native-configure :  Connectors to various web servers
    - logging-log4cxx-ant :  Apache log4cxx
    - logging-log4cxx-ant-no_wchar_t :  Apache log4cxx
    - logging-log4cxx-ant-static :  Apache log4cxx
    - logging-log4cxx-configure :  Apache log4cxx
    - logging-log4cxx-make :  Apache log4cxx
    - logging-log4cxx-make-install :  Apache log4cxx


Full details are available at:
    http://vmgump.apache.org/gump/public/expat/expat-configure/index.html

That said, some information snippets are provided here.

The following annotations (debug/informational/warning/error messages) were provided:
 -INFO- Failed with reason build failed



The following work was performed:
http://vmgump.apache.org/gump/public/expat/expat-configure/gump_work/buildscript_expat_expat-configure.html
Work Name: buildscript_expat_expat-configure (Type: Build)
Work ended in a state of : Failed
Elapsed: 1 sec
Command Line: /srv/gump/public/workspace/expat/configure --prefix=/srv/gump/public/workspace/expat/dest-31122011 
[Working Directory: /srv/gump/public/workspace/expat]
---------------------------------------------
/srv/gump/public/workspace/expat/configure: line 3336: AC_LIBTOOL_WIN32_DLL: command not found
/srv/gump/public/workspace/expat/configure: line 3343: LTOPTIONS_VERSION: command not found
/srv/gump/public/workspace/expat/configure: line 3344: LTSUGAR_VERSION: command not found
/srv/gump/public/workspace/expat/configure: line 3345: LTVERSION_VERSION: command not found
/srv/gump/public/workspace/expat/configure: line 3346: LTOBSOLETE_VERSION: command not found
checking build system type... x86_64-unknown-linux-gnu
checking host system type... x86_64-unknown-linux-gnu
checking for gcc... gcc
checking whether the C compiler works... yes
checking for C compiler default output file name... a.out
checking for suffix of executables... 
checking whether we are cross compiling... no
checking for suffix of object files... o
checking whether we are using the GNU C compiler... yes
checking whether gcc accepts -g... yes
checking for gcc option to accept ISO C89... none needed
checking for a sed that does not truncate output... /bin/sed
/srv/gump/public/workspace/expat/configure: line 4283: syntax error near unexpected token `lt_decl_varnames,'
/srv/gump/public/workspace/expat/configure: line 4283: `lt_if_append_uniq(lt_decl_varnames, SED, , ,'
---------------------------------------------

To subscribe to this information via syndicated feeds:
- RSS: http://vmgump.apache.org/gump/public/expat/expat-configure/rss.xml
- Atom: http://vmgump.apache.org/gump/public/expat/expat-configure/atom.xml

============================== Gump Tracking Only ===
Produced by Apache Gump(TM) version 2.3.
Gump Run 11000031122011, vmgump.apache.org:vmgump:11000031122011
Gump E-mail Identifier (unique within run) #5.

*********************************************************** G U M P
[GUMP@vmgump]: Module junit success, but with warnings.
To whom it may engage...
        
This is an automated request, but not an unsolicited one. For 
more information please visit http://gump.apache.org/nagged.html, 
and/or contact the folk at general@gump.apache.org.

Module junit contains errors.
The current state of this module is 'Success'.

Full details are available at:
    http://vmgump.apache.org/gump/public/junit/index.html

That said, some information snippets are provided here.

The following annotations (debug/informational/warning/error messages) were provided:
 -ERROR- *** Failed to update from source control.Stale contents ***



The following work was performed:
http://vmgump.apache.org/gump/public/junit/gump_work/update_junit.html
Work Name: update_junit (Type: Update)
Work ended in a state of : Failed
Elapsed: 
Command Line: git pull --quiet git://github.com/KentBeck/junit 
[Working Directory: /srv/gump/public/workspace/cvs/junit]
---------------------------------------------
You asked to pull from the remote 'git://github.com/KentBeck/junit', but did not specify
a branch. Because this is not the default configured remote
for your current branch, you must specify a branch on the command line.
---------------------------------------------

To subscribe to this information via syndicated feeds:
- RSS: http://vmgump.apache.org/gump/public/junit/rss.xml
- Atom: http://vmgump.apache.org/gump/public/junit/atom.xml

============================== Gump Tracking Only ===
Produced by Apache Gump(TM) version 2.3.
Gump Run 11000031122011, vmgump.apache.org:vmgump:11000031122011
Gump E-mail Identifier (unique within run) #6.

*********************************************************** G U M P
[GUMP@vmgump]: Module jline success, but with warnings.
To whom it may engage...
        
This is an automated request, but not an unsolicited one. For 
more information please visit http://gump.apache.org/nagged.html, 
and/or contact the folk at general@gump.apache.org.

Module jline contains errors.
The current state of this module is 'Success'.

Full details are available at:
    http://vmgump.apache.org/gump/public/jline/index.html

That said, some information snippets are provided here.

The following annotations (debug/informational/warning/error messages) were provided:
 -ERROR- *** Failed to update from source control.Stale contents ***



The following work was performed:
http://vmgump.apache.org/gump/public/jline/gump_work/update_jline.html
Work Name: update_jline (Type: Update)
Work ended in a state of : Failed
Elapsed: 1 sec
Command Line: git pull --quiet git://jline.git.sourceforge.net/gitroot/jline/jline 
[Working Directory: /srv/gump/public/workspace/cvs/jline]
---------------------------------------------
You asked to pull from the remote 'git://jline.git.sourceforge.net/gitroot/jline/jline', but did not specify
a branch. Because this is not the default configured remote
for your current branch, you must specify a branch on the command line.
---------------------------------------------

To subscribe to this information via syndicated feeds:
- RSS: http://vmgump.apache.org/gump/public/jline/rss.xml
- Atom: http://vmgump.apache.org/gump/public/jline/atom.xml

============================== Gump Tracking Only ===
Produced by Apache Gump(TM) version 2.3.
Gump Run 11000031122011, vmgump.apache.org:vmgump:11000031122011
Gump E-mail Identifier (unique within run) #7.

*********************************************************** G U M P
[GUMP@vmgump]: Module xz-java success, but with warnings.
To whom it may engage...
        
This is an automated request, but not an unsolicited one. For 
more information please visit http://gump.apache.org/nagged.html, 
and/or contact the folk at general@gump.apache.org.

Module xz-java contains errors.
The current state of this module is 'Success'.

Full details are available at:
    http://vmgump.apache.org/gump/public/xz-java/index.html

That said, some information snippets are provided here.

The following annotations (debug/informational/warning/error messages) were provided:
 -ERROR- *** Failed to update from source control.Stale contents ***



The following work was performed:
http://vmgump.apache.org/gump/public/xz-java/gump_work/update_xz-java.html
Work Name: update_xz-java (Type: Update)
Work ended in a state of : Failed
Elapsed: 2 secs
Command Line: git pull --quiet http://git.tukaani.org/xz-java.git 
[Working Directory: /srv/gump/public/workspace/cvs/xz-java]
---------------------------------------------
You asked to pull from the remote 'http://git.tukaani.org/xz-java.git', but did not specify
a branch. Because this is not the default configured remote
for your current branch, you must specify a branch on the command line.
---------------------------------------------

To subscribe to this information via syndicated feeds:
- RSS: http://vmgump.apache.org/gump/public/xz-java/rss.xml
- Atom: http://vmgump.apache.org/gump/public/xz-java/atom.xml

============================== Gump Tracking Only ===
Produced by Apache Gump(TM) version 2.3.
Gump Run 11000031122011, vmgump.apache.org:vmgump:11000031122011
Gump E-mail Identifier (unique within run) #9.

*********************************************************** G U M P
[GUMP@vmgump]: Module msv success, but with warnings.
To whom it may engage...
        
This is an automated request, but not an unsolicited one. For 
more information please visit http://gump.apache.org/nagged.html, 
and/or contact the folk at general@gump.apache.org.

Module msv contains errors.
The current state of this module is 'Success'.

Full details are available at:
    http://vmgump.apache.org/gump/public/msv/index.html

That said, some information snippets are provided here.

The following annotations (debug/informational/warning/error messages) were provided:
 -ERROR- *** Failed to update from source control.Stale contents ***



The following work was performed:
http://vmgump.apache.org/gump/public/msv/gump_work/update_msv.html
Work Name: update_msv (Type: Update)
Work ended in a state of : Failed
Elapsed: 
Command Line: git pull --quiet git://github.com/kohsuke/msv.git 
[Working Directory: /srv/gump/public/workspace/cvs/msv]
---------------------------------------------
You asked to pull from the remote 'git://github.com/kohsuke/msv.git', but did not specify
a branch. Because this is not the default configured remote
for your current branch, you must specify a branch on the command line.
---------------------------------------------

To subscribe to this information via syndicated feeds:
- RSS: http://vmgump.apache.org/gump/public/msv/rss.xml
- Atom: http://vmgump.apache.org/gump/public/msv/atom.xml

============================== Gump Tracking Only ===
Produced by Apache Gump(TM) version 2.3.
Gump Run 11000031122011, vmgump.apache.org:vmgump:11000031122011
Gump E-mail Identifier (unique within run) #12.

*********************************************************** G U M P
[GUMP@vmgump]: Project lucene-java-test (in module lucene-java) failed
To whom it may engage...
        
This is an automated request, but not an unsolicited one. For 
more information please visit http://gump.apache.org/nagged.html, 
and/or contact the folk at general@gump.apache.org.

Project lucene-java-test has an issue affecting its community integration.
This issue affects 1 projects,
 and has been outstanding for 311 runs.
The current state of this project is 'Failed', with reason 'Build Failed'.
For reference only, the following projects are affected by this:
    - lucene-java-test :  Java Based Search Engine


Full details are available at:
    http://vmgump.apache.org/gump/public/lucene-java/lucene-java-test/index.html

That said, some information snippets are provided here.

The following annotations (debug/informational/warning/error messages) were provided:
 -DEBUG- Dependency on javacc exists, no need to add for property javacc.home.
 -INFO- Failed with reason build failed



The following work was performed:
http://vmgump.apache.org/gump/public/lucene-java/lucene-java-test/gump_work/build_lucene-java_lucene-java-test.html
Work Name: build_lucene-java_lucene-java-test (Type: Build)
Work ended in a state of : Failed
Elapsed: 1 min 40 secs
Command Line: /usr/lib/jvm/java-6-openjdk/bin/java -Djava.awt.headless=true -Dbuild.sysclasspath=only -Xbootclasspath/p:/srv/gump/public/workspace/xml-commons/java/external/build/xml-apis.jar:/srv/gump/public/workspace/xml-xerces2/build/xercesImpl.jar org.apache.tools.ant.Main -Dgump.merge=/srv/gump/public/gump/work/merge.xml -Dversion=31122011 -Djavacc.home=/srv/gump/packages/javacc-3.1 test-core 
[Working Directory: /srv/gump/public/workspace/lucene-java/lucene]
CLASSPATH: /usr/lib/jvm/java-6-openjdk/lib/tools.jar:/srv/gump/public/workspace/lucene-java/lucene/build/classes/test:/srv/gump/public/workspace/lucene-java/lucene/build/classes/tools:/srv/gump/public/workspace/ant/dist/lib/ant.jar:/srv/gump/public/workspace/ant/dist/lib/ant-launcher.jar:/srv/gump/public/workspace/ant/dist/lib/ant-jmf.jar:/srv/gump/public/workspace/ant/dist/lib/ant-junit.jar:/srv/gump/public/workspace/ant/dist/lib/ant-swing.jar:/srv/gump/public/workspace/ant/dist/lib/ant-apache-resolver.jar:/srv/gump/public/workspace/ant/dist/lib/ant-apache-xalan2.jar:/srv/gump/public/workspace/xml-commons/java/build/resolver.jar:/srv/gump/packages/javacc-3.1/bin/lib/javacc.jar:/srv/gump/public/workspace/junit/dist/junit-31122011.jar:/srv/gump/public/workspace/junit/dist/junit-dep-31122011.jar:/srv/gump/public/workspace/lucene-java/lucene/build/lucene-core-31122011.jar:/srv/gump/public/workspace/lucene-java/lucene/build/lucene-test-framework-31122011.jar:/srv/gump/public/work
 space/xml-commons/java/external/build/xml-apis-ext.jar
---------------------------------------------
    [junit] ------------- Standard Error -----------------
    [junit] NOTE: reproduce with (hopefully): ant test -Dtestcase=TestDeterminism -Dtests.seed=18cbe86097376a25:0:-7fbdf68ae535040 -Dargs="-Dfile.encoding=UTF-8"
    [junit] NOTE: test params are: codec=Lucene40: {}, sim=RandomSimilarityProvider(queryNorm=true,coord=true): {}, locale=en_ZA, timezone=Europe/Moscow
    [junit] NOTE: all tests run in this JVM:
    [junit] [TestSearchForDuplicates, TestCachingTokenFilter, TestToken, TestIntBlockCodec, TestSurrogates, TestPerFieldPostingsFormat, Test2BTerms, TestAddIndexes, TestCodecs, TestConcurrentMergeScheduler, TestCrash, TestDoc, TestDocValuesIndexing, TestDocumentWriter, TestFlushByRamOrCountsPolicy, TestForTooMuchCloning, TestIndexFileDeleter, TestIndexWriterCommit, TestIndexWriterForceMerge, TestIndexWriterMerging, TestNRTReaderWithThreads, TestNewestSegment, TestNoMergeScheduler, TestOmitPositions, TestParallelReaderEmptyIndex, TestPersistentSnapshotDeletionPolicy, TestRandomStoredFields, TestSegmentInfo, TestStressAdvance, TestTermVectorsReader, TestTermsEnum2, TestTieredMergePolicy, TestTransactionRollback, TestBooleanScorer, TestComplexExplanations, TestCustomSearcherSort, TestDisjunctionMaxQuery, TestFieldCache, TestFieldCacheRewriteMethod, TestFieldValueFilter, TestFilteredSearch, TestFuzzyQuery, TestMultiPhraseQuery, TestMultiValuedNumericRangeQuery, TestNumericRangeQu
 ery64, TestPhrasePrefixQuery, TestPositionIncrement, TestPositiveScoresOnlyCollector, TestPrefixInBooleanQuery, TestRegexpRandom2, TestSearchWithThreads, TestSloppyPhraseQuery, TestSort, TestFieldMaskingSpanQuery, TestSpanFirstQuery, TestSpansAdvanced2, TestBufferedIndexInput, TestCopyBytes, TestFileSwitchDirectory, TestAttributeSource, TestBytesRef, TestBytesRefHash, TestDoubleBarrelLRUCache, TestFixedBitSet, TestOpenBitSet, TestPriorityQueue, TestRecyclingByteBlockAllocator, TestDeterminism]
    [junit] NOTE: Linux 2.6.32-35-server amd64/Sun Microsystems Inc. 1.6.0_20 (64-bit)/cpus=1,threads=1,free=5520896,total=29077504
    [junit] ------------- ---------------- ---------------
    [junit] TEST org.apache.lucene.util.automaton.TestDeterminism FAILED
    [junit] Testsuite: org.apache.lucene.util.automaton.TestDeterminizeLexicon
    [junit] Testcase: testLexicon(org.apache.lucene.util.automaton.TestDeterminizeLexicon):	FAILED
    [junit] ensure your setUp() calls super.setUp()!!!
    [junit] junit.framework.AssertionFailedError: ensure your setUp() calls super.setUp()!!!
    [junit] 	at org.apache.lucene.util.LuceneTestCase$2.starting(LuceneTestCase.java:508)
    [junit] 	at org.apache.lucene.util.LuceneTestCase$3$1.evaluate(LuceneTestCase.java:528)
    [junit] 	at org.apache.lucene.util.LuceneTestCaseRunner.runChild(LuceneTestCaseRunner.java:165)
    [junit] 	at org.apache.lucene.util.LuceneTestCaseRunner.runChild(LuceneTestCaseRunner.java:57)
    [junit] 
    [junit] 
    [junit] Testcase: org.apache.lucene.util.automaton.TestDeterminizeLexicon:	Caused an ERROR
    [junit] java.lang.AssertionError: ensure your setUp() calls super.setUp() and your tearDown() calls super.tearDown()!!!
    [junit] java.lang.RuntimeException: java.lang.AssertionError: ensure your setUp() calls super.setUp() and your tearDown() calls super.tearDown()!!!
    [junit] 	at org.apache.lucene.util.LuceneTestCase.afterClassLuceneTestCaseJ4(LuceneTestCase.java:405)
    [junit] Caused by: java.lang.AssertionError: ensure your setUp() calls super.setUp() and your tearDown() calls super.tearDown()!!!
    [junit] 	at org.apache.lucene.util.LuceneTestCase.afterClassLuceneTestCaseJ4(LuceneTestCase.java:347)
    [junit] 
    [junit] 
    [junit] Tests run: 1, Failures: 1, Errors: 1, Time elapsed: 0.02 sec
    [junit] 
    [junit] ------------- Standard Error -----------------
    [junit] NOTE: reproduce with (hopefully): ant test -Dtestcase=TestDeterminizeLexicon -Dtests.seed=60a8122781815d0c:0:-7fbdf68ae535040 -Dargs="-Dfile.encoding=UTF-8"
    [junit] NOTE: test params are: codec=Appending, sim=RandomSimilarityProvider(queryNorm=false,coord=false): {}, locale=fr_CH, timezone=Asia/Kuwait
    [junit] NOTE: all tests run in this JVM:
    [junit] [TestSearchForDuplicates, TestCachingTokenFilter, TestToken, TestIntBlockCodec, TestSurrogates, TestPerFieldPostingsFormat, Test2BTerms, TestAddIndexes, TestCodecs, TestConcurrentMergeScheduler, TestCrash, TestDoc, TestDocValuesIndexing, TestDocumentWriter, TestFlushByRamOrCountsPolicy, TestForTooMuchCloning, TestIndexFileDeleter, TestIndexWriterCommit, TestIndexWriterForceMerge, TestIndexWriterMerging, TestNRTReaderWithThreads, TestNewestSegment, TestNoMergeScheduler, TestOmitPositions, TestParallelReaderEmptyIndex, TestPersistentSnapshotDeletionPolicy, TestRandomStoredFields, TestSegmentInfo, TestStressAdvance, TestTermVectorsReader, TestTermsEnum2, TestTieredMergePolicy, TestTransactionRollback, TestBooleanScorer, TestComplexExplanations, TestCustomSearcherSort, TestDisjunctionMaxQuery, TestFieldCache, TestFieldCacheRewriteMethod, TestFieldValueFilter, TestFilteredSearch, TestFuzzyQuery, TestMultiPhraseQuery, TestMultiValuedNumericRangeQuery, TestNumericRangeQu
 ery64, TestPhrasePrefixQuery, TestPositionIncrement, TestPositiveScoresOnlyCollector, TestPrefixInBooleanQuery, TestRegexpRandom2, TestSearchWithThreads, TestSloppyPhraseQuery, TestSort, TestFieldMaskingSpanQuery, TestSpanFirstQuery, TestSpansAdvanced2, TestBufferedIndexInput, TestCopyBytes, TestFileSwitchDirectory, TestAttributeSource, TestBytesRef, TestBytesRefHash, TestDoubleBarrelLRUCache, TestFixedBitSet, TestOpenBitSet, TestPriorityQueue, TestRecyclingByteBlockAllocator, TestDeterminism, TestDeterminizeLexicon]
    [junit] NOTE: Linux 2.6.32-35-server amd64/Sun Microsystems Inc. 1.6.0_20 (64-bit)/cpus=1,threads=1,free=4728712,total=29077504
    [junit] ------------- ---------------- ---------------
    [junit] TEST org.apache.lucene.util.automaton.TestDeterminizeLexicon FAILED
    [junit] Tests FAILED

BUILD FAILED
/srv/gump/public/workspace/lucene-java/lucene/common-build.xml:657: 
The following error occurred while executing this line:
/srv/gump/public/workspace/lucene-java/lucene/common-build.xml:641: Tests failed!
The following error occurred while executing this line:
/srv/gump/public/workspace/lucene-java/lucene/common-build.xml:641: Tests failed!
The following error occurred while executing this line:
/srv/gump/public/workspace/lucene-java/lucene/common-build.xml:641: Tests failed!
The following error occurred while executing this line:
/srv/gump/public/workspace/lucene-java/lucene/common-build.xml:641: Tests failed!

Total time: 1 minute 40 seconds
---------------------------------------------

To subscribe to this information via syndicated feeds:
- RSS: http://vmgump.apache.org/gump/public/lucene-java/lucene-java-test/rss.xml
- Atom: http://vmgump.apache.org/gump/public/lucene-java/lucene-java-test/atom.xml

============================== Gump Tracking Only ===
Produced by Apache Gump(TM) version 2.3.
Gump Run 11000031122011, vmgump.apache.org:vmgump:11000031122011
Gump E-mail Identifier (unique within run) #14.

*********************************************************** G U M P
[GUMP@vmgump]: Project lucene-java-analyzers (in module lucene-java) failed
To whom it may engage...
        
This is an automated request, but not an unsolicited one. For 
more information please visit http://gump.apache.org/nagged.html, 
and/or contact the folk at general@gump.apache.org.

Project lucene-java-analyzers has an issue affecting its community integration.
This issue affects 6 projects,
 and has been outstanding for 4 runs.
The current state of this project is 'Failed', with reason 'Build Failed'.
For reference only, the following projects are affected by this:
    - lucene-java-analyzers :  Java Based Search Engine
    - lucene-java-analyzers-test :  Java Based Search Engine
    - lucene-java-contrib :  Java Based Search Engine
    - lucene-java-contrib-test :  Java Based Search Engine
    - solr :  Java Based Search Engine
    - solr-test :  Java Based Search Engine


Full details are available at:
    http://vmgump.apache.org/gump/public/lucene-java/lucene-java-analyzers/index.html

That said, some information snippets are provided here.

The following annotations (debug/informational/warning/error messages) were provided:
 -INFO- Failed with reason build failed
 -INFO- Failed to extract fallback artifacts from Gump Repository



The following work was performed:
http://vmgump.apache.org/gump/public/lucene-java/lucene-java-analyzers/gump_work/build_lucene-java_lucene-java-analyzers.html
Work Name: build_lucene-java_lucene-java-analyzers (Type: Build)
Work ended in a state of : Failed
Elapsed: 21 secs
Command Line: /usr/lib/jvm/java-6-openjdk/bin/java -Djava.awt.headless=true -Dbuild.sysclasspath=only -Xbootclasspath/p:/srv/gump/public/workspace/xml-commons/java/external/build/xml-apis.jar:/srv/gump/public/workspace/xml-xerces2/build/xercesImpl.jar org.apache.tools.ant.Main -Dgump.merge=/srv/gump/public/gump/work/merge.xml -Dversion=31122011 
[Working Directory: /srv/gump/public/workspace/lucene-java/modules/analysis]
CLASSPATH: /usr/lib/jvm/java-6-openjdk/lib/tools.jar:/srv/gump/public/workspace/lucene-java/modules/analysis/build/common/classes/java:/srv/gump/public/workspace/lucene-java/modules/analysis/morfologik/lib/morfologik-fsa-1.5.2.jar:/srv/gump/public/workspace/lucene-java/modules/analysis/morfologik/lib/morfologik-polish-1.5.2.jar:/srv/gump/public/workspace/lucene-java/modules/analysis/morfologik/lib/morfologik-stemming-1.5.2.jar:/srv/gump/public/workspace/ant/dist/lib/ant.jar:/srv/gump/public/workspace/ant/dist/lib/ant-launcher.jar:/srv/gump/public/workspace/ant/dist/lib/ant-jmf.jar:/srv/gump/public/workspace/ant/dist/lib/ant-junit.jar:/srv/gump/public/workspace/ant/dist/lib/ant-swing.jar:/srv/gump/public/workspace/ant/dist/lib/ant-apache-resolver.jar:/srv/gump/public/workspace/ant/dist/lib/ant-apache-xalan2.jar:/srv/gump/public/workspace/xml-commons/java/build/resolver.jar:/srv/gump/public/workspace/commons-codec-1.x/dist/commons-codec-31122011.jar:/srv/gump/public/workspace/i
 cu4j/main/classes/core/out/lib/icu4j-core.jar:/srv/gump/public/workspace/icu4j/main/classes/collate/out/lib/icu4j-collate.jar:/srv/gump/public/workspace/icu4j/main/classes/currdata/out/lib/icu4j-currdata.jar:/srv/gump/public/workspace/icu4j/main/classes/langdata/out/lib/icu4j-langdata.jar:/srv/gump/public/workspace/icu4j/main/classes/regiondata/out/lib/icu4j-regiondata.jar:/srv/gump/public/workspace/icu4j/main/classes/translit/out/lib/icu4j-translit.jar:/srv/gump/public/workspace/icu4j/main/classes/charset/out/lib/icu4j-charset.jar:/srv/gump/public/workspace/icu4j/main/classes/localespi/out/lib/icu4j-localespi.jar:/srv/gump/public/workspace/junit/dist/junit-31122011.jar:/srv/gump/public/workspace/junit/dist/junit-dep-31122011.jar:/srv/gump/public/workspace/lucene-java/lucene/build/lucene-core-31122011.jar:/srv/gump/public/workspace/lucene-java/lucene/build/lucene-test-framework-31122011.jar:/srv/gump/public/workspace/xml-commons/java/external/build/xml-apis-ext.jar
---------------------------------------------

clover:

common.compile-core:
    [mkdir] Created dir: /srv/gump/public/workspace/lucene-java/modules/analysis/build/phonetic/classes/java
    [javac] Compiling 3 source files to /srv/gump/public/workspace/lucene-java/modules/analysis/build/phonetic/classes/java
    [javac] warning: [path] bad path element "/srv/gump/public/workspace/lucene-java/modules/analysis/morfologik/lib/hppc-0.4.0.jar": no such file or directory
    [javac] /srv/gump/public/workspace/lucene-java/modules/analysis/phonetic/src/java/org/apache/lucene/analysis/phonetic/BeiderMorseFilter.java:24: package org.apache.commons.codec.language.bm does not exist
    [javac] import org.apache.commons.codec.language.bm.BeiderMorseEncoder; // javadocs
    [javac]                                            ^
    [javac] /srv/gump/public/workspace/lucene-java/modules/analysis/phonetic/src/java/org/apache/lucene/analysis/phonetic/BeiderMorseFilter.java:25: package org.apache.commons.codec.language.bm.Languages does not exist
    [javac] import org.apache.commons.codec.language.bm.Languages.LanguageSet;
    [javac]                                                      ^
    [javac] /srv/gump/public/workspace/lucene-java/modules/analysis/phonetic/src/java/org/apache/lucene/analysis/phonetic/BeiderMorseFilter.java:26: package org.apache.commons.codec.language.bm does not exist
    [javac] import org.apache.commons.codec.language.bm.PhoneticEngine;
    [javac]                                            ^
    [javac] /srv/gump/public/workspace/lucene-java/modules/analysis/phonetic/src/java/org/apache/lucene/analysis/phonetic/BeiderMorseFilter.java:38: cannot find symbol
    [javac] symbol  : class PhoneticEngine
    [javac] location: class org.apache.lucene.analysis.phonetic.BeiderMorseFilter
    [javac]   private final PhoneticEngine engine;
    [javac]                 ^
    [javac] /srv/gump/public/workspace/lucene-java/modules/analysis/phonetic/src/java/org/apache/lucene/analysis/phonetic/BeiderMorseFilter.java:39: cannot find symbol
    [javac] symbol  : class LanguageSet
    [javac] location: class org.apache.lucene.analysis.phonetic.BeiderMorseFilter
    [javac]   private final LanguageSet languages;
    [javac]                 ^
    [javac] /srv/gump/public/workspace/lucene-java/modules/analysis/phonetic/src/java/org/apache/lucene/analysis/phonetic/BeiderMorseFilter.java:62: cannot find symbol
    [javac] symbol  : class PhoneticEngine
    [javac] location: class org.apache.lucene.analysis.phonetic.BeiderMorseFilter
    [javac]   public BeiderMorseFilter(TokenStream input, PhoneticEngine engine) {
    [javac]                                               ^
    [javac] /srv/gump/public/workspace/lucene-java/modules/analysis/phonetic/src/java/org/apache/lucene/analysis/phonetic/BeiderMorseFilter.java:72: cannot find symbol
    [javac] symbol  : class PhoneticEngine
    [javac] location: class org.apache.lucene.analysis.phonetic.BeiderMorseFilter
    [javac]   public BeiderMorseFilter(TokenStream input, PhoneticEngine engine, LanguageSet languages) {
    [javac]                                               ^
    [javac] /srv/gump/public/workspace/lucene-java/modules/analysis/phonetic/src/java/org/apache/lucene/analysis/phonetic/BeiderMorseFilter.java:72: cannot find symbol
    [javac] symbol  : class LanguageSet
    [javac] location: class org.apache.lucene.analysis.phonetic.BeiderMorseFilter
    [javac]   public BeiderMorseFilter(TokenStream input, PhoneticEngine engine, LanguageSet languages) {
    [javac]                                                                      ^
    [javac] 8 errors
    [javac] 1 warning

BUILD FAILED
/srv/gump/public/workspace/lucene-java/modules/analysis/build.xml:40: The following error occurred while executing this line:
/srv/gump/public/workspace/lucene-java/lucene/common-build.xml:328: The following error occurred while executing this line:
/srv/gump/public/workspace/lucene-java/lucene/common-build.xml:817: Compile failed; see the compiler error output for details.

Total time: 21 seconds
---------------------------------------------

To subscribe to this information via syndicated feeds:
- RSS: http://vmgump.apache.org/gump/public/lucene-java/lucene-java-analyzers/rss.xml
- Atom: http://vmgump.apache.org/gump/public/lucene-java/lucene-java-analyzers/atom.xml

============================== Gump Tracking Only ===
Produced by Apache Gump(TM) version 2.3.
Gump Run 11000031122011, vmgump.apache.org:vmgump:11000031122011
Gump E-mail Identifier (unique within run) #15.

*********************************************************** G U M P
[GUMP@vmgump]: Module args4j success, but with warnings.
To whom it may engage...
        
This is an automated request, but not an unsolicited one. For 
more information please visit http://gump.apache.org/nagged.html, 
and/or contact the folk at general@gump.apache.org.

Module args4j contains errors.
The current state of this module is 'Success'.

Full details are available at:
    http://vmgump.apache.org/gump/public/args4j/index.html

That said, some information snippets are provided here.

The following annotations (debug/informational/warning/error messages) were provided:
 -ERROR- *** Failed to update from source control.Stale contents ***



The following work was performed:
http://vmgump.apache.org/gump/public/args4j/gump_work/update_args4j.html
Work Name: update_args4j (Type: Update)
Work ended in a state of : Failed
Elapsed: 
Command Line: git pull --quiet git://github.com/kohsuke/args4j.git 
[Working Directory: /srv/gump/public/workspace/cvs/args4j]
---------------------------------------------
You asked to pull from the remote 'git://github.com/kohsuke/args4j.git', but did not specify
a branch. Because this is not the default configured remote
for your current branch, you must specify a branch on the command line.
---------------------------------------------

To subscribe to this information via syndicated feeds:
- RSS: http://vmgump.apache.org/gump/public/args4j/rss.xml
- Atom: http://vmgump.apache.org/gump/public/args4j/atom.xml

============================== Gump Tracking Only ===
Produced by Apache Gump(TM) version 2.3.
Gump Run 11000031122011, vmgump.apache.org:vmgump:11000031122011
Gump E-mail Identifier (unique within run) #16.

*********************************************************** G U M P
[GUMP@vmgump]: Project santuario-tests (in module santuario) failed
To whom it may engage...
        
This is an automated request, but not an unsolicited one. For 
more information please visit http://gump.apache.org/nagged.html, 
and/or contact the folk at general@gump.apache.org.

Project santuario-tests has an issue affecting its community integration.
This issue affects 1 projects,
 and has been outstanding for 311 runs.
The current state of this project is 'Failed', with reason 'Build Failed'.
For reference only, the following projects are affected by this:
    - santuario-tests :  XML-Signature Syntax and Processing


Full details are available at:
    http://vmgump.apache.org/gump/public/santuario/santuario-tests/index.html

That said, some information snippets are provided here.

The following annotations (debug/informational/warning/error messages) were provided:
 -DEBUG- Dependency on jce exists, no need to add for property lib.jce.
 -DEBUG- Dependency on junit exists, no need to add for property lib.junit.
 -INFO- Failed with reason build failed



The following work was performed:
http://vmgump.apache.org/gump/public/santuario/santuario-tests/gump_work/build_santuario_santuario-tests.html
Work Name: build_santuario_santuario-tests (Type: Build)
Work ended in a state of : Failed
Elapsed: 1 min 52 secs
Command Line: /usr/lib/jvm/java-6-openjdk/bin/java -Djava.awt.headless=true -Dbuild.sysclasspath=only -Dant.build.clonevm=true -Xbootclasspath/p:/srv/gump/public/workspace/xml-commons/java/external/build/xml-apis.jar:/srv/gump/public/workspace/xml-xerces2/build/xercesImpl.jar:/srv/gump/public/workspace/xml-xalan/build/xalan-unbundled.jar:/srv/gump/public/workspace/xml-xalan/build/serializer.jar org.apache.tools.ant.Main -Dgump.merge=/srv/gump/public/gump/work/merge.xml -Djce.download.sha1=c1f0e975e8c8e0a0105787b249a50615b485d109 -Dlib.jce=/srv/gump/packages/jce/jce-jdk13-116.jar -Dlib.junit=/srv/gump/public/workspace/junit/dist/junit-31122011.jar -Djce.download.md5=85c64cd754719a4bc8da7e9aa0e113fd test 
[Working Directory: /srv/gump/public/workspace/santuario]
CLASSPATH: /usr/lib/jvm/java-6-openjdk/lib/tools.jar:/srv/gump/public/workspace/santuario/build/test:/srv/gump/public/workspace/santuario:/srv/gump/public/workspace/santuario/build/xmlsec-31122011.jar:/srv/gump/public/workspace/ant/dist/lib/ant.jar:/srv/gump/public/workspace/ant/dist/lib/ant-launcher.jar:/srv/gump/public/workspace/ant/dist/lib/ant-jmf.jar:/srv/gump/public/workspace/ant/dist/lib/ant-junit.jar:/srv/gump/public/workspace/ant/dist/lib/ant-swing.jar:/srv/gump/public/workspace/ant/dist/lib/ant-apache-resolver.jar:/srv/gump/public/workspace/ant/dist/lib/ant-apache-xalan2.jar:/srv/gump/public/workspace/xml-commons/java/external/build/xml-apis-ext.jar:/srv/gump/packages/jce/jce-jdk13-116.jar:/srv/gump/public/workspace/apache-commons/logging/target/commons-logging-31122011.jar:/srv/gump/public/workspace/apache-commons/logging/target/commons-logging-api-31122011.jar:/srv/gump/public/workspace/junit/dist/junit-31122011.jar:/srv/gump/public/workspace/junit/dist/junit-dep-
 31122011.jar
---------------------------------------------
    [junit] Tests run: 3, Failures: 0, Errors: 0, Time elapsed: 0.061 sec
    [junit] 
    [junit] Testcase: testA1 took 0.005 sec
    [junit] Testcase: testWrap1 took 0 sec
    [junit] Testcase: testWrap2 took 0 sec
    [junit] Running org.apache.xml.security.test.utils.IdResolverTest
    [junit] Testsuite: org.apache.xml.security.test.utils.IdResolverTest
    [junit] Tests run: 3, Failures: 0, Errors: 0, Time elapsed: 0.11 sec
    [junit] Tests run: 3, Failures: 0, Errors: 0, Time elapsed: 0.11 sec
    [junit] 
    [junit] Testcase: testIdSoap took 0.045 sec
    [junit] Testcase: testIdWithOtherIdSoap took 0.004 sec
    [junit] Testcase: testANoId took 0.003 sec
    [junit] Running org.apache.xml.security.test.utils.OldApiTest
    [junit] Testsuite: org.apache.xml.security.test.utils.OldApiTest
    [junit] Tests run: 3, Failures: 0, Errors: 0, Time elapsed: 0.121 sec
    [junit] Tests run: 3, Failures: 0, Errors: 0, Time elapsed: 0.121 sec
    [junit] 
    [junit] Testcase: testOldResourceResolverSpi took 0.041 sec
    [junit] Testcase: testOldKeyResolverSpi took 0.011 sec
    [junit] Testcase: testOldKeyResolverSpiInKeyInfo took 0.01 sec
    [junit] Running org.apache.xml.security.test.utils.resolver.ResolverDirectHTTPTest
    [junit] Testsuite: org.apache.xml.security.test.utils.resolver.ResolverDirectHTTPTest
    [junit] Tests run: 1, Failures: 0, Errors: 0, Time elapsed: 0.169 sec
    [junit] Tests run: 1, Failures: 0, Errors: 0, Time elapsed: 0.169 sec
    [junit] 
    [junit] Testcase: testBug40783 took 0.111 sec
    [junit] Running org.apache.xml.security.test.utils.resolver.ResourceResolverTest
    [junit] Testsuite: org.apache.xml.security.test.utils.resolver.ResourceResolverTest
    [junit] Tests run: 2, Failures: 0, Errors: 0, Time elapsed: 0.07 sec
    [junit] Tests run: 2, Failures: 0, Errors: 0, Time elapsed: 0.07 sec
    [junit] 
    [junit] Testcase: testCustomResolver took 0.011 sec
    [junit] Testcase: testLocalFileWithEmptyBaseURI took 0.003 sec
    [junit] Running org.apache.xml.security.test.version.VersionTest
    [junit] Testsuite: org.apache.xml.security.test.version.VersionTest
    [junit] Tests run: 2, Failures: 0, Errors: 0, Time elapsed: 0.122 sec
    [junit] Tests run: 2, Failures: 0, Errors: 0, Time elapsed: 0.122 sec
    [junit] 
    [junit] Testcase: testConvertVersion took 0.003 sec
    [junit] Testcase: testVersion took 0.06 sec
[junitreport] Processing /srv/gump/public/workspace/santuario/build/docs/xml/junit/TESTS-TestSuites.xml to /tmp/null1122024776
[junitreport] Loading stylesheet jar:file:/srv/gump/public/workspace/ant/dist/lib/ant-junit.jar!/org/apache/tools/ant/taskdefs/optional/junit/xsl/junit-frames.xsl
[junitreport] Transform time: 5488ms
[junitreport] Deleting: /tmp/null1122024776

BUILD FAILED
/srv/gump/public/workspace/santuario/build.xml:326: Unit Tests Failed

Total time: 1 minute 51 seconds
---------------------------------------------

To subscribe to this information via syndicated feeds:
- RSS: http://vmgump.apache.org/gump/public/santuario/santuario-tests/rss.xml
- Atom: http://vmgump.apache.org/gump/public/santuario/santuario-tests/atom.xml

============================== Gump Tracking Only ===
Produced by Apache Gump(TM) version 2.3.
Gump Run 11000031122011, vmgump.apache.org:vmgump:11000031122011
Gump E-mail Identifier (unique within run) #18.

*********************************************************** G U M P
[GUMP@vmgump]: Project jmock2-test (in module jmock2) failed
To whom it may engage...
        
This is an automated request, but not an unsolicited one. For 
more information please visit http://gump.apache.org/nagged.html, 
and/or contact the folk at general@gump.apache.org.

Project jmock2-test has an issue affecting its community integration.
This issue affects 1 projects,
 and has been outstanding for 71 runs.
The current state of this project is 'Failed', with reason 'Build Failed'.
For reference only, the following projects are affected by this:
    - jmock2-test :  jMock is a library for testing Java code using mock objects.


Full details are available at:
    http://vmgump.apache.org/gump/public/jmock2/jmock2-test/index.html

That said, some information snippets are provided here.

The following annotations (debug/informational/warning/error messages) were provided:
 -INFO- Failed with reason build failed



The following work was performed:
http://vmgump.apache.org/gump/public/jmock2/jmock2-test/gump_work/build_jmock2_jmock2-test.html
Work Name: build_jmock2_jmock2-test (Type: Build)
Work ended in a state of : Failed
Elapsed: 17 secs
Command Line: /usr/lib/jvm/java-6-openjdk/bin/java -Djava.awt.headless=true -Dbuild.sysclasspath=only -Xbootclasspath/p:/srv/gump/public/workspace/xml-xerces2/build/xercesImpl.jar:/srv/gump/public/workspace/xml-commons/java/external/build/xml-apis.jar org.apache.tools.ant.Main -Dgump.merge=/srv/gump/public/gump/work/merge.xml -Dversion=31122011 run.tests 
[Working Directory: /srv/gump/public/workspace/jmock2]
CLASSPATH: /usr/lib/jvm/java-6-openjdk/lib/tools.jar:/srv/gump/public/workspace/jmock2/build/jmock-31122011/jmock-31122011.jar:/srv/gump/public/workspace/jmock2/build/jmock-31122011/jmock-junit3-31122011.jar:/srv/gump/public/workspace/jmock2/build/jmock-31122011/jmock-junit4-31122011.jar:/srv/gump/public/workspace/jmock2/build/jmock-31122011/jmock-legacy-31122011.jar:/srv/gump/public/workspace/jmock2/build/jmock-31122011/jmock-script-31122011.jar:/srv/gump/public/workspace/jmock2/build/jmock-31122011/jmock-tests-31122011.jar:/srv/gump/public/workspace/ant/dist/lib/ant.jar:/srv/gump/public/workspace/ant/dist/lib/ant-launcher.jar:/srv/gump/public/workspace/ant/dist/lib/ant-jmf.jar:/srv/gump/public/workspace/ant/dist/lib/ant-junit.jar:/srv/gump/public/workspace/ant/dist/lib/ant-swing.jar:/srv/gump/public/workspace/ant/dist/lib/ant-apache-resolver.jar:/srv/gump/public/workspace/ant/dist/lib/ant-apache-xalan2.jar:/srv/gump/packages/bsh-2.0b4/bsh-2.0b4.jar:/srv/gump/packages/bsh-2.
 0b4/bsh-bsf-2.0b4.jar:/srv/gump/packages/bsh-2.0b4/bsh-classpath-2.0b4.jar:/srv/gump/packages/bsh-2.0b4/bsh-commands-2.0b4.jar:/srv/gump/packages/bsh-2.0b4/bsh-core-2.0b4.jar:/srv/gump/packages/bsh-2.0b4/bsh-reflect-2.0b4.jar:/srv/gump/packages/bsh-2.0b4/bsh-util-2.0b4.jar:/srv/gump/packages/cglib/cglib-nodep-2.2.jar:/srv/gump/public/workspace/hamcrest/hamcrest-java/build/hamcrest-core-31122011.jar:/srv/gump/public/workspace/hamcrest/hamcrest-java/build/hamcrest-generator-31122011.jar:/srv/gump/public/workspace/hamcrest/hamcrest-java/build/hamcrest-library-31122011.jar:/srv/gump/public/workspace/hamcrest/hamcrest-java/build/hamcrest-unit-test-31122011.jar:/srv/gump/public/workspace/junit/dist/junit-31122011.jar:/srv/gump/public/workspace/junit/dist/junit-dep-31122011.jar:/srv/gump/packages/junit3.8.1/junit.jar:/srv/gump/public/workspace/xml-commons/java/external/build/xml-apis-ext.jar:/srv/gump/public/workspace/objenesis/main/target/objenesis-1.2.jar
---------------------------------------------
    [junit] the Mockery is not thread-safe: use a Synchroniser to ensure thread safety
    [junit] the Mockery is not thread-safe: use a Synchroniser to ensure thread safety
    [junit] ------------- ---------------- ---------------
    [junit] Testsuite: org.jmock.test.acceptance.RecordingAcceptanceTests
    [junit] Tests run: 5, Failures: 0, Errors: 0, Time elapsed: 0.03 sec
    [junit] 
    [junit] Testsuite: org.jmock.test.acceptance.RedeclaredObjectMethodsAcceptanceTests
    [junit] Tests run: 3, Failures: 0, Errors: 0, Time elapsed: 0.149 sec
    [junit] 
    [junit] Testsuite: org.jmock.test.acceptance.ReturningIteratorsAcceptanceTests
    [junit] Tests run: 2, Failures: 0, Errors: 0, Time elapsed: 0.021 sec
    [junit] 
    [junit] Testsuite: org.jmock.test.acceptance.ReturningValuesAcceptanceTests
    [junit] Tests run: 16, Failures: 0, Errors: 0, Time elapsed: 0.077 sec
    [junit] 
    [junit] Testsuite: org.jmock.test.acceptance.SequenceAcceptanceTests
    [junit] Tests run: 7, Failures: 0, Errors: 0, Time elapsed: 0.023 sec
    [junit] 
    [junit] Testsuite: org.jmock.test.acceptance.ThrowingExceptionsAcceptanceTests
    [junit] Tests run: 4, Failures: 0, Errors: 0, Time elapsed: 0.005 sec
    [junit] 
    [junit] Testsuite: org.jmock.test.acceptance.UnorderedExpectationsAcceptanceTests
    [junit] Tests run: 5, Failures: 0, Errors: 0, Time elapsed: 0.005 sec
    [junit] 
    [junit] Testsuite: org.jmock.test.acceptance.WarnAboutMultipleThreadsAcceptanceTests
    [junit] Tests run: 1, Failures: 0, Errors: 1, Time elapsed: 0.005 sec
    [junit] 
    [junit] ------------- Standard Error -----------------
    [junit] the Mockery is not thread-safe: use a Synchroniser to ensure thread safety
    [junit] ------------- ---------------- ---------------
    [junit] Testcase: testKillsThreadsThatTryToCallMockeryThatIsNotThreadSafe(org.jmock.test.acceptance.WarnAboutMultipleThreadsAcceptanceTests):	Caused an ERROR
    [junit] 
    [junit] Expected: <1>
    [junit]      got: <0>
    [junit] 
    [junit] java.lang.AssertionError: 
    [junit] Expected: <1>
    [junit]      got: <0>
    [junit] 
    [junit] 	at org.jmock.test.acceptance.WarnAboutMultipleThreadsAcceptanceTests.testKillsThreadsThatTryToCallMockeryThatIsNotThreadSafe(WarnAboutMultipleThreadsAcceptanceTests.java:49)
    [junit] 
    [junit] 
    [junit] the Mockery is not thread-safe: use a Synchroniser to ensure thread safety
    [junit] the Mockery is not thread-safe: use a Synchroniser to ensure thread safety
    [junit] the Mockery is not thread-safe: use a Synchroniser to ensure thread safety

BUILD FAILED
/srv/gump/public/workspace/jmock2/build.xml:225: Tests failed

Total time: 16 seconds
---------------------------------------------

To subscribe to this information via syndicated feeds:
- RSS: http://vmgump.apache.org/gump/public/jmock2/jmock2-test/rss.xml
- Atom: http://vmgump.apache.org/gump/public/jmock2/jmock2-test/atom.xml

============================== Gump Tracking Only ===
Produced by Apache Gump(TM) version 2.3.
Gump Run 11000031122011, vmgump.apache.org:vmgump:11000031122011
Gump E-mail Identifier (unique within run) #24.

*********************************************************** G U M P
[GUMP@vmgump]: Project objenesis-all (in module objenesis) failed
To whom it may engage...
        
This is an automated request, but not an unsolicited one. For 
more information please visit http://gump.apache.org/nagged.html, 
and/or contact the folk at general@gump.apache.org.

Project objenesis-all has an issue affecting its community integration.
This issue affects 1 projects,
 and has been outstanding for 71 runs.
The current state of this project is 'Failed', with reason 'Build Failed'.
For reference only, the following projects are affected by this:
    - objenesis-all :  Objenesis is a small Java library that serves one purpose: T...


Full details are available at:
    http://vmgump.apache.org/gump/public/objenesis/objenesis-all/index.html

That said, some information snippets are provided here.

The following annotations (debug/informational/warning/error messages) were provided:
 -WARNING- Overriding Maven settings: [/srv/gump/public/workspace/objenesis/gump_mvn_settings.xml]
 -DEBUG- (Apache Gump generated) Apache Maven Settings in: /srv/gump/public/workspace/objenesis/gump_mvn_settings.xml
 -INFO- Failed with reason build failed
 -DEBUG- Maven POM in: /srv/gump/public/workspace/objenesis/pom.xml



The following work was performed:
http://vmgump.apache.org/gump/public/objenesis/objenesis-all/gump_work/build_objenesis_objenesis-all.html
Work Name: build_objenesis_objenesis-all (Type: Build)
Work ended in a state of : Failed
Elapsed: 1 min 4 secs
Command Line: /opt/maven2/bin/mvn --batch-mode --settings /srv/gump/public/workspace/objenesis/gump_mvn_settings.xml package 
[Working Directory: /srv/gump/public/workspace/objenesis]
M2_HOME: /opt/maven2
---------------------------------------------
[INFO] Unable to find resource 'org.springframework:org.springframework.core:jar:2.5.6.A' in repository spring-ext (http://springframework.svn.sourceforge.net/svnroot/springframework/repos/repo-ext/)
Downloading: http://repository.springsource.com/maven/bundles/release/org/springframework/org.springframework.core/2.5.6.A/org.springframework.core-2.5.6.A.jar
278K downloaded  (org.springframework.core-2.5.6.A.jar)
Downloading: http://springframework.svn.sourceforge.net/svnroot/springframework/repos/repo-ext//org/springframework/org.springframework.context/2.5.6.A/org.springframework.context-2.5.6.A.jar
[INFO] Unable to find resource 'org.springframework:org.springframework.context:jar:2.5.6.A' in repository spring-ext (http://springframework.svn.sourceforge.net/svnroot/springframework/repos/repo-ext/)
Downloading: http://repository.springsource.com/maven/bundles/release/org/springframework/org.springframework.context/2.5.6.A/org.springframework.context-2.5.6.A.jar
465K downloaded  (org.springframework.context-2.5.6.A.jar)
[INFO] ------------------------------------------------------------------------
[ERROR] BUILD ERROR
[INFO] ------------------------------------------------------------------------
[INFO] Failed to resolve artifact.

Missing:
----------
1) org.springframework.osgi:log4j.osgi:jar:1.2.15-SNAPSHOT

  Try downloading the file manually from the project website.

  Then, install it using the command: 
      mvn install:install-file -DgroupId=org.springframework.osgi -DartifactId=log4j.osgi -Dversion=1.2.15-SNAPSHOT -Dpackaging=jar -Dfile=/path/to/file

  Alternatively, if you host your own repository you can deploy the file there: 
      mvn deploy:deploy-file -DgroupId=org.springframework.osgi -DartifactId=log4j.osgi -Dversion=1.2.15-SNAPSHOT -Dpackaging=jar -Dfile=/path/to/file -Durl=[url] -DrepositoryId=[id]

  Path to dependency: 
  	1) org.objenesis:objenesis-tck:jar:1.2
  	2) org.springframework.osgi:log4j.osgi:jar:1.2.15-SNAPSHOT

----------
1 required artifact is missing.

for artifact: 
  org.objenesis:objenesis-tck:jar:1.2

from the specified remote repositories:
  com.springsource.repository.bundles.release (http://repository.springsource.com/maven/bundles/release),
  com.springsource.repository.bundles.external (http://repository.springsource.com/maven/bundles/external),
  gump-central (http://localhost:8192/maven2),
  i21-s3-osgi-repo (http://maven.springframework.org/osgi),
  spring-ext (http://springframework.svn.sourceforge.net/svnroot/springframework/repos/repo-ext/)



[INFO] ------------------------------------------------------------------------
[INFO] For more information, run Maven with the -e switch
[INFO] ------------------------------------------------------------------------
[INFO] Total time: 1 minute 3 seconds
[INFO] Finished at: Sat Dec 31 03:00:51 UTC 2011
[INFO] Final Memory: 35M/84M
[INFO] ------------------------------------------------------------------------
---------------------------------------------

To subscribe to this information via syndicated feeds:
- RSS: http://vmgump.apache.org/gump/public/objenesis/objenesis-all/rss.xml
- Atom: http://vmgump.apache.org/gump/public/objenesis/objenesis-all/atom.xml

============================== Gump Tracking Only ===
Produced by Apache Gump(TM) version 2.3.
Gump Run 11000031122011, vmgump.apache.org:vmgump:11000031122011
Gump E-mail Identifier (unique within run) #25.

*********************************************************** G U M P
[GUMP@vmgump]: Module jgroups success, but with warnings.
To whom it may engage...
        
This is an automated request, but not an unsolicited one. For 
more information please visit http://gump.apache.org/nagged.html, 
and/or contact the folk at general@gump.apache.org.

Module jgroups contains errors.
The current state of this module is 'Success'.

Full details are available at:
    http://vmgump.apache.org/gump/public/jgroups/index.html

That said, some information snippets are provided here.

The following annotations (debug/informational/warning/error messages) were provided:
 -ERROR- *** Failed to update from source control.Stale contents ***



The following work was performed:
http://vmgump.apache.org/gump/public/jgroups/gump_work/update_jgroups.html
Work Name: update_jgroups (Type: Update)
Work ended in a state of : Failed
Elapsed: 
Command Line: git pull --quiet git://github.com/belaban/JGroups.git 
[Working Directory: /srv/gump/public/workspace/cvs/jgroups]
---------------------------------------------
You asked to pull from the remote 'git://github.com/belaban/JGroups.git', but did not specify
a branch. Because this is not the default configured remote
for your current branch, you must specify a branch on the command line.
---------------------------------------------

To subscribe to this information via syndicated feeds:
- RSS: http://vmgump.apache.org/gump/public/jgroups/rss.xml
- Atom: http://vmgump.apache.org/gump/public/jgroups/atom.xml

============================== Gump Tracking Only ===
Produced by Apache Gump(TM) version 2.3.
Gump Run 11000031122011, vmgump.apache.org:vmgump:11000031122011
Gump E-mail Identifier (unique within run) #26.

*********************************************************** G U M P
[GUMP@vmgump]: Project pdfbox-lucene (in module pdfbox) failed
To whom it may engage...
        
This is an automated request, but not an unsolicited one. For 
more information please visit http://gump.apache.org/nagged.html, 
and/or contact the folk at general@gump.apache.org.

Project pdfbox-lucene has an issue affecting its community integration.
This issue affects 1 projects,
 and has been outstanding for 134 runs.
The current state of this project is 'Failed', with reason 'Build Failed'.
For reference only, the following projects are affected by this:
    - pdfbox-lucene :  Apache PDFBox is an open source Java PDF library for working...


Full details are available at:
    http://vmgump.apache.org/gump/public/pdfbox/pdfbox-lucene/index.html

That said, some information snippets are provided here.

The following annotations (debug/informational/warning/error messages) were provided:
 -DEBUG- Sole jar output [pdfbox-lucene-*[0-9T].jar] identifier set to project name
 -INFO- Optional dependency lucene-java-contrib prerequisite failed with reason build failed
 -DEBUG- (Apache Gump generated) Apache Maven Settings in: /srv/gump/public/workspace/pdfbox/lucene/gump_mvn_settings.xml
 -INFO- Failed with reason build failed
 -DEBUG- Maven POM in: /srv/gump/public/workspace/pdfbox/lucene/pom.xml
 -INFO- Failed to extract fallback artifacts from Gump Repository



The following work was performed:
http://vmgump.apache.org/gump/public/pdfbox/pdfbox-lucene/gump_work/build_pdfbox_pdfbox-lucene.html
Work Name: build_pdfbox_pdfbox-lucene (Type: Build)
Work ended in a state of : Failed
Elapsed: 11 secs
Command Line: /opt/maven2/bin/mvn --batch-mode --settings /srv/gump/public/workspace/pdfbox/lucene/gump_mvn_settings.xml package 
[Working Directory: /srv/gump/public/workspace/pdfbox/lucene]
M2_HOME: /opt/maven2
---------------------------------------------
/srv/gump/public/workspace/pdfbox/lucene/src/main/java/org/apache/pdfbox/lucene/LucenePDFDocument.java:[170,72] cannot find symbol
symbol  : variable Index
location: class org.apache.lucene.document.Field
/srv/gump/public/workspace/pdfbox/lucene/src/main/java/org/apache/pdfbox/lucene/LucenePDFDocument.java:[170,26] internal error; cannot instantiate org.apache.lucene.document.Field.<init> at org.apache.lucene.document.Field to ()
/srv/gump/public/workspace/pdfbox/lucene/src/main/java/org/apache/pdfbox/lucene/LucenePDFDocument.java:[178,26] cannot find symbol
symbol  : constructor Field(java.lang.String,java.io.Reader)
location: class org.apache.lucene.document.Field
/srv/gump/public/workspace/pdfbox/lucene/src/main/java/org/apache/pdfbox/lucene/LucenePDFDocument.java:[186,55] cannot find symbol
symbol  : variable Store
location: class org.apache.lucene.document.Field
/srv/gump/public/workspace/pdfbox/lucene/src/main/java/org/apache/pdfbox/lucene/LucenePDFDocument.java:[186,72] cannot find symbol
symbol  : variable Index
location: class org.apache.lucene.document.Field
/srv/gump/public/workspace/pdfbox/lucene/src/main/java/org/apache/pdfbox/lucene/LucenePDFDocument.java:[186,26] internal error; cannot instantiate org.apache.lucene.document.Field.<init> at org.apache.lucene.document.Field to ()
/srv/gump/public/workspace/pdfbox/lucene/src/main/java/org/apache/pdfbox/lucene/LucenePDFDocument.java:[210,55] cannot find symbol
symbol  : variable Store
location: class org.apache.lucene.document.Field
/srv/gump/public/workspace/pdfbox/lucene/src/main/java/org/apache/pdfbox/lucene/LucenePDFDocument.java:[210,72] cannot find symbol
symbol  : variable Index
location: class org.apache.lucene.document.Field
/srv/gump/public/workspace/pdfbox/lucene/src/main/java/org/apache/pdfbox/lucene/LucenePDFDocument.java:[210,26] internal error; cannot instantiate org.apache.lucene.document.Field.<init> at org.apache.lucene.document.Field to ()
/srv/gump/public/workspace/pdfbox/lucene/src/main/java/org/apache/pdfbox/lucene/LucenePDFDocument.java:[218,55] cannot find symbol
symbol  : variable Store
location: class org.apache.lucene.document.Field
/srv/gump/public/workspace/pdfbox/lucene/src/main/java/org/apache/pdfbox/lucene/LucenePDFDocument.java:[218,71] cannot find symbol
symbol  : variable Index
location: class org.apache.lucene.document.Field
/srv/gump/public/workspace/pdfbox/lucene/src/main/java/org/apache/pdfbox/lucene/LucenePDFDocument.java:[218,26] internal error; cannot instantiate org.apache.lucene.document.Field.<init> at org.apache.lucene.document.Field to ()
/srv/gump/public/workspace/pdfbox/lucene/src/main/java/org/apache/pdfbox/lucene/IndexFiles.java:[120,48] cannot find symbol
symbol  : class StandardAnalyzer
location: class org.apache.pdfbox.lucene.IndexFiles
/srv/gump/public/workspace/pdfbox/lucene/src/main/java/org/apache/pdfbox/lucene/IndexFiles.java:[120,87] cannot find symbol
symbol  : variable MaxFieldLength
location: class org.apache.lucene.index.IndexWriter
/srv/gump/public/workspace/pdfbox/lucene/src/main/java/org/apache/pdfbox/lucene/IndexFiles.java:[120,21] internal error; cannot instantiate org.apache.lucene.index.IndexWriter.<init> at org.apache.lucene.index.IndexWriter to ()
/srv/gump/public/workspace/pdfbox/lucene/src/main/java/org/apache/pdfbox/lucene/IndexFiles.java:[131,18] cannot find symbol
symbol  : method optimize()
location: class org.apache.lucene.index.IndexWriter
/srv/gump/public/workspace/pdfbox/lucene/src/main/java/org/apache/pdfbox/lucene/IndexFiles.java:[163,32] cannot find symbol
symbol  : method open(java.lang.String)
location: class org.apache.lucene.index.IndexReader
/srv/gump/public/workspace/pdfbox/lucene/src/main/java/org/apache/pdfbox/lucene/IndexFiles.java:[164,28] terms(java.lang.String) in org.apache.lucene.index.IndexReader cannot be applied to (org.apache.lucene.index.Term)

[INFO] ------------------------------------------------------------------------
[INFO] For more information, run Maven with the -e switch
[INFO] ------------------------------------------------------------------------
[INFO] Total time: 10 seconds
[INFO] Finished at: Sat Dec 31 03:29:48 UTC 2011
[INFO] Final Memory: 26M/62M
[INFO] ------------------------------------------------------------------------
---------------------------------------------

To subscribe to this information via syndicated feeds:
- RSS: http://vmgump.apache.org/gump/public/pdfbox/pdfbox-lucene/rss.xml
- Atom: http://vmgump.apache.org/gump/public/pdfbox/pdfbox-lucene/atom.xml

============================== Gump Tracking Only ===
Produced by Apache Gump(TM) version 2.3.
Gump Run 11000031122011, vmgump.apache.org:vmgump:11000031122011
Gump E-mail Identifier (unique within run) #27.

*********************************************************** G U M P
[GUMP@vmgump]: Module slf4j success, but with warnings.
To whom it may engage...
        
This is an automated request, but not an unsolicited one. For 
more information please visit http://gump.apache.org/nagged.html, 
and/or contact the folk at general@gump.apache.org.

Module slf4j contains errors.
The current state of this module is 'Success'.

Full details are available at:
    http://vmgump.apache.org/gump/public/slf4j/index.html

That said, some information snippets are provided here.

The following annotations (debug/informational/warning/error messages) were provided:
 -ERROR- *** Failed to update from source control.Stale contents ***



The following work was performed:
http://vmgump.apache.org/gump/public/slf4j/gump_work/update_slf4j.html
Work Name: update_slf4j (Type: Update)
Work ended in a state of : Failed
Elapsed: 1 sec
Command Line: git pull --quiet git://github.com/ceki/slf4j.git 
[Working Directory: /srv/gump/public/workspace/cvs/slf4j]
---------------------------------------------
You asked to pull from the remote 'git://github.com/ceki/slf4j.git', but did not specify
a branch. Because this is not the default configured remote
for your current branch, you must specify a branch on the command line.
---------------------------------------------

To subscribe to this information via syndicated feeds:
- RSS: http://vmgump.apache.org/gump/public/slf4j/rss.xml
- Atom: http://vmgump.apache.org/gump/public/slf4j/atom.xml

============================== Gump Tracking Only ===
Produced by Apache Gump(TM) version 2.3.
Gump Run 11000031122011, vmgump.apache.org:vmgump:11000031122011
Gump E-mail Identifier (unique within run) #28.

*********************************************************** G U M P
[GUMP@vmgump]: Project httpcomponents-client (in module httpcomponents) failed
To whom it may engage...
        
This is an automated request, but not an unsolicited one. For 
more information please visit http://gump.apache.org/nagged.html, 
and/or contact the folk at general@gump.apache.org.

Project httpcomponents-client has an issue affecting its community integration.
This issue affects 4 projects,
 and has been outstanding for 102 runs.
The current state of this project is 'Failed', with reason 'Build Failed'.
For reference only, the following projects are affected by this:
    - httpcomponents-client :  HttpComponents Client
    - httpcomponents-client-test :  HttpComponents Client
    - jmeter-svn :  Pure Java load testing and performance measurement tool.
   ...
    - jmeter-test :  Pure Java load testing and performance measurement tool.
   ...


Full details are available at:
    http://vmgump.apache.org/gump/public/httpcomponents/httpcomponents-client/index.html

That said, some information snippets are provided here.

The following annotations (debug/informational/warning/error messages) were provided:
 -DEBUG- (Apache Gump generated) Apache Maven Settings in: /srv/gump/public/workspace/httpcomponents/httpclient/gump_mvn_settings.xml
 -INFO- Failed with reason build failed
 -DEBUG- Maven POM in: /srv/gump/public/workspace/httpcomponents/httpclient/pom.xml
 -INFO- Failed to extract fallback artifacts from Gump Repository



The following work was performed:
http://vmgump.apache.org/gump/public/httpcomponents/httpcomponents-client/gump_work/build_httpcomponents_httpcomponents-client.html
Work Name: build_httpcomponents_httpcomponents-client (Type: Build)
Work ended in a state of : Failed
Elapsed: 25 secs
Command Line: /opt/maven2/bin/mvn --batch-mode -DskipTests=true --settings /srv/gump/public/workspace/httpcomponents/httpclient/gump_mvn_settings.xml package 
[Working Directory: /srv/gump/public/workspace/httpcomponents/httpclient]
M2_HOME: /opt/maven2
---------------------------------------------
Exception while executing SCM command.
[INFO] Storing buildScmBranch: UNKNOWN_BRANCH
[INFO] [notice:generate {execution: attach-notice-license}]
[INFO] Generating NOTICE and LICENSE resources
[debug] execute contextualize
[INFO] [resources:resources {execution: default-resources}]
[INFO] Using 'UTF-8' encoding to copy filtered resources.
[INFO] Copying 1 resource
[INFO] Copying 2 resources to META-INF
Downloading: http://files.couchbase.com/maven2//org/apache/httpcomponents/httpcore/4.2-alpha2/httpcore-4.2-alpha2.pom
[INFO] Unable to find resource 'org.apache.httpcomponents:httpcore:pom:4.2-alpha2' in repository spy (http://files.couchbase.com/maven2/)
Downloading: http://localhost:8192/maven2/org/apache/httpcomponents/httpcore/4.2-alpha2/httpcore-4.2-alpha2.pom

Downloading: http://files.couchbase.com/maven2//org/apache/httpcomponents/httpcomponents-core/4.2-alpha2/httpcomponents-core-4.2-alpha2.pom
[INFO] Unable to find resource 'org.apache.httpcomponents:httpcomponents-core:pom:4.2-alpha2' in repository spy (http://files.couchbase.com/maven2/)
Downloading: http://localhost:8192/maven2/org/apache/httpcomponents/httpcomponents-core/4.2-alpha2/httpcomponents-core-4.2-alpha2.pom

Downloading: http://files.couchbase.com/maven2//commons-codec/commons-codec/1.4/commons-codec-1.4.pom
[INFO] Unable to find resource 'commons-codec:commons-codec:pom:1.4' in repository spy (http://files.couchbase.com/maven2/)
Downloading: http://localhost:8192/maven2/commons-codec/commons-codec/1.4/commons-codec-1.4.pom

Downloading: http://files.couchbase.com/maven2//org/apache/httpcomponents/httpcore/4.2-alpha2/httpcore-4.2-alpha2.jar
Downloading: http://files.couchbase.com/maven2//commons-codec/commons-codec/1.4/commons-codec-1.4.jar
[INFO] Unable to find resource 'org.apache.httpcomponents:httpcore:jar:4.2-alpha2' in repository spy (http://files.couchbase.com/maven2/)
Downloading: http://localhost:8192/maven2/org/apache/httpcomponents/httpcore/4.2-alpha2/httpcore-4.2-alpha2.jar
[INFO] Unable to find resource 'commons-codec:commons-codec:jar:1.4' in repository spy (http://files.couchbase.com/maven2/)
Downloading: http://localhost:8192/maven2/commons-codec/commons-codec/1.4/commons-codec-1.4.jar
75K downloaded  (commons-codec-1.4.jar)
213K downloaded  (httpcore-4.2-alpha2.jar)
[INFO] [compiler:compile {execution: default-compile}]
[INFO] Compiling 280 source files to /srv/gump/public/workspace/httpcomponents/httpclient/httpclient/target/classes
[INFO] -------------------------------------------------------------
[ERROR] COMPILATION ERROR : 
[INFO] -------------------------------------------------------------
[ERROR] /srv/gump/public/workspace/httpcomponents/httpclient/httpclient/src/main/java/org/apache/http/impl/conn/PoolingClientConnectionManager.java:[285,17] shutdown() in org.apache.http.pool.AbstractConnPool<org.apache.http.conn.routing.HttpRoute,org.apache.http.conn.OperatedClientConnection,org.apache.http.impl.conn.HttpPoolEntry> cannot be applied to (long)
[INFO] 1 error
[INFO] -------------------------------------------------------------
[INFO] ------------------------------------------------------------------------
[ERROR] BUILD FAILURE
[INFO] ------------------------------------------------------------------------
[INFO] Compilation failure
/srv/gump/public/workspace/httpcomponents/httpclient/httpclient/src/main/java/org/apache/http/impl/conn/PoolingClientConnectionManager.java:[285,17] shutdown() in org.apache.http.pool.AbstractConnPool<org.apache.http.conn.routing.HttpRoute,org.apache.http.conn.OperatedClientConnection,org.apache.http.impl.conn.HttpPoolEntry> cannot be applied to (long)

[INFO] ------------------------------------------------------------------------
[INFO] For more information, run Maven with the -e switch
[INFO] ------------------------------------------------------------------------
[INFO] Total time: 24 seconds
[INFO] Finished at: Sat Dec 31 04:06:39 UTC 2011
[INFO] Final Memory: 66M/159M
[INFO] ------------------------------------------------------------------------
---------------------------------------------

To subscribe to this information via syndicated feeds:
- RSS: http://vmgump.apache.org/gump/public/httpcomponents/httpcomponents-client/rss.xml
- Atom: http://vmgump.apache.org/gump/public/httpcomponents/httpcomponents-client/atom.xml

============================== Gump Tracking Only ===
Produced by Apache Gump(TM) version 2.3.
Gump Run 11000031122011, vmgump.apache.org:vmgump:11000031122011
Gump E-mail Identifier (unique within run) #29.

*********************************************************** G U M P
[GUMP@vmgump]: Project jtidy-svn (in module jtidy) failed
To whom it may engage...
        
This is an automated request, but not an unsolicited one. For 
more information please visit http://gump.apache.org/nagged.html, 
and/or contact the folk at general@gump.apache.org.

Project jtidy-svn has an issue affecting its community integration.
This issue affects 2 projects,
 and has been outstanding for 765 runs.
The current state of this project is 'Failed', with reason 'Build Failed'.
For reference only, the following projects are affected by this:
    - forrest-test :  Apache Forrest software is a publishing framework that trans...
    - jtidy-svn :  HTML Templates


Full details are available at:
    http://vmgump.apache.org/gump/public/jtidy/jtidy-svn/index.html

That said, some information snippets are provided here.

The following annotations (debug/informational/warning/error messages) were provided:
 -DEBUG- Sole jar output [jtidy-8.0-SNAPSHOT.jar] identifier set to project name
 -DEBUG- (Apache Gump generated) Apache Maven Settings in: /srv/gump/public/workspace/jtidy/gump_mvn_settings.xml
 -INFO- Failed with reason build failed
 -DEBUG- Maven POM in: /srv/gump/public/workspace/jtidy/pom.xml
 -INFO- Failed to extract fallback artifacts from Gump Repository



The following work was performed:
http://vmgump.apache.org/gump/public/jtidy/jtidy-svn/gump_work/build_jtidy_jtidy-svn.html
Work Name: build_jtidy_jtidy-svn (Type: Build)
Work ended in a state of : Failed
Elapsed: 17 secs
Command Line: /opt/maven2/bin/mvn --batch-mode --settings /srv/gump/public/workspace/jtidy/gump_mvn_settings.xml package 
[Working Directory: /srv/gump/public/workspace/jtidy]
M2_HOME: /opt/maven2
---------------------------------------------
1) com.sun.jmx:jmxri:jar:1.2.1

  Try downloading the file manually from the project website.

  Then, install it using the command: 
      mvn install:install-file -DgroupId=com.sun.jmx -DartifactId=jmxri -Dversion=1.2.1 -Dpackaging=jar -Dfile=/path/to/file

  Alternatively, if you host your own repository you can deploy the file there: 
      mvn deploy:deploy-file -DgroupId=com.sun.jmx -DartifactId=jmxri -Dversion=1.2.1 -Dpackaging=jar -Dfile=/path/to/file -Durl=[url] -DrepositoryId=[id]

  Path to dependency: 
  	1) net.sf.jtidy:jtidy:jar:8.0-SNAPSHOT
  	2) log4j:log4j:jar:1.2.15
  	3) com.sun.jmx:jmxri:jar:1.2.1

2) com.sun.jdmk:jmxtools:jar:1.2.1

  Try downloading the file manually from: 
      http://java.sun.com/products/JavaManagement/download.html

  Then, install it using the command: 
      mvn install:install-file -DgroupId=com.sun.jdmk -DartifactId=jmxtools -Dversion=1.2.1 -Dpackaging=jar -Dfile=/path/to/file

  Alternatively, if you host your own repository you can deploy the file there: 
      mvn deploy:deploy-file -DgroupId=com.sun.jdmk -DartifactId=jmxtools -Dversion=1.2.1 -Dpackaging=jar -Dfile=/path/to/file -Durl=[url] -DrepositoryId=[id]

  Path to dependency: 
  	1) net.sf.jtidy:jtidy:jar:8.0-SNAPSHOT
  	2) log4j:log4j:jar:1.2.15
  	3) com.sun.jdmk:jmxtools:jar:1.2.1

----------
2 required artifacts are missing.

for artifact: 
  net.sf.jtidy:jtidy:jar:8.0-SNAPSHOT

from the specified remote repositories:
  gump-central (http://localhost:8192/maven2),
  jtidy (http://jtidy.sourceforge.net/maven2/)



[INFO] ------------------------------------------------------------------------
[INFO] For more information, run Maven with the -e switch
[INFO] ------------------------------------------------------------------------
[INFO] Total time: 16 seconds
[INFO] Finished at: Sat Dec 31 04:19:33 UTC 2011
[INFO] Final Memory: 21M/58M
[INFO] ------------------------------------------------------------------------
---------------------------------------------

To subscribe to this information via syndicated feeds:
- RSS: http://vmgump.apache.org/gump/public/jtidy/jtidy-svn/rss.xml
- Atom: http://vmgump.apache.org/gump/public/jtidy/jtidy-svn/atom.xml

============================== Gump Tracking Only ===
Produced by Apache Gump(TM) version 2.3.
Gump Run 11000031122011, vmgump.apache.org:vmgump:11000031122011
Gump E-mail Identifier (unique within run) #30.

*********************************************************** G U M P
[GUMP@vmgump]: Project camel-spring-test (in module camel) failed
To whom it may engage...
        
This is an automated request, but not an unsolicited one. For 
more information please visit http://gump.apache.org/nagged.html, 
and/or contact the folk at general@gump.apache.org.

Project camel-spring-test has an issue affecting its community integration.
This issue affects 1 projects,
 and has been outstanding for 3 runs.
The current state of this project is 'Failed', with reason 'Build Failed'.
For reference only, the following projects are affected by this:
    - camel-spring-test :  Integration framework based on known Enterprise Integration
...


Full details are available at:
    http://vmgump.apache.org/gump/public/camel/camel-spring-test/index.html

That said, some information snippets are provided here.

The following annotations (debug/informational/warning/error messages) were provided:
 -WARNING- Overriding Maven settings: [/srv/gump/public/workspace/camel/components/camel-spring/gump_mvn_settings.xml]
 -DEBUG- (Apache Gump generated) Apache Maven Settings in: /srv/gump/public/workspace/camel/components/camel-spring/gump_mvn_settings.xml
 -INFO- Failed with reason build failed
 -DEBUG- Maven POM in: /srv/gump/public/workspace/camel/components/camel-spring/pom.xml
 -INFO- Project Reports in: /srv/gump/public/workspace/camel/components/camel-spring/target/surefire-reports



The following work was performed:
http://vmgump.apache.org/gump/public/camel/camel-spring-test/gump_work/build_camel_camel-spring-test.html
Work Name: build_camel_camel-spring-test (Type: Build)
Work ended in a state of : Failed
Elapsed: 8 mins 44 secs
Command Line: /opt/maven2/bin/mvn --batch-mode --settings /srv/gump/public/workspace/camel/components/camel-spring/gump_mvn_settings.xml test 
[Working Directory: /srv/gump/public/workspace/camel/components/camel-spring]
M2_HOME: /opt/maven2
---------------------------------------------
Tests run: 1, Failures: 0, Errors: 0, Skipped: 0, Time elapsed: 0.31 sec
Running org.apache.camel.spring.remoting.SpringRemotingWithExportAndProxyTest
Tests run: 1, Failures: 0, Errors: 0, Skipped: 0, Time elapsed: 0.305 sec
Running org.apache.camel.spring.remoting.SpringRemotingWithOneWayTest
Tests run: 1, Failures: 0, Errors: 0, Skipped: 0, Time elapsed: 0.302 sec
Running org.apache.camel.spring.remoting.SpringRemotingWithServiceExportAndNamespacesRouteTest
Tests run: 1, Failures: 0, Errors: 0, Skipped: 0, Time elapsed: 0.307 sec
Running org.apache.camel.spring.remoting.SpringRemotingWithServiceExportRouteTest
Tests run: 1, Failures: 0, Errors: 0, Skipped: 0, Time elapsed: 0.311 sec
Running org.apache.camel.spring.routebuilder.CamelRouteBuilderTest
Tests run: 1, Failures: 0, Errors: 0, Skipped: 0, Time elapsed: 0.134 sec
Running org.apache.camel.spring.scan.DefaultPackageScanClassResolverTest
Tests run: 13, Failures: 0, Errors: 0, Skipped: 0, Time elapsed: 0.018 sec
Running org.apache.camel.spring.scan.PackageScanFiltersTest
Tests run: 5, Failures: 0, Errors: 0, Skipped: 0, Time elapsed: 0.001 sec
Running org.apache.camel.spring.scan.PatternBasedPackageScanFilterTest
Tests run: 6, Failures: 0, Errors: 0, Skipped: 0, Time elapsed: 0.003 sec
Running org.apache.camel.spring.util.EndpointHelperTest
Tests run: 1, Failures: 0, Errors: 0, Skipped: 0, Time elapsed: 0.113 sec
Running org.apache.camel.spring.util.MainRunnerTest
Tests run: 1, Failures: 0, Errors: 0, Skipped: 0, Time elapsed: 0.012 sec
Running org.apache.camel.spring.xml.SpringXmlRouteBuilderTest
Tests run: 13, Failures: 0, Errors: 0, Skipped: 0, Time elapsed: 4.816 sec
Running org.apache.camel.util.spring.KeyStoreParametersFactoryBeanTest
Tests run: 1, Failures: 0, Errors: 0, Skipped: 0, Time elapsed: 0.133 sec
Running org.apache.camel.util.spring.SSLContextParametersFactoryBeanTest
Tests run: 1, Failures: 0, Errors: 0, Skipped: 0, Time elapsed: 0.556 sec
Running org.apache.camel.util.spring.SecureRandomParametersFactoryBeanTest
Tests run: 1, Failures: 0, Errors: 0, Skipped: 0, Time elapsed: 0.026 sec

Results :

Failed tests: 
  testMocksAreValid(org.apache.camel.component.test.SpringTestEndpointTest): test://seda:foo Received message count. Expected: <0> but was: <1>

Tests run: 886, Failures: 1, Errors: 0, Skipped: 1

[INFO] ------------------------------------------------------------------------
[ERROR] BUILD FAILURE
[INFO] ------------------------------------------------------------------------
[INFO] There are test failures.

Please refer to /srv/gump/public/workspace/camel/components/camel-spring/target/surefire-reports for the individual test results.
[INFO] ------------------------------------------------------------------------
[INFO] For more information, run Maven with the -e switch
[INFO] ------------------------------------------------------------------------
[INFO] Total time: 8 minutes 42 seconds
[INFO] Finished at: Sat Dec 31 04:51:15 UTC 2011
[INFO] Final Memory: 50M/121M
[INFO] ------------------------------------------------------------------------
---------------------------------------------

To subscribe to this information via syndicated feeds:
- RSS: http://vmgump.apache.org/gump/public/camel/camel-spring-test/rss.xml
- Atom: http://vmgump.apache.org/gump/public/camel/camel-spring-test/atom.xml

============================== Gump Tracking Only ===
Produced by Apache Gump(TM) version 2.3.
Gump Run 11000031122011, vmgump.apache.org:vmgump:11000031122011
Gump E-mail Identifier (unique within run) #31.

*********************************************************** G U M P
[GUMP@vmgump]: Project commons-jci-reactor (in module apache-commons) failed
To whom it may engage...
        
This is an automated request, but not an unsolicited one. For 
more information please visit http://gump.apache.org/nagged.html, 
and/or contact the folk at general@gump.apache.org.

Project commons-jci-reactor has an issue affecting its community integration.
This issue affects 1 projects,
 and has been outstanding for 443 runs.
The current state of this project is 'Failed', with reason 'Build Failed'.
For reference only, the following projects are affected by this:
    - commons-jci-reactor :  Apache Commons


Full details are available at:
    http://vmgump.apache.org/gump/public/apache-commons/commons-jci-reactor/index.html

That said, some information snippets are provided here.

The following annotations (debug/informational/warning/error messages) were provided:
 -WARNING- Overriding Maven settings: [/srv/gump/public/workspace/apache-commons/jci/gump_mvn_settings.xml]
 -DEBUG- (Apache Gump generated) Apache Maven Settings in: /srv/gump/public/workspace/apache-commons/jci/gump_mvn_settings.xml
 -INFO- Failed with reason build failed
 -DEBUG- Maven POM in: /srv/gump/public/workspace/apache-commons/jci/pom.xml
 -INFO- Project Reports in: /srv/gump/public/workspace/apache-commons/jci/compilers/groovy/target/surefire-reports
 -WARNING- No directory [/srv/gump/public/workspace/apache-commons/jci/compilers/groovy/target/surefire-reports]



The following work was performed:
http://vmgump.apache.org/gump/public/apache-commons/commons-jci-reactor/gump_work/build_apache-commons_commons-jci-reactor.html
Work Name: build_apache-commons_commons-jci-reactor (Type: Build)
Work ended in a state of : Failed
Elapsed: 1 min 28 secs
Command Line: /opt/maven2/bin/mvn --batch-mode --settings /srv/gump/public/workspace/apache-commons/jci/gump_mvn_settings.xml package 
[Working Directory: /srv/gump/public/workspace/apache-commons/jci]
M2_HOME: /opt/maven2
---------------------------------------------
[INFO] ------------------------------------------------------------------------
[INFO] Building compiler-eclipse
[INFO]    task-segment: [package]
[INFO] ------------------------------------------------------------------------
[INFO] [antrun:run {execution: javadoc.resources}]
[INFO] Executing tasks
[INFO] Executed tasks
[INFO] [remote-resources:process {execution: default}]
[INFO] [resources:resources {execution: default-resources}]
[INFO] Using 'iso-8859-1' encoding to copy filtered resources.
[INFO] Copying 0 resource to META-INF
[INFO] [compiler:compile {execution: default-compile}]
[INFO] Compiling 3 source files to /srv/gump/public/workspace/apache-commons/jci/compilers/eclipse/target/classes
[INFO] [bundle:manifest {execution: bundle-manifest}]
[INFO] [resources:testResources {execution: default-testResources}]
[INFO] Using 'iso-8859-1' encoding to copy filtered resources.
[INFO] Copying 1 resource
[INFO] [compiler:testCompile {execution: default-testCompile}]
[INFO] Compiling 2 source files to /srv/gump/public/workspace/apache-commons/jci/compilers/eclipse/target/test-classes
[INFO] [surefire:test {execution: default-test}]
[INFO] Surefire report directory: /srv/gump/public/workspace/apache-commons/jci/compilers/eclipse/target/surefire-reports

-------------------------------------------------------
 T E S T S
-------------------------------------------------------
Running org.apache.commons.jci.compilers.EclipseJavaCompilerSettingsTestCase
Tests run: 6, Failures: 0, Errors: 0, Skipped: 0, Time elapsed: 0.076 sec
Running org.apache.commons.jci.compilers.EclipseJavaCompilerTestCase
Tests run: 7, Failures: 1, Errors: 0, Skipped: 0, Time elapsed: 1.157 sec <<< FAILURE!

Results :

Failed tests: 
  testAdditionalTopLevelClassCompile(org.apache.commons.jci.compilers.EclipseJavaCompilerTestCase)

Tests run: 13, Failures: 1, Errors: 0, Skipped: 0

[INFO] ------------------------------------------------------------------------
[ERROR] BUILD FAILURE
[INFO] ------------------------------------------------------------------------
[INFO] There are test failures.

Please refer to /srv/gump/public/workspace/apache-commons/jci/compilers/eclipse/target/surefire-reports for the individual test results.
[INFO] ------------------------------------------------------------------------
[INFO] For more information, run Maven with the -e switch
[INFO] ------------------------------------------------------------------------
[INFO] Total time: 1 minute 27 seconds
[INFO] Finished at: Sat Dec 31 05:02:05 UTC 2011
[INFO] Final Memory: 38M/91M
[INFO] ------------------------------------------------------------------------
---------------------------------------------

To subscribe to this information via syndicated feeds:
- RSS: http://vmgump.apache.org/gump/public/apache-commons/commons-jci-reactor/rss.xml
- Atom: http://vmgump.apache.org/gump/public/apache-commons/commons-jci-reactor/atom.xml

============================== Gump Tracking Only ===
Produced by Apache Gump(TM) version 2.3.
Gump Run 11000031122011, vmgump.apache.org:vmgump:11000031122011
Gump E-mail Identifier (unique within run) #32.

*********************************************************** G U M P
[GUMP@vmgump]: Project jetty-util-test (in module jetty) failed
To whom it may engage...
        
This is an automated request, but not an unsolicited one. For 
more information please visit http://gump.apache.org/nagged.html, 
and/or contact the folk at general@gump.apache.org.

Project jetty-util-test has an issue affecting its community integration.
This issue affects 1 projects,
 and has been outstanding for 60 runs.
The current state of this project is 'Failed', with reason 'Build Failed'.
For reference only, the following projects are affected by this:
    - jetty-util-test :  Java HTTP Servlet Server


Full details are available at:
    http://vmgump.apache.org/gump/public/jetty/jetty-util-test/index.html

That said, some information snippets are provided here.

The following annotations (debug/informational/warning/error messages) were provided:
 -WARNING- Overriding Maven settings: [/srv/gump/public/workspace/jetty/jetty-util/gump_mvn_settings.xml]
 -DEBUG- (Apache Gump generated) Apache Maven Settings in: /srv/gump/public/workspace/jetty/jetty-util/gump_mvn_settings.xml
 -INFO- Failed with reason build failed
 -DEBUG- Maven POM in: /srv/gump/public/workspace/jetty/jetty-util/pom.xml



The following work was performed:
http://vmgump.apache.org/gump/public/jetty/jetty-util-test/gump_work/build_jetty_jetty-util-test.html
Work Name: build_jetty_jetty-util-test (Type: Build)
Work ended in a state of : Failed
Elapsed: 44 secs
Command Line: /opt/maven2/bin/mvn --batch-mode --settings /srv/gump/public/workspace/jetty/jetty-util/gump_mvn_settings.xml test 
[Working Directory: /srv/gump/public/workspace/jetty/jetty-util]
M2_HOME: /opt/maven2
---------------------------------------------
     +- org.eclipse.jetty.util.component.AggregateLifeCycle@29f01a29
     |
     +- org.eclipse.jetty.util.component.AggregateLifeCycle@52458f41
     +- org.eclipse.jetty.util.component.AggregateLifeCycle@54c01e99
--
org.eclipse.jetty.util.component.AggregateLifeCycle@7cf01771
 +- org.eclipse.jetty.util.component.AggregateLifeCycle@76933bcb
 |   +- org.eclipse.jetty.util.component.AggregateLifeCycle@37722456
 +- org.eclipse.jetty.util.component.AggregateLifeCycle@3c3ac93e
 |   +- org.eclipse.jetty.util.component.AggregateLifeCycle@26afa68a
 +- org.eclipse.jetty.util.component.AggregateLifeCycleTest$2@1389c036
     +- org.eclipse.jetty.util.component.AggregateLifeCycle@38aa233f
     +- org.eclipse.jetty.util.component.AggregateLifeCycle@29f01a29
     |   +- org.eclipse.jetty.util.component.AggregateLifeCycle@76933bcb
     |       +- org.eclipse.jetty.util.component.AggregateLifeCycle@37722456
     |
     +- org.eclipse.jetty.util.component.AggregateLifeCycle@52458f41
     +- org.eclipse.jetty.util.component.AggregateLifeCycle@54c01e99
Tests run: 2, Failures: 0, Errors: 0, Skipped: 0, Time elapsed: 0.012 sec
Running org.eclipse.jetty.util.component.LifeCycleListenerTest
Tests run: 3, Failures: 0, Errors: 3, Skipped: 0, Time elapsed: 0.046 sec <<< FAILURE!
Running org.eclipse.jetty.util.QuotedStringTokenizerTest
Tests run: 8, Failures: 0, Errors: 0, Skipped: 0, Time elapsed: 0.003 sec
Running org.eclipse.jetty.util.resource.ResourceTest
Tests run: 12, Failures: 0, Errors: 0, Skipped: 1, Time elapsed: 0.07 sec
Running org.eclipse.jetty.util.resource.ResourceCollectionTest
Tests run: 3, Failures: 0, Errors: 0, Skipped: 0, Time elapsed: 0.029 sec

Results :

Tests in error: 
  testStart(org.eclipse.jetty.util.component.LifeCycleListenerTest): org.eclipse.jetty.util.log.Slf4jLog cannot be cast to org.eclipse.jetty.util.log.StdErrLog
  testStop(org.eclipse.jetty.util.component.LifeCycleListenerTest): org.eclipse.jetty.util.log.Slf4jLog cannot be cast to org.eclipse.jetty.util.log.StdErrLog
  testRemoveLifecycleListener(org.eclipse.jetty.util.component.LifeCycleListenerTest): org.eclipse.jetty.util.log.Slf4jLog cannot be cast to org.eclipse.jetty.util.log.StdErrLog

Tests run: 139, Failures: 0, Errors: 3, Skipped: 1

[INFO] ------------------------------------------------------------------------
[ERROR] BUILD FAILURE
[INFO] ------------------------------------------------------------------------
[INFO] There are test failures.

Please refer to /srv/gump/public/workspace/jetty/jetty-util/target/surefire-reports for the individual test results.
[INFO] ------------------------------------------------------------------------
[INFO] For more information, run Maven with the -e switch
[INFO] ------------------------------------------------------------------------
[INFO] Total time: 43 seconds
[INFO] Finished at: Sat Dec 31 05:05:32 UTC 2011
[INFO] Final Memory: 35M/84M
[INFO] ------------------------------------------------------------------------
---------------------------------------------

To subscribe to this information via syndicated feeds:
- RSS: http://vmgump.apache.org/gump/public/jetty/jetty-util-test/rss.xml
- Atom: http://vmgump.apache.org/gump/public/jetty/jetty-util-test/atom.xml

============================== Gump Tracking Only ===
Produced by Apache Gump(TM) version 2.3.
Gump Run 11000031122011, vmgump.apache.org:vmgump:11000031122011
Gump E-mail Identifier (unique within run) #33.

*********************************************************** G U M P
[GUMP@vmgump]: Project castor-reactor (in module castor) failed
To whom it may engage...
        
This is an automated request, but not an unsolicited one. For 
more information please visit http://gump.apache.org/nagged.html, 
and/or contact the folk at general@gump.apache.org.

Project castor-reactor has an issue affecting its community integration.
This issue affects 15 projects,
 and has been outstanding for 775 runs.
The current state of this project is 'Failed', with reason 'Build Failed'.
For reference only, the following projects are affected by this:
    - castor :  Java to XML, SQL, LDAP bindings
    - castor-reactor :  Java to XML, SQL, LDAP bindings
    - castor-test :  Java to XML, SQL, LDAP bindings
    - commons-chain :  GoF "Chain of Responsibility" pattern
    - commons-fileupload :  Commons File Upload Package
    - jakarta-tomcat-4.0 :  Servlet 2.3 and JSP 1.2 Reference Implementation
    - jakarta-tomcat-catalina :  Servlet 2.4 Reference Implementation
    - jakarta-tomcat-coyote-tomcat4 :  Connectors to various web servers
    - jakarta-tomcat-jk :  Connectors to various web servers
    - portals-pluto-api-1.0 :  JSR168 Container
    - portals-pluto-container-1.0 :  JSR168 Container
    - portals-pluto-deploy-1.0 :  JSR168 Container
    - portals-pluto-descriptors-1.0 :  JSR168 Container
    - portals-pluto-portal-1.0 :  JSR168 Container
    - tomcat-catalina :  Servlet 2.3 and JSP 1.2 Reference Implementation


Full details are available at:
    http://vmgump.apache.org/gump/public/castor/castor-reactor/index.html

That said, some information snippets are provided here.

The following annotations (debug/informational/warning/error messages) were provided:
 -INFO- Optional dependency httpcomponents-client failed with reason build failed
 -DEBUG- (Apache Gump generated) Apache Maven Settings in: /srv/gump/public/workspace/castor/gump_mvn_settings.xml
 -INFO- Failed with reason build failed
 -DEBUG- Maven POM in: /srv/gump/public/workspace/castor/pom.xml



The following work was performed:
http://vmgump.apache.org/gump/public/castor/castor-reactor/gump_work/build_castor_castor-reactor.html
Work Name: build_castor_castor-reactor (Type: Build)
Work ended in a state of : Failed
Elapsed: 30 secs
Command Line: /opt/maven2/bin/mvn --batch-mode -DskipTests=true --settings /srv/gump/public/workspace/castor/gump_mvn_settings.xml package 
[Working Directory: /srv/gump/public/workspace/castor]
M2_HOME: /opt/maven2
---------------------------------------------
[INFO] ------------------------------------------------------------------------
[INFO] Building Castor XML - XML diff
[INFO]    task-segment: [package]
[INFO] ------------------------------------------------------------------------
[INFO] [enforcer:enforce {execution: enforce-maven}]
[debug] execute contextualize
[INFO] [resources:resources {execution: default-resources}]
[INFO] Using 'UTF-8' encoding to copy filtered resources.
[INFO] Copying 3 resources
[INFO] [compiler:compile {execution: default-compile}]
[INFO] Compiling 12 source files to /srv/gump/public/workspace/castor/diff/target/classes
[debug] execute contextualize
[INFO] [resources:testResources {execution: default-testResources}]
[INFO] Using 'UTF-8' encoding to copy filtered resources.
[INFO] skip non existing resourceDirectory /srv/gump/public/workspace/castor/diff/src/test/resources
[INFO] [compiler:testCompile {execution: default-testCompile}]
[INFO] No sources to compile
[WARNING] DEPRECATED [systemProperties]: Use systemPropertyVariables instead.
[INFO] [surefire:test {execution: default-test}]
[INFO] Tests are skipped.
[INFO] [jar:jar {execution: default-jar}]
[INFO] Building jar: /srv/gump/public/workspace/castor/diff/target/castor-xml-diff-1.3.3-SNAPSHOT.jar
[INFO] Preparing source:jar
[WARNING] Removing: jar from forked lifecycle, to prevent recursive invocation.
[INFO] [enforcer:enforce {execution: enforce-maven}]
[INFO] [source:jar {execution: default}]
[INFO] Building jar: /srv/gump/public/workspace/castor/diff/target/castor-xml-diff-1.3.3-SNAPSHOT-sources.jar
[INFO] ------------------------------------------------------------------------
[INFO] Building Castor XML - schema
[INFO]    task-segment: [package]
[INFO] ------------------------------------------------------------------------
[INFO] [enforcer:enforce {execution: enforce-maven}]
[INFO] [castor:generate {execution: default}]
[INFO] Successfully created an instance of the Castor XML source generator, release 1.3.1
[INFO] About to invoke method >setResourceDestination< on Castor's SourceGenerator class using reflection.
[INFO] Processing /srv/gump/public/workspace/castor/schema/src/main/resources/org/exolab/castor/xml/schema/annotations/jdo-extensions.xsd
[INFO] ------------------------------------------------------------------------
[ERROR] BUILD ERROR
[INFO] ------------------------------------------------------------------------
[INFO] Castor execution failed

Embedded error: org/apache/commons/lang/StringUtils
org.apache.commons.lang.StringUtils
[INFO] ------------------------------------------------------------------------
[INFO] For more information, run Maven with the -e switch
[INFO] ------------------------------------------------------------------------
[INFO] Total time: 29 seconds
[INFO] Finished at: Sat Dec 31 05:09:11 UTC 2011
[INFO] Final Memory: 36M/87M
[INFO] ------------------------------------------------------------------------
---------------------------------------------

To subscribe to this information via syndicated feeds:
- RSS: http://vmgump.apache.org/gump/public/castor/castor-reactor/rss.xml
- Atom: http://vmgump.apache.org/gump/public/castor/castor-reactor/atom.xml

============================== Gump Tracking Only ===
Produced by Apache Gump(TM) version 2.3.
Gump Run 11000031122011, vmgump.apache.org:vmgump:11000031122011
Gump E-mail Identifier (unique within run) #34.

*********************************************************** G U M P
[GUMP@vmgump]: Project velocity-tools-generic-test (in module velocity-tools) failed
To whom it may engage...
        
This is an automated request, but not an unsolicited one. For 
more information please visit http://gump.apache.org/nagged.html, 
and/or contact the folk at general@gump.apache.org.

Project velocity-tools-generic-test has an issue affecting its community integration.
This issue affects 1 projects,
 and has been outstanding for 300 runs.
The current state of this project is 'Failed', with reason 'Build Failed'.
For reference only, the following projects are affected by this:
    - velocity-tools-generic-test :  VelocityTools project


Full details are available at:
    http://vmgump.apache.org/gump/public/velocity-tools/velocity-tools-generic-test/index.html

That said, some information snippets are provided here.

The following annotations (debug/informational/warning/error messages) were provided:
 -WARNING- Overriding Maven settings: [/srv/gump/public/workspace/velocity-tools/velocity-tools-generic/gump_mvn_settings.xml]
 -DEBUG- (Apache Gump generated) Apache Maven Settings in: /srv/gump/public/workspace/velocity-tools/velocity-tools-generic/gump_mvn_settings.xml
 -INFO- Failed with reason build failed
 -DEBUG- Maven POM in: /srv/gump/public/workspace/velocity-tools/velocity-tools-generic/pom.xml



The following work was performed:
http://vmgump.apache.org/gump/public/velocity-tools/velocity-tools-generic-test/gump_work/build_velocity-tools_velocity-tools-generic-test.html
Work Name: build_velocity-tools_velocity-tools-generic-test (Type: Build)
Work ended in a state of : Failed
Elapsed: 8 secs
Command Line: /opt/maven2/bin/mvn --batch-mode --settings /srv/gump/public/workspace/velocity-tools/velocity-tools-generic/gump_mvn_settings.xml test 
[Working Directory: /srv/gump/public/workspace/velocity-tools/velocity-tools-generic]
M2_HOME: /opt/maven2
---------------------------------------------
[INFO] Copying 3 resources
[INFO] [compiler:testCompile {execution: default-testCompile}]
[INFO] Nothing to compile - all classes are up to date
[INFO] [surefire:test {execution: default-test}]
[INFO] Surefire report directory: /srv/gump/public/workspace/velocity-tools/velocity-tools-generic/target/surefire-reports

-------------------------------------------------------
 T E S T S
-------------------------------------------------------
Running org.apache.velocity.tools.generic.DisplayToolTests
Tests run: 36, Failures: 0, Errors: 0, Skipped: 0, Time elapsed: 0.189 sec
Running org.apache.velocity.tools.generic.ClassToolTests
Tests run: 26, Failures: 0, Errors: 0, Skipped: 0, Time elapsed: 0.064 sec
Running org.apache.velocity.tools.generic.DateToolTests
Tests run: 4, Failures: 0, Errors: 0, Skipped: 0, Time elapsed: 0.061 sec
Running org.apache.velocity.tools.generic.LoopToolTests
Tests run: 21, Failures: 0, Errors: 0, Skipped: 0, Time elapsed: 0.04 sec
Running org.apache.velocity.tools.test.whitebox.ConfigTests
Dec 31, 2011 5:26:07 AM org.apache.commons.beanutils.converters.NumberConverter toNumber
WARNING:     IntegerConverter cannot handle conversion from 'String' to 'Number'
Tests run: 14, Failures: 0, Errors: 0, Skipped: 0, Time elapsed: 0.306 sec
Running org.apache.velocity.tools.test.whitebox.GenericToolsTests
Tests run: 7, Failures: 0, Errors: 1, Skipped: 0, Time elapsed: 0.206 sec <<< FAILURE!
Running org.apache.velocity.tools.generic.Veltools128Tests
Tests run: 2, Failures: 0, Errors: 0, Skipped: 0, Time elapsed: 0.15 sec
Running org.apache.velocity.tools.generic.AlternatorToolTests
Tests run: 7, Failures: 0, Errors: 0, Skipped: 0, Time elapsed: 0.008 sec
Running org.apache.velocity.tools.generic.LinkToolTests
Tests run: 69, Failures: 0, Errors: 0, Skipped: 0, Time elapsed: 0.074 sec

Results :

Tests in error: 
  testEscapeTool(org.apache.velocity.tools.test.whitebox.GenericToolsTests)

Tests run: 186, Failures: 0, Errors: 1, Skipped: 0

[INFO] ------------------------------------------------------------------------
[ERROR] BUILD FAILURE
[INFO] ------------------------------------------------------------------------
[INFO] There are test failures.

Please refer to /srv/gump/public/workspace/velocity-tools/velocity-tools-generic/target/surefire-reports for the individual test results.
[INFO] ------------------------------------------------------------------------
[INFO] For more information, run Maven with the -e switch
[INFO] ------------------------------------------------------------------------
[INFO] Total time: 7 seconds
[INFO] Finished at: Sat Dec 31 05:26:07 UTC 2011
[INFO] Final Memory: 17M/41M
[INFO] ------------------------------------------------------------------------
---------------------------------------------

To subscribe to this information via syndicated feeds:
- RSS: http://vmgump.apache.org/gump/public/velocity-tools/velocity-tools-generic-test/rss.xml
- Atom: http://vmgump.apache.org/gump/public/velocity-tools/velocity-tools-generic-test/atom.xml

============================== Gump Tracking Only ===
Produced by Apache Gump(TM) version 2.3.
Gump Run 11000031122011, vmgump.apache.org:vmgump:11000031122011
Gump E-mail Identifier (unique within run) #36.

*********************************************************** G U M P
[GUMP@vmgump]: Project james-jsieve (in module james-jsieve) failed
To whom it may engage...
        
This is an automated request, but not an unsolicited one. For 
more information please visit http://gump.apache.org/nagged.html, 
and/or contact the folk at general@gump.apache.org.

Project james-jsieve has an issue affecting its community integration.
This issue affects 1 projects,
 and has been outstanding for 140 runs.
The current state of this project is 'Failed', with reason 'Build Failed'.
For reference only, the following projects are affected by this:
    - james-jsieve :  Implements JSIEVE Mail Filtering Language


Full details are available at:
    http://vmgump.apache.org/gump/public/james-jsieve/james-jsieve/index.html

That said, some information snippets are provided here.

The following annotations (debug/informational/warning/error messages) were provided:
 -WARNING- Overriding Maven settings: [/srv/gump/public/workspace/james-jsieve/gump_mvn_settings.xml]
 -DEBUG- (Apache Gump generated) Apache Maven Settings in: /srv/gump/public/workspace/james-jsieve/gump_mvn_settings.xml
 -INFO- Failed with reason build failed
 -DEBUG- Maven POM in: /srv/gump/public/workspace/james-jsieve/pom.xml



The following work was performed:
http://vmgump.apache.org/gump/public/james-jsieve/james-jsieve/gump_work/build_james-jsieve_james-jsieve.html
Work Name: build_james-jsieve_james-jsieve (Type: Build)
Work ended in a state of : Failed
Elapsed: 15 secs
Command Line: /opt/maven3/bin/mvn --batch-mode --settings /srv/gump/public/workspace/james-jsieve/gump_mvn_settings.xml install 
[Working Directory: /srv/gump/public/workspace/james-jsieve]
M2_HOME: /opt/maven3
---------------------------------------------
Ensure that the manifest does not have duplicate entries, and
that blank lines separate individual sections in both your
manifest and in the META-INF/MANIFEST.MF entry in the jar file.
Dec 31, 2011 5:39:32 AM java.util.jar.Attributes read
WARNING: Duplicate name in Manifest: url.
Ensure that the manifest does not have duplicate entries, and
that blank lines separate individual sections in both your
manifest and in the META-INF/MANIFEST.MF entry in the jar file.
[INFO] 
[INFO] --- maven-resources-plugin:2.5:testResources (default-testResources) @ apache-jsieve ---
[debug] execute contextualize
[INFO] Using 'UTF-8' encoding to copy filtered resources.
[INFO] Copying 2 resources
[INFO] Copying 3 resources
[INFO] 
[INFO] --- maven-compiler-plugin:2.3.2:testCompile (default-testCompile) @ apache-jsieve ---
[INFO] Compiling 50 source files to /srv/gump/public/workspace/james-jsieve/main/target/test-classes
[INFO] -------------------------------------------------------------
[ERROR] COMPILATION ERROR : 
[INFO] -------------------------------------------------------------
[ERROR] /srv/gump/public/workspace/james-jsieve/main/src/test/java/org/apache/jsieve/AllTests.java:[31,21] package junit.swingui does not exist
[INFO] 1 error
[INFO] -------------------------------------------------------------
[INFO] ------------------------------------------------------------------------
[INFO] Reactor Summary:
[INFO] 
[INFO] Apache JAMES JSieve Project ....................... SUCCESS [4.056s]
[INFO] Apache JAMES jSieve ............................... FAILURE [6.594s]
[INFO] Apache JAMES jSieve Mailet ........................ SKIPPED
[INFO] Apache JAMES jSieve Utilities ..................... SKIPPED
[INFO] Apache JAMES jSieve Assembly ...................... SKIPPED
[INFO] ------------------------------------------------------------------------
[INFO] BUILD FAILURE
[INFO] ------------------------------------------------------------------------
[INFO] Total time: 13.952s
[INFO] Finished at: Sat Dec 31 05:39:35 UTC 2011
[INFO] Final Memory: 18M/43M
[INFO] ------------------------------------------------------------------------
[ERROR] Failed to execute goal org.apache.maven.plugins:maven-compiler-plugin:2.3.2:testCompile (default-testCompile) on project apache-jsieve: Compilation failure
[ERROR] /srv/gump/public/workspace/james-jsieve/main/src/test/java/org/apache/jsieve/AllTests.java:[31,21] package junit.swingui does not exist
[ERROR] -> [Help 1]
[ERROR] 
[ERROR] To see the full stack trace of the errors, re-run Maven with the -e switch.
[ERROR] Re-run Maven using the -X switch to enable full debug logging.
[ERROR] 
[ERROR] For more information about the errors and possible solutions, please read the following articles:
[ERROR] [Help 1] http://cwiki.apache.org/confluence/display/MAVEN/MojoFailureException
[ERROR] 
[ERROR] After correcting the problems, you can resume the build with the command
[ERROR]   mvn <goals> -rf :apache-jsieve
---------------------------------------------

To subscribe to this information via syndicated feeds:
- RSS: http://vmgump.apache.org/gump/public/james-jsieve/james-jsieve/rss.xml
- Atom: http://vmgump.apache.org/gump/public/james-jsieve/james-jsieve/atom.xml

============================== Gump Tracking Only ===
Produced by Apache Gump(TM) version 2.3.
Gump Run 11000031122011, vmgump.apache.org:vmgump:11000031122011
Gump E-mail Identifier (unique within run) #37.

*********************************************************** G U M P
[GUMP@vmgump]: Project cocoon22-blocks-modules (in module cocoon) failed
To whom it may engage...
        
This is an automated request, but not an unsolicited one. For 
more information please visit http://gump.apache.org/nagged.html, 
and/or contact the folk at general@gump.apache.org.

Project cocoon22-blocks-modules has an issue affecting its community integration.
This issue affects 8 projects,
 and has been outstanding for 239 runs.
The current state of this project is 'Failed', with reason 'Build Failed'.
For reference only, the following projects are affected by this:
    - cocoon22-blocks-modules :  Java XML Framework
    - cocoon22-chaperon-impl :  Java XML Framework
    - cocoon22-chaperon-impl-test :  Java XML Framework
    - cocoon22-flowscript-impl :  Java XML Framework
    - cocoon22-validation-impl :  Java XML Framework
    - cocoon22-validation-parent :  Java XML Framework
    - lenya-core-api :  Content Management System
    - lenya-reactor :  Content Management System


Full details are available at:
    http://vmgump.apache.org/gump/public/cocoon/cocoon22-blocks-modules/index.html

That said, some information snippets are provided here.

The following annotations (debug/informational/warning/error messages) were provided:
 -DEBUG- (Apache Gump generated) Apache Maven Settings in: /srv/gump/public/workspace/cocoon/blocks/gump_mvn_settings.xml
 -INFO- Failed with reason build failed
 -DEBUG- Maven POM in: /srv/gump/public/workspace/cocoon/blocks/pom.xml
 -INFO- Failed to extract fallback artifacts from Gump Repository



The following work was performed:
http://vmgump.apache.org/gump/public/cocoon/cocoon22-blocks-modules/gump_work/build_cocoon_cocoon22-blocks-modules.html
Work Name: build_cocoon_cocoon22-blocks-modules (Type: Build)
Work ended in a state of : Failed
Elapsed: 6 secs
Command Line: /opt/maven2/bin/mvn --batch-mode -Dpackaging=pom -DgroupId=org.apache.cocoon -Dfile=pom.xml -DartifactId=cocoon-blocks-modules -Dversion=6-SNAPSHOT --settings /srv/gump/public/workspace/cocoon/blocks/gump_mvn_settings.xml install:install-file 
[Working Directory: /srv/gump/public/workspace/cocoon/blocks]
M2_HOME: /opt/maven2
---------------------------------------------
Downloading: http://localhost:8192/maven2/org/apache/maven/plugins/maven-jar-plugin/2.1/maven-jar-plugin-2.1.pom

Downloading: http://localhost:8192/maven2/org/apache/maven/plugins/maven-jar-plugin/2.1/maven-jar-plugin-2.1.jar

[INFO] snapshot org.apache.cocoon:cocoon-maven-plugin:1.0.0-RC1-SNAPSHOT: checking for updates from gkossakowski-maven2
[INFO] snapshot org.apache.cocoon:cocoon-maven-plugin:1.0.0-RC1-SNAPSHOT: checking for updates from apache.snapshots
Downloading: http://people.apache.org/~gkossakowski/maven2/repository/org/apache/cocoon/cocoon-maven-plugin/1.0.0-RC1-SNAPSHOT/cocoon-maven-plugin-1.0.0-RC1-SNAPSHOT.pom
[INFO] Unable to find resource 'org.apache.cocoon:cocoon-maven-plugin:pom:1.0.0-RC1-SNAPSHOT' in repository gkossakowski-maven2 (http://people.apache.org/~gkossakowski/maven2/repository)
Downloading: http://localhost:8192/repo/m2-snapshot-repository/org/apache/cocoon/cocoon-maven-plugin/1.0.0-RC1-SNAPSHOT/cocoon-maven-plugin-1.0.0-RC1-SNAPSHOT.pom
4K downloaded  (cocoon-maven-plugin-1.0.0-RC1-SNAPSHOT.pom)
[INFO] snapshot org.apache.cocoon:cocoon-tools-modules:5-SNAPSHOT: checking for updates from gkossakowski-maven2
[INFO] snapshot org.apache.cocoon:cocoon-tools-modules:5-SNAPSHOT: checking for updates from apache.snapshots
[INFO] Cannot find mojo descriptor for: 'install:install-file' - Treating as non-aggregator.
[INFO] ------------------------------------------------------------------------
[INFO] Building Cocoon Blocks [modules]
[INFO]    task-segment: [install:install-file]
[INFO] ------------------------------------------------------------------------
[INFO] ------------------------------------------------------------------------
[ERROR] BUILD FAILURE
[INFO] ------------------------------------------------------------------------
[INFO] A required plugin was not found: Plugin could not be found - check that the goal name is correct: Unable to download the artifact from any repository

Try downloading the file manually from the project website.

Then, install it using the command: 
    mvn install:install-file -DgroupId=org.apache.cocoon -DartifactId=cocoon-maven-plugin -Dversion=1.0.0-RC1-SNAPSHOT -Dpackaging=maven-plugin -Dfile=/path/to/file

Alternatively, if you host your own repository you can deploy the file there: 
    mvn deploy:deploy-file -DgroupId=org.apache.cocoon -DartifactId=cocoon-maven-plugin -Dversion=1.0.0-RC1-SNAPSHOT -Dpackaging=maven-plugin -Dfile=/path/to/file -Durl=[url] -DrepositoryId=[id]


  org.apache.cocoon:cocoon-maven-plugin:maven-plugin:1.0.0-RC1-SNAPSHOT

from the specified remote repositories:
  gump-central (http://localhost:8192/maven2)


  org.apache.cocoon:cocoon-maven-plugin:maven-plugin:1.0.0-RC1-SNAPSHOT

from the specified remote repositories:
  gump-central (http://localhost:8192/maven2)


[INFO] ------------------------------------------------------------------------
[INFO] For more information, run Maven with the -e switch
[INFO] ------------------------------------------------------------------------
[INFO] Total time: 5 seconds
[INFO] Finished at: Sat Dec 31 05:42:11 UTC 2011
[INFO] Final Memory: 15M/36M
[INFO] ------------------------------------------------------------------------
---------------------------------------------

To subscribe to this information via syndicated feeds:
- RSS: http://vmgump.apache.org/gump/public/cocoon/cocoon22-blocks-modules/rss.xml
- Atom: http://vmgump.apache.org/gump/public/cocoon/cocoon22-blocks-modules/atom.xml

============================== Gump Tracking Only ===
Produced by Apache Gump(TM) version 2.3.
Gump Run 11000031122011, vmgump.apache.org:vmgump:11000031122011
Gump E-mail Identifier (unique within run) #38.

*********************************************************** G U M P
[GUMP@vmgump]: Project htmlunit (in module htmlunit) failed
To whom it may engage...
        
This is an automated request, but not an unsolicited one. For 
more information please visit http://gump.apache.org/nagged.html, 
and/or contact the folk at general@gump.apache.org.

Project htmlunit has an issue affecting its community integration.
This issue affects 1 projects,
 and has been outstanding for 1002 runs.
The current state of this project is 'Failed', with reason 'Build Failed'.
For reference only, the following projects are affected by this:
    - htmlunit :  A tool for testing web based applications


Full details are available at:
    http://vmgump.apache.org/gump/public/htmlunit/htmlunit/index.html

That said, some information snippets are provided here.

The following annotations (debug/informational/warning/error messages) were provided:
 -DEBUG- Sole jar output [htmlunit-*[0-9T].jar] identifier set to project name
 -INFO- Optional dependency httpcomponents-client failed with reason build failed
 -INFO- Optional dependency commons-fileupload prerequisite failed with reason build failed
 -DEBUG- (Apache Gump generated) Apache Maven Settings in: /srv/gump/public/workspace/htmlunit/htmlunit/gump_mvn_settings.xml
 -INFO- Failed with reason build failed
 -DEBUG- Maven POM in: /srv/gump/public/workspace/htmlunit/htmlunit/pom.xml
 -INFO- Failed to extract fallback artifacts from Gump Repository



The following work was performed:
http://vmgump.apache.org/gump/public/htmlunit/htmlunit/gump_work/build_htmlunit_htmlunit.html
Work Name: build_htmlunit_htmlunit (Type: Build)
Work ended in a state of : Failed
Elapsed: 26 secs
Command Line: /opt/maven2/bin/mvn --batch-mode --settings /srv/gump/public/workspace/htmlunit/htmlunit/gump_mvn_settings.xml package 
[Working Directory: /srv/gump/public/workspace/htmlunit/htmlunit]
M2_HOME: /opt/maven2
---------------------------------------------
Downloading: http://localhost:8192/maven2/org/seleniumhq/selenium/selenium-ie-driver/2.15.0/selenium-ie-driver-2.15.0.jar


Downloading: http://localhost:8192/maven2/org/seleniumhq/selenium/selenium-remote-driver/2.15.0/selenium-remote-driver-2.15.0.jar

Downloading: http://localhost:8192/maven2/org/seleniumhq/selenium/selenium-firefox-driver/2.15.0/selenium-firefox-driver-2.15.0.jar

Downloading: http://localhost:8192/maven2/org/seleniumhq/selenium/selenium-chrome-driver/2.15.0/selenium-chrome-driver-2.15.0.jar

[INFO] ------------------------------------------------------------------------
[ERROR] BUILD ERROR
[INFO] ------------------------------------------------------------------------
[INFO] Failed to resolve artifact.

Missing:
----------
1) net.sourceforge.cssparser:cssparser:jar:0.9.7-SNAPSHOT

  Try downloading the file manually from the project website.

  Then, install it using the command: 
      mvn install:install-file -DgroupId=net.sourceforge.cssparser -DartifactId=cssparser -Dversion=0.9.7-SNAPSHOT -Dpackaging=jar -Dfile=/path/to/file

  Alternatively, if you host your own repository you can deploy the file there: 
      mvn deploy:deploy-file -DgroupId=net.sourceforge.cssparser -DartifactId=cssparser -Dversion=0.9.7-SNAPSHOT -Dpackaging=jar -Dfile=/path/to/file -Durl=[url] -DrepositoryId=[id]

  Path to dependency: 
  	1) net.sourceforge.htmlunit:htmlunit:jar:2.10-SNAPSHOT
  	2) net.sourceforge.cssparser:cssparser:jar:0.9.7-SNAPSHOT

----------
1 required artifact is missing.

for artifact: 
  net.sourceforge.htmlunit:htmlunit:jar:2.10-SNAPSHOT

from the specified remote repositories:
  gump-central (http://localhost:8192/maven2),
  gump-sonatype-nexus-snapshots (http://localhost:8192/content/repositories/snapshots),
  HtmlUnitSnapshots (http://htmlunit.sourceforge.net/m2-repo-snapshots)



[INFO] ------------------------------------------------------------------------
[INFO] For more information, run Maven with the -e switch
[INFO] ------------------------------------------------------------------------
[INFO] Total time: 26 seconds
[INFO] Finished at: Sat Dec 31 05:45:38 UTC 2011
[INFO] Final Memory: 21M/50M
[INFO] ------------------------------------------------------------------------
---------------------------------------------

To subscribe to this information via syndicated feeds:
- RSS: http://vmgump.apache.org/gump/public/htmlunit/htmlunit/rss.xml
- Atom: http://vmgump.apache.org/gump/public/htmlunit/htmlunit/atom.xml

============================== Gump Tracking Only ===
Produced by Apache Gump(TM) version 2.3.
Gump Run 11000031122011, vmgump.apache.org:vmgump:11000031122011
Gump E-mail Identifier (unique within run) #39.

*********************************************************** G U M P
[GUMP@vmgump]: Project commons-jelly-tags-ant-test (in module commons-jelly) failed
To whom it may engage...
        
This is an automated request, but not an unsolicited one. For 
more information please visit http://gump.apache.org/nagged.html, 
and/or contact the folk at general@gump.apache.org.

Project commons-jelly-tags-ant-test has an issue affecting its community integration.
This issue affects 1 projects,
 and has been outstanding for 60 runs.
The current state of this project is 'Failed', with reason 'Build Failed'.
For reference only, the following projects are affected by this:
    - commons-jelly-tags-ant-test :  Commons Jelly


Full details are available at:
    http://vmgump.apache.org/gump/public/commons-jelly/commons-jelly-tags-ant-test/index.html

That said, some information snippets are provided here.

The following annotations (debug/informational/warning/error messages) were provided:
 -DEBUG- Dependency on ant exists, no need to add for property maven.jar.ant-optional.
 -DEBUG- Dependency on xml-xerces exists, no need to add for property maven.jar.xerces.
 -DEBUG- Dependency on commons-jexl-1.x exists, no need to add for property maven.jar.commons-jexl.
 -WARNING- Overriding Maven properties: [/srv/gump/public/workspace/commons-jelly/jelly-tags/ant/build.properties]
 -DEBUG- (Apache Gump generated) Apache Maven Properties in: /srv/gump/public/workspace/commons-jelly/jelly-tags/ant/build.properties
 -INFO- Failed with reason build failed
 -DEBUG- Maven POM in: /srv/gump/public/workspace/commons-jelly/jelly-tags/ant/project.xml
 -DEBUG- Maven project properties in: /srv/gump/public/workspace/commons-jelly/jelly-tags/ant/project.properties
 -INFO- Project Reports in: /srv/gump/public/workspace/commons-jelly/jelly-tags/ant/target/test-reports



The following work was performed:
http://vmgump.apache.org/gump/public/commons-jelly/commons-jelly-tags-ant-test/gump_work/build_commons-jelly_commons-jelly-tags-ant-test.html
Work Name: build_commons-jelly_commons-jelly-tags-ant-test (Type: Build)
Work ended in a state of : Failed
Elapsed: 9 secs
Command Line: maven --offline jar 
[Working Directory: /srv/gump/public/workspace/commons-jelly/jelly-tags/ant]
---------------------------------------------
    [junit] Actual expression: (${foo4.1})=(null)
    [junit] 	at org.apache.commons.jelly.tags.junit.AssertTagSupport.fail(AssertTagSupport.java:44)
    [junit] 	at org.apache.commons.jelly.tags.junit.AssertTagSupport.failNotEquals(AssertTagSupport.java:77)
    [junit] 	at org.apache.commons.jelly.tags.junit.AssertEqualsTag.doTag(AssertEqualsTag.java:56)
    [junit] 	at org.apache.commons.jelly.impl.TagScript.run(TagScript.java:267)
    [junit] 	at org.apache.commons.jelly.impl.ScriptBlock.run(ScriptBlock.java:96)
    [junit] 	at org.apache.commons.jelly.tags.junit.CaseTag$1.runTest(CaseTag.java:60)
    [junit] 
    [junit] 
    [junit] Testcase: startUpReadWrite(org.apache.commons.jelly.tags.junit.CaseTag$1):	Caused an ERROR
    [junit] file:/srv/gump/public/workspace/commons-jelly/jelly-tags/ant/target/test-classes/org/apache/commons/jelly/ant/suite.jelly:98:5: <test:assertEquals> file:/srv/gump/public/workspace/commons-jelly/jelly-tags/ant/target/test-classes/org/apache/commons/jelly/ant/suite.jelly:98:5: <test:assertEquals>  expected:[bar5] but was:[null]
    [junit] Expected expression: (bar5)=(bar5)
    [junit] Actual expression: (${foo5.1})=(null)
    [junit] org.apache.commons.jelly.JellyTagException: file:/srv/gump/public/workspace/commons-jelly/jelly-tags/ant/target/test-classes/org/apache/commons/jelly/ant/suite.jelly:98:5: <test:assertEquals> file:/srv/gump/public/workspace/commons-jelly/jelly-tags/ant/target/test-classes/org/apache/commons/jelly/ant/suite.jelly:98:5: <test:assertEquals>  expected:[bar5] but was:[null]
    [junit] Expected expression: (bar5)=(bar5)
    [junit] Actual expression: (${foo5.1})=(null)
    [junit] 	at org.apache.commons.jelly.impl.TagScript.handleException(TagScript.java:732)
    [junit] 	at org.apache.commons.jelly.impl.TagScript.run(TagScript.java:287)
    [junit] 	at org.apache.commons.jelly.impl.ScriptBlock.run(ScriptBlock.java:96)
    [junit] 	at org.apache.commons.jelly.tags.junit.CaseTag$1.runTest(CaseTag.java:60)
    [junit] Caused by: org.apache.commons.jelly.tags.junit.JellyAssertionFailedError: file:/srv/gump/public/workspace/commons-jelly/jelly-tags/ant/target/test-classes/org/apache/commons/jelly/ant/suite.jelly:98:5: <test:assertEquals>  expected:[bar5] but was:[null]
    [junit] Expected expression: (bar5)=(bar5)
    [junit] Actual expression: (${foo5.1})=(null)
    [junit] 	at org.apache.commons.jelly.tags.junit.AssertTagSupport.fail(AssertTagSupport.java:44)
    [junit] 	at org.apache.commons.jelly.tags.junit.AssertTagSupport.failNotEquals(AssertTagSupport.java:77)
    [junit] 	at org.apache.commons.jelly.tags.junit.AssertEqualsTag.doTag(AssertEqualsTag.java:56)
    [junit] 	at org.apache.commons.jelly.impl.TagScript.run(TagScript.java:267)
    [junit] Root cause
    [junit] org.apache.commons.jelly.tags.junit.JellyAssertionFailedError: file:/srv/gump/public/workspace/commons-jelly/jelly-tags/ant/target/test-classes/org/apache/commons/jelly/ant/suite.jelly:98:5: <test:assertEquals>  expected:[bar5] but was:[null]
    [junit] Expected expression: (bar5)=(bar5)
    [junit] Actual expression: (${foo5.1})=(null)
    [junit] 	at org.apache.commons.jelly.tags.junit.AssertTagSupport.fail(AssertTagSupport.java:44)
    [junit] 	at org.apache.commons.jelly.tags.junit.AssertTagSupport.failNotEquals(AssertTagSupport.java:77)
    [junit] 	at org.apache.commons.jelly.tags.junit.AssertEqualsTag.doTag(AssertEqualsTag.java:56)
    [junit] 	at org.apache.commons.jelly.impl.TagScript.run(TagScript.java:267)
    [junit] 	at org.apache.commons.jelly.impl.ScriptBlock.run(ScriptBlock.java:96)
    [junit] 	at org.apache.commons.jelly.tags.junit.CaseTag$1.runTest(CaseTag.java:60)
    [junit] 
    [junit] 
    [junit] [ERROR] TEST org.apache.commons.jelly.ant.TestJelly FAILED

BUILD FAILED
File...... /home/gump/.maven/cache/maven-test-plugin-1.6.2/plugin.jelly
Element... fail
Line...... 181
Column.... 54
There were test failures.
Total time: 9 seconds
Finished at: Sat Dec 31 06:08:21 UTC 2011

---------------------------------------------

To subscribe to this information via syndicated feeds:
- RSS: http://vmgump.apache.org/gump/public/commons-jelly/commons-jelly-tags-ant-test/rss.xml
- Atom: http://vmgump.apache.org/gump/public/commons-jelly/commons-jelly-tags-ant-test/atom.xml

============================== Gump Tracking Only ===
Produced by Apache Gump(TM) version 2.3.
Gump Run 11000031122011, vmgump.apache.org:vmgump:11000031122011
Gump E-mail Identifier (unique within run) #40.

*********************************************************** G U M P
[GUMP@vmgump]: Module jakarta-tomcat-catalina success, but with warnings.
To whom it may engage...
        
This is an automated request, but not an unsolicited one. For 
more information please visit http://gump.apache.org/nagged.html, 
and/or contact the folk at general@gump.apache.org.

Module jakarta-tomcat-catalina contains errors.
The current state of this module is 'Success'.

Full details are available at:
    http://vmgump.apache.org/gump/public/jakarta-tomcat-catalina/index.html

That said, some information snippets are provided here.

The following annotations (debug/informational/warning/error messages) were provided:
 -ERROR- *** Failed to update from source control.Stale contents ***



The following work was performed:
http://vmgump.apache.org/gump/public/jakarta-tomcat-catalina/gump_work/update_jakarta-tomcat-catalina.html
Work Name: update_jakarta-tomcat-catalina (Type: Update)
Work ended in a state of : Failed
Elapsed: 
Command Line: svn --quiet update --non-interactive jakarta-tomcat-catalina 
[Working Directory: /srv/gump/public/workspace/cvs]
---------------------------------------------
svn: Working copy 'jakarta-tomcat-catalina' locked
svn: run 'svn cleanup' to remove locks (type 'svn help cleanup' for details)
---------------------------------------------

To subscribe to this information via syndicated feeds:
- RSS: http://vmgump.apache.org/gump/public/jakarta-tomcat-catalina/rss.xml
- Atom: http://vmgump.apache.org/gump/public/jakarta-tomcat-catalina/atom.xml

============================== Gump Tracking Only ===
Produced by Apache Gump(TM) version 2.3.
Gump Run 11000031122011, vmgump.apache.org:vmgump:11000031122011
Gump E-mail Identifier (unique within run) #42.

*********************************************************** G U M P
[GUMP@vmgump]: Project velocity-tools-reactor (in module velocity-tools) failed
To whom it may engage...
        
This is an automated request, but not an unsolicited one. For 
more information please visit http://gump.apache.org/nagged.html, 
and/or contact the folk at general@gump.apache.org.

Project velocity-tools-reactor has an issue affecting its community integration.
This issue affects 1 projects,
 and has been outstanding for 60 runs.
The current state of this project is 'Failed', with reason 'Build Failed'.
For reference only, the following projects are affected by this:
    - velocity-tools-reactor :  VelocityTools project


Full details are available at:
    http://vmgump.apache.org/gump/public/velocity-tools/velocity-tools-reactor/index.html

That said, some information snippets are provided here.

The following annotations (debug/informational/warning/error messages) were provided:
 -INFO- Optional dependency commons-chain prerequisite failed with reason build failed
 -INFO- Optional dependency httpunit failed with reason build failed
 -WARNING- Overriding Maven settings: [/srv/gump/public/workspace/velocity-tools/gump_mvn_settings.xml]
 -DEBUG- (Apache Gump generated) Apache Maven Settings in: /srv/gump/public/workspace/velocity-tools/gump_mvn_settings.xml
 -INFO- Failed with reason build failed
 -DEBUG- Maven POM in: /srv/gump/public/workspace/velocity-tools/pom.xml
 -INFO- Failed to extract fallback artifacts from Gump Repository



The following work was performed:
http://vmgump.apache.org/gump/public/velocity-tools/velocity-tools-reactor/gump_work/build_velocity-tools_velocity-tools-reactor.html
Work Name: build_velocity-tools_velocity-tools-reactor (Type: Build)
Work ended in a state of : Failed
Elapsed: 1 min 29 secs
Command Line: /opt/maven2/bin/mvn --batch-mode -DskipTests=true --settings /srv/gump/public/workspace/velocity-tools/gump_mvn_settings.xml package 
[Working Directory: /srv/gump/public/workspace/velocity-tools]
M2_HOME: /opt/maven2
---------------------------------------------
urls[6] = file:/srv/gump/public/workspace/mvnlocalrepo/velocity/org/slf4j/jcl104-over-slf4j/1.4.2/jcl104-over-slf4j-1.4.2.jar
urls[7] = file:/srv/gump/public/workspace/mvnlocalrepo/velocity/org/slf4j/slf4j-log4j12/1.4.2/slf4j-log4j12-1.4.2.jar
urls[8] = file:/srv/gump/public/workspace/mvnlocalrepo/velocity/org/slf4j/slf4j-api/1.6.4/slf4j-api-1.6.4.jar
urls[9] = file:/srv/gump/public/workspace/mvnlocalrepo/velocity/log4j/log4j/1.2.14/log4j-1.2.14.jar
urls[10] = file:/srv/gump/public/workspace/mvnlocalrepo/velocity/org/apache/velocity/velocity-engine-log4j/2.0.0-SNAPSHOT/velocity-engine-log4j-2.0.0-SNAPSHOT.jar
urls[11] = file:/srv/gump/public/workspace/mvnlocalrepo/velocity/org/apache/velocity/velocity-engine-core/2.0.0-SNAPSHOT/velocity-engine-core-2.0.0-SNAPSHOT.jar
urls[12] = file:/srv/gump/public/workspace/velocity-tools/velocity-tools-view-jsp/target/velocity-tools-view-jsp-2.1.0-SNAPSHOT.jar
urls[13] = file:/srv/gump/public/workspace/velocity-tools/velocity-tools-view/target/velocity-tools-view-2.1.0-SNAPSHOT.jar
urls[14] = file:/srv/gump/public/workspace/velocity-tools/velocity-tools-generic/target/velocity-tools-generic-2.1.0-SNAPSHOT.jar
urls[15] = file:/srv/gump/public/workspace/mvnlocalrepo/velocity/commons-digester/commons-digester/2.1/commons-digester-2.1.jar
urls[16] = file:/srv/gump/public/workspace/mvnlocalrepo/velocity/commons-logging/commons-logging/1.1.1/commons-logging-1.1.1.jar
urls[17] = file:/srv/gump/public/workspace/mvnlocalrepo/velocity/org/codehaus/plexus/plexus-utils/1.1/plexus-utils-1.1.jar
urls[18] = file:/srv/gump/public/workspace/mvnlocalrepo/velocity/javax/servlet/jsp/jsp-api/2.1/jsp-api-2.1.jar
urls[19] = file:/srv/gump/public/workspace/mvnlocalrepo/velocity/javax/servlet/servlet-api/2.5/servlet-api-2.5.jar
[FATAL ERROR] Container realm = plexus.core
urls[0] = file:/opt/maven2/lib/maven-2.2.1-uber.jar
[INFO] ------------------------------------------------------------------------
[ERROR] FATAL ERROR
[INFO] ------------------------------------------------------------------------
[INFO] org.slf4j.spi.LocationAwareLogger.log(Lorg/slf4j/Marker;Ljava/lang/String;ILjava/lang/String;Ljava/lang/Throwable;)V
[INFO] ------------------------------------------------------------------------
[INFO] Trace
java.lang.NoSuchMethodError: org.slf4j.spi.LocationAwareLogger.log(Lorg/slf4j/Marker;Ljava/lang/String;ILjava/lang/String;Ljava/lang/Throwable;)V
	at org.apache.commons.logging.impl.SLF4JLocationAwareLog.debug(SLF4JLocationAwareLog.java:99)
	at org.apache.commons.digester.Digester.register(Digester.java:2023)
	at org.apache.velocity.tools.plugin.taglib.Taglib2Directive.execute(Taglib2Directive.java:126)
	at org.apache.maven.plugin.DefaultPluginManager.executeMojo(DefaultPluginManager.java:490)
	at org.apache.maven.lifecycle.DefaultLifecycleExecutor.executeGoals(DefaultLifecycleExecutor.java:694)
	at org.apache.maven.lifecycle.DefaultLifecycleExecutor.executeGoalWithLifecycle(DefaultLifecycleExecutor.java:556)
	at org.apache.maven.lifecycle.DefaultLifecycleExecutor.executeGoal(DefaultLifecycleExecutor.java:535)
	at org.apache.maven.lifecycle.DefaultLifecycleExecutor.executeGoalAndHandleFailures(DefaultLifecycleExecutor.java:387)
	at org.apache.maven.lifecycle.DefaultLifecycleExecutor.executeTaskSegments(DefaultLifecycleExecutor.java:348)
	at org.apache.maven.lifecycle.DefaultLifecycleExecutor.execute(DefaultLifecycleExecutor.java:180)
	at org.apache.maven.DefaultMaven.doExecute(DefaultMaven.java:328)
	at org.apache.maven.DefaultMaven.execute(DefaultMaven.java:138)
	at org.apache.maven.cli.MavenCli.main(MavenCli.java:362)
	at org.apache.maven.cli.compat.CompatibleMain.main(CompatibleMain.java:60)
	at sun.reflect.NativeMethodAccessorImpl.invoke0(Native Method)
	at sun.reflect.NativeMethodAccessorImpl.invoke(NativeMethodAccessorImpl.java:57)
	at sun.reflect.DelegatingMethodAccessorImpl.invoke(DelegatingMethodAccessorImpl.java:43)
	at java.lang.reflect.Method.invoke(Method.java:616)
	at org.codehaus.classworlds.Launcher.launchEnhanced(Launcher.java:315)
	at org.codehaus.classworlds.Launcher.launch(Launcher.java:255)
	at org.codehaus.classworlds.Launcher.mainWithExitCode(Launcher.java:430)
	at org.codehaus.classworlds.Launcher.main(Launcher.java:375)
[INFO] ------------------------------------------------------------------------
[INFO] Total time: 1 minute 28 seconds
[INFO] Finished at: Sat Dec 31 06:18:15 UTC 2011
[INFO] Final Memory: 60M/143M
[INFO] ------------------------------------------------------------------------
---------------------------------------------

To subscribe to this information via syndicated feeds:
- RSS: http://vmgump.apache.org/gump/public/velocity-tools/velocity-tools-reactor/rss.xml
- Atom: http://vmgump.apache.org/gump/public/velocity-tools/velocity-tools-reactor/atom.xml

============================== Gump Tracking Only ===
Produced by Apache Gump(TM) version 2.3.
Gump Run 11000031122011, vmgump.apache.org:vmgump:11000031122011
Gump E-mail Identifier (unique within run) #43.

*********************************************************** G U M P
[GUMP@vmgump]: Project turbine-core (in module turbine-core) failed
To whom it may engage...
        
This is an automated request, but not an unsolicited one. For 
more information please visit http://gump.apache.org/nagged.html, 
and/or contact the folk at general@gump.apache.org.

Project turbine-core has an issue affecting its community integration.
This issue affects 2 projects,
 and has been outstanding for 608 runs.
The current state of this project is 'Failed', with reason 'Build Failed'.
For reference only, the following projects are affected by this:
    - turbine-core :  A servlet based framework.
    - turbine-core-test :  A servlet based framework.


Full details are available at:
    http://vmgump.apache.org/gump/public/turbine-core/turbine-core/index.html

That said, some information snippets are provided here.

The following annotations (debug/informational/warning/error messages) were provided:
 -INFO- Optional dependency mx4j-tools prerequisite failed with reason build failed
 -INFO- Optional dependency mx4j prerequisite failed with reason build failed
 -INFO- Optional dependency commons-fileupload prerequisite failed with reason build failed
 -INFO- Optional dependency httpunit failed with reason build failed
 -DEBUG- (Apache Gump generated) Apache Maven Settings in: /srv/gump/public/workspace/turbine-core/gump_mvn_settings.xml
 -INFO- Failed with reason build failed
 -DEBUG- Maven POM in: /srv/gump/public/workspace/turbine-core/pom.xml
 -INFO- Failed to extract fallback artifacts from Gump Repository



The following work was performed:
http://vmgump.apache.org/gump/public/turbine-core/turbine-core/gump_work/build_turbine-core_turbine-core.html
Work Name: build_turbine-core_turbine-core (Type: Build)
Work ended in a state of : Failed
Elapsed: 22 secs
Command Line: /opt/maven2/bin/mvn --batch-mode -DskipTests=true --settings /srv/gump/public/workspace/turbine-core/gump_mvn_settings.xml package 
[Working Directory: /srv/gump/public/workspace/turbine-core]
M2_HOME: /opt/maven2
---------------------------------------------
urls[19] = file:/srv/gump/public/workspace/mvnlocalrepo/shared/xml-apis/xml-apis/1.0.b2/xml-apis-1.0.b2.jar
urls[20] = file:/srv/gump/public/workspace/mvnlocalrepo/shared/commons-configuration/commons-configuration/1.4/commons-configuration-1.4.jar
urls[21] = file:/srv/gump/public/workspace/mvnlocalrepo/shared/commons-logging/commons-logging-api/1.0.4/commons-logging-api-1.0.4.jar
urls[22] = file:/srv/gump/public/workspace/mvnlocalrepo/shared/commons-digester/commons-digester/1.8/commons-digester-1.8.jar
urls[23] = file:/srv/gump/public/workspace/mvnlocalrepo/shared/commons-beanutils/commons-beanutils/1.7.0/commons-beanutils-1.7.0.jar
urls[24] = file:/srv/gump/public/workspace/mvnlocalrepo/shared/commons-beanutils/commons-beanutils-core/1.7.0/commons-beanutils-core-1.7.0.jar
urls[25] = file:/srv/gump/public/workspace/mvnlocalrepo/shared/commons-codec/commons-codec/1.3/commons-codec-1.3.jar
urls[26] = file:/srv/gump/public/workspace/mvnlocalrepo/shared/commons-jxpath/commons-jxpath/1.2/commons-jxpath-1.2.jar
urls[27] = file:/srv/gump/public/workspace/mvnlocalrepo/shared/xerces/xerces/1.2.3/xerces-1.2.3.jar
urls[28] = file:/srv/gump/public/workspace/mvnlocalrepo/shared/ant/ant-optional/1.5.1/ant-optional-1.5.1.jar
urls[29] = file:/srv/gump/public/workspace/mvnlocalrepo/shared/jdom/jdom/b9/jdom-b9.jar
Number of imports: 10
import: org.codehaus.classworlds.Entry@a6c57a42
import: org.codehaus.classworlds.Entry@12f43f3b
import: org.codehaus.classworlds.Entry@20025374
import: org.codehaus.classworlds.Entry@f8e44ca4
import: org.codehaus.classworlds.Entry@92758522
import: org.codehaus.classworlds.Entry@ebf2705b
import: org.codehaus.classworlds.Entry@bb25e54
import: org.codehaus.classworlds.Entry@bece5185
import: org.codehaus.classworlds.Entry@3fee8e37
import: org.codehaus.classworlds.Entry@3fee19d8


this realm = plexus.core
urls[0] = file:/opt/maven2/lib/maven-2.2.1-uber.jar
Number of imports: 10
import: org.codehaus.classworlds.Entry@a6c57a42
import: org.codehaus.classworlds.Entry@12f43f3b
import: org.codehaus.classworlds.Entry@20025374
import: org.codehaus.classworlds.Entry@f8e44ca4
import: org.codehaus.classworlds.Entry@92758522
import: org.codehaus.classworlds.Entry@ebf2705b
import: org.codehaus.classworlds.Entry@bb25e54
import: org.codehaus.classworlds.Entry@bece5185
import: org.codehaus.classworlds.Entry@3fee8e37
import: org.codehaus.classworlds.Entry@3fee19d8
-----------------------------------------------------
[INFO] ------------------------------------------------------------------------
[ERROR] BUILD ERROR
[INFO] ------------------------------------------------------------------------
[INFO] Internal error in the plugin manager executing goal 'org.apache.torque:torque-maven-plugin:3.3:om': Unable to load the mojo 'org.apache.torque:torque-maven-plugin:3.3:om' in the plugin 'org.apache.torque:torque-maven-plugin'. A required class is missing: org/apache/torque/task/TorqueDataModelTask
org.apache.torque.task.TorqueDataModelTask
[INFO] ------------------------------------------------------------------------
[INFO] For more information, run Maven with the -e switch
[INFO] ------------------------------------------------------------------------
[INFO] Total time: 21 seconds
[INFO] Finished at: Sat Dec 31 06:21:26 UTC 2011
[INFO] Final Memory: 30M/72M
[INFO] ------------------------------------------------------------------------
---------------------------------------------

To subscribe to this information via syndicated feeds:
- RSS: http://vmgump.apache.org/gump/public/turbine-core/turbine-core/rss.xml
- Atom: http://vmgump.apache.org/gump/public/turbine-core/turbine-core/atom.xml

============================== Gump Tracking Only ===
Produced by Apache Gump(TM) version 2.3.
Gump Run 11000031122011, vmgump.apache.org:vmgump:11000031122011
Gump E-mail Identifier (unique within run) #45.

*********************************************************** G U M P
[GUMP@vmgump]: Project cocoon22-reactor (in module cocoon) failed
To whom it may engage...
        
This is an automated request, but not an unsolicited one. For 
more information please visit http://gump.apache.org/nagged.html, 
and/or contact the folk at general@gump.apache.org.

Project cocoon22-reactor has an issue affecting its community integration.
This issue affects 1 projects,
 and has been outstanding for 964 runs.
The current state of this project is 'Failed', with reason 'Build Failed'.
For reference only, the following projects are affected by this:
    - cocoon22-reactor :  Java XML Framework


Full details are available at:
    http://vmgump.apache.org/gump/public/cocoon/cocoon22-reactor/index.html

That said, some information snippets are provided here.

The following annotations (debug/informational/warning/error messages) were provided:
 -INFO- Optional dependency cocoon22-flowscript-impl prerequisite failed with reason build failed
 -INFO- Optional dependency cocoon22-chaperon-impl prerequisite failed with reason build failed
 -INFO- Optional dependency cocoon22-validation-impl prerequisite failed with reason build failed
 -INFO- Optional dependency htmlunit failed with reason build failed
 -DEBUG- (Apache Gump generated) Apache Maven Settings in: /srv/gump/public/workspace/cocoon/gump_mvn_settings.xml
 -INFO- Failed with reason build failed
 -DEBUG- Maven POM in: /srv/gump/public/workspace/cocoon/pom.xml



The following work was performed:
http://vmgump.apache.org/gump/public/cocoon/cocoon22-reactor/gump_work/build_cocoon_cocoon22-reactor.html
Work Name: build_cocoon_cocoon22-reactor (Type: Build)
Work ended in a state of : Failed
Elapsed: 1 min 36 secs
Command Line: /opt/maven2/bin/mvn --batch-mode --settings /srv/gump/public/workspace/cocoon/gump_mvn_settings.xml package 
[Working Directory: /srv/gump/public/workspace/cocoon]
M2_HOME: /opt/maven2
---------------------------------------------
8) daisy:daisy-htmlcleaner:jar:1.5-dev

  Try downloading the file manually from the project website.

  Then, install it using the command: 
      mvn install:install-file -DgroupId=daisy -DartifactId=daisy-htmlcleaner -Dversion=1.5-dev -Dpackaging=jar -Dfile=/path/to/file

  Alternatively, if you host your own repository you can deploy the file there: 
      mvn deploy:deploy-file -DgroupId=daisy -DartifactId=daisy-htmlcleaner -Dversion=1.5-dev -Dpackaging=jar -Dfile=/path/to/file -Durl=[url] -DrepositoryId=[id]

  Path to dependency: 
  	1) org.apache.cocoon:cocoon-sitemaptags2daisy-plugin:maven-plugin:1.0.0-SNAPSHOT
  	2) daisy:daisy-htmlcleaner:jar:1.5-dev

9) daisy:daisy-util:jar:1.5-dev

  Try downloading the file manually from the project website.

  Then, install it using the command: 
      mvn install:install-file -DgroupId=daisy -DartifactId=daisy-util -Dversion=1.5-dev -Dpackaging=jar -Dfile=/path/to/file

  Alternatively, if you host your own repository you can deploy the file there: 
      mvn deploy:deploy-file -DgroupId=daisy -DartifactId=daisy-util -Dversion=1.5-dev -Dpackaging=jar -Dfile=/path/to/file -Durl=[url] -DrepositoryId=[id]

  Path to dependency: 
  	1) org.apache.cocoon:cocoon-sitemaptags2daisy-plugin:maven-plugin:1.0.0-SNAPSHOT
  	2) daisy:daisy-util:jar:1.5-dev

----------
9 required artifacts are missing.

for artifact: 
  org.apache.cocoon:cocoon-sitemaptags2daisy-plugin:maven-plugin:1.0.0-SNAPSHOT

from the specified remote repositories:
  gump-central (http://localhost:8192/maven2),
  maven-snapshot (http://snapshots.maven.codehaus.org/maven2/),
  cocoondev (http://cocoondev.org/repository),
  gump-apache.snapshots (http://localhost:8192/repo/m2-snapshot-repository),
  gkossakowski-maven2 (http://people.apache.org/~gkossakowski/maven2/repository)



[INFO] ------------------------------------------------------------------------
[INFO] For more information, run Maven with the -e switch
[INFO] ------------------------------------------------------------------------
[INFO] Total time: 1 minute 34 seconds
[INFO] Finished at: Sat Dec 31 06:30:12 UTC 2011
[INFO] Final Memory: 64M/154M
[INFO] ------------------------------------------------------------------------
---------------------------------------------

To subscribe to this information via syndicated feeds:
- RSS: http://vmgump.apache.org/gump/public/cocoon/cocoon22-reactor/rss.xml
- Atom: http://vmgump.apache.org/gump/public/cocoon/cocoon22-reactor/atom.xml

============================== Gump Tracking Only ===
Produced by Apache Gump(TM) version 2.3.
Gump Run 11000031122011, vmgump.apache.org:vmgump:11000031122011
Gump E-mail Identifier (unique within run) #46.

*********************************************************** G U M P
[GUMP@vmgump]: Project ws-commons-axiom (in module ws-axis2-commons) failed
To whom it may engage...
        
This is an automated request, but not an unsolicited one. For 
more information please visit http://gump.apache.org/nagged.html, 
and/or contact the folk at general@gump.apache.org.

Project ws-commons-axiom has an issue affecting its community integration.
This issue affects 1 projects,
 and has been outstanding for 958 runs.
The current state of this project is 'Failed', with reason 'Build Failed'.
For reference only, the following projects are affected by this:
    - ws-commons-axiom :  Common stuff for the WS projects.


Full details are available at:
    http://vmgump.apache.org/gump/public/ws-axis2-commons/ws-commons-axiom/index.html

That said, some information snippets are provided here.

The following annotations (debug/informational/warning/error messages) were provided:
 -DEBUG- (Apache Gump generated) Apache Maven Settings in: /srv/gump/public/workspace/ws-axis2-commons/axiom/gump_mvn_settings.xml
 -INFO- Failed with reason build failed
 -DEBUG- Maven POM in: /srv/gump/public/workspace/ws-axis2-commons/axiom/pom.xml



The following work was performed:
http://vmgump.apache.org/gump/public/ws-axis2-commons/ws-commons-axiom/gump_work/build_ws-axis2-commons_ws-commons-axiom.html
Work Name: build_ws-axis2-commons_ws-commons-axiom (Type: Build)
Work ended in a state of : Failed
Elapsed: 6 mins 23 secs
Command Line: /opt/maven2/bin/mvn --batch-mode --settings /srv/gump/public/workspace/ws-axis2-commons/axiom/gump_mvn_settings.xml install 
[Working Directory: /srv/gump/public/workspace/ws-axis2-commons/axiom]
M2_HOME: /opt/maven2
---------------------------------------------
  AXIOM-124.xml - crimson(org.apache.axiom.om.impl.builder.SAXOMBuilderSAXParserTest): org.apache.crimson.tree.XmlDocument.getXmlVersion()Ljava/lang/String;
  null-namespace.xml - crimson(org.apache.axiom.om.impl.builder.SAXOMBuilderSAXParserTest): org.apache.crimson.tree.XmlDocument.getXmlVersion()Ljava/lang/String;
  xml-prefix.xml - crimson(org.apache.axiom.om.impl.builder.SAXOMBuilderSAXParserTest): org.apache.crimson.tree.XmlDocument.getXmlVersion()Ljava/lang/String;
  namespaces3.xml - crimson(org.apache.axiom.om.impl.builder.SAXOMBuilderSAXParserTest): org.apache.crimson.tree.XmlDocument.getXmlVersion()Ljava/lang/String;
  AXIS2-192.xml - crimson(org.apache.axiom.om.impl.builder.SAXOMBuilderSAXParserTest): org.apache.crimson.tree.XmlDocument.getXmlVersion()Ljava/lang/String;
  iso-8859-1.xml - crimson(org.apache.axiom.om.impl.builder.SAXOMBuilderSAXParserTest): org.apache.crimson.tree.XmlDocument.getXmlVersion()Ljava/lang/String;
  masked-namespace-declaration.xml - crimson(org.apache.axiom.om.impl.builder.SAXOMBuilderSAXParserTest): org.apache.crimson.tree.XmlDocument.getXmlVersion()Ljava/lang/String;
  test.xml - crimson(org.apache.axiom.om.impl.builder.SAXOMBuilderSAXParserTest): org.apache.crimson.tree.XmlDocument.getXmlVersion()Ljava/lang/String;
  namespaces.xml - crimson(org.apache.axiom.om.impl.builder.SAXOMBuilderSAXParserTest): org.apache.crimson.tree.XmlDocument.getXmlVersion()Ljava/lang/String;
  utf-8.xml - crimson(org.apache.axiom.om.impl.builder.SAXOMBuilderSAXParserTest): org.apache.crimson.tree.XmlDocument.getXmlVersion()Ljava/lang/String;
  AXIS2-565.xml - crimson(org.apache.axiom.om.impl.builder.SAXOMBuilderSAXParserTest): org.apache.crimson.tree.XmlDocument.getXmlVersion()Ljava/lang/String;
  processingInstruction.xml - xerces(org.apache.axiom.om.impl.builder.SAXOMBuilderSAXParserTest): org.apache.crimson.tree.XmlDocument.getXmlVersion()Ljava/lang/String;
  spaces.xml - xerces(org.apache.axiom.om.impl.builder.SAXOMBuilderSAXParserTest): org.apache.crimson.tree.XmlDocument.getXmlVersion()Ljava/lang/String;
  cdata.xml - xerces(org.apache.axiom.om.impl.builder.SAXOMBuilderSAXParserTest): org.apache.crimson.tree.XmlDocument.getXmlVersion()Ljava/lang/String;
  namespaces2.xml - xerces(org.apache.axiom.om.impl.builder.SAXOMBuilderSAXParserTest): org.apache.crimson.tree.XmlDocument.getXmlVersion()Ljava/lang/String;
  AXIOM-124.xml - xerces(org.apache.axiom.om.impl.builder.SAXOMBuilderSAXParserTest): org.apache.crimson.tree.XmlDocument.getXmlVersion()Ljava/lang/String;
  null-namespace.xml - xerces(org.apache.axiom.om.impl.builder.SAXOMBuilderSAXParserTest): org.apache.crimson.tree.XmlDocument.getXmlVersion()Ljava/lang/String;
  xml-prefix.xml - xerces(org.apache.axiom.om.impl.builder.SAXOMBuilderSAXParserTest): org.apache.crimson.tree.XmlDocument.getXmlVersion()Ljava/lang/String;
  namespaces3.xml - xerces(org.apache.axiom.om.impl.builder.SAXOMBuilderSAXParserTest): org.apache.crimson.tree.XmlDocument.getXmlVersion()Ljava/lang/String;
  AXIS2-192.xml - xerces(org.apache.axiom.om.impl.builder.SAXOMBuilderSAXParserTest): org.apache.crimson.tree.XmlDocument.getXmlVersion()Ljava/lang/String;
  iso-8859-1.xml - xerces(org.apache.axiom.om.impl.builder.SAXOMBuilderSAXParserTest): org.apache.crimson.tree.XmlDocument.getXmlVersion()Ljava/lang/String;
  masked-namespace-declaration.xml - xerces(org.apache.axiom.om.impl.builder.SAXOMBuilderSAXParserTest): org.apache.crimson.tree.XmlDocument.getXmlVersion()Ljava/lang/String;
  test.xml - xerces(org.apache.axiom.om.impl.builder.SAXOMBuilderSAXParserTest): org.apache.crimson.tree.XmlDocument.getXmlVersion()Ljava/lang/String;
  namespaces.xml - xerces(org.apache.axiom.om.impl.builder.SAXOMBuilderSAXParserTest): org.apache.crimson.tree.XmlDocument.getXmlVersion()Ljava/lang/String;
  utf-8.xml - xerces(org.apache.axiom.om.impl.builder.SAXOMBuilderSAXParserTest): org.apache.crimson.tree.XmlDocument.getXmlVersion()Ljava/lang/String;
  AXIS2-565.xml - xerces(org.apache.axiom.om.impl.builder.SAXOMBuilderSAXParserTest): org.apache.crimson.tree.XmlDocument.getXmlVersion()Ljava/lang/String;
  test(org.apache.axiom.om.impl.builder.SAXOMBuilderJAXBTest): org.apache.crimson.tree.XmlDocument.getXmlVersion()Ljava/lang/String;
  test(org.apache.axiom.om.impl.builder.SAXOMBuilderXMLBeansTest): org.apache.crimson.tree.XmlDocument.getXmlVersion()Ljava/lang/String;
  testStylesheet[0](org.apache.axiom.om.impl.dom.jaxp.TransformerTest): org.apache.crimson.tree.XmlDocument.getXmlVersion()Ljava/lang/String;
  testIdentity[0](org.apache.axiom.om.impl.dom.jaxp.TransformerTest): Caught exception during comparison
  testStylesheet[1](org.apache.axiom.om.impl.dom.jaxp.TransformerTest)
  testIdentity[1](org.apache.axiom.om.impl.dom.jaxp.TransformerTest): Caught exception during comparison
  testIdentity[0](org.apache.axiom.om.impl.jaxp.TransformerTest)
  testIdentity[1](org.apache.axiom.om.impl.jaxp.TransformerTest)

Tests run: 44, Failures: 0, Errors: 38, Skipped: 0

[INFO] ------------------------------------------------------------------------
[ERROR] BUILD FAILURE
[INFO] ------------------------------------------------------------------------
[INFO] There are test failures.

Please refer to /srv/gump/public/workspace/ws-axis2-commons/axiom/modules/axiom-integration/target/surefire-reports for the individual test results.
[INFO] ------------------------------------------------------------------------
[INFO] For more information, run Maven with the -e switch
[INFO] ------------------------------------------------------------------------
[INFO] Total time: 6 minutes 22 seconds
[INFO] Finished at: Sat Dec 31 06:37:59 UTC 2011
[INFO] Final Memory: 82M/197M
[INFO] ------------------------------------------------------------------------
---------------------------------------------

To subscribe to this information via syndicated feeds:
- RSS: http://vmgump.apache.org/gump/public/ws-axis2-commons/ws-commons-axiom/rss.xml
- Atom: http://vmgump.apache.org/gump/public/ws-axis2-commons/ws-commons-axiom/atom.xml

============================== Gump Tracking Only ===
Produced by Apache Gump(TM) version 2.3.
Gump Run 11000031122011, vmgump.apache.org:vmgump:11000031122011
Gump E-mail Identifier (unique within run) #47.

*********************************************************** G U M P
[GUMP@vmgump]: Project portals-pluto-trunk-test (in module portals-pluto-trunk) failed
To whom it may engage...
        
This is an automated request, but not an unsolicited one. For 
more information please visit http://gump.apache.org/nagged.html, 
and/or contact the folk at general@gump.apache.org.

Project portals-pluto-trunk-test has an issue affecting its community integration.
This issue affects 1 projects,
 and has been outstanding for 239 runs.
The current state of this project is 'Failed', with reason 'Build Failed'.
For reference only, the following projects are affected by this:
    - portals-pluto-trunk-test :  JSR168 Container


Full details are available at:
    http://vmgump.apache.org/gump/public/portals-pluto-trunk/portals-pluto-trunk-test/index.html

That said, some information snippets are provided here.

The following annotations (debug/informational/warning/error messages) were provided:
 -WARNING- Overriding Maven settings: [/srv/gump/public/workspace/portals-pluto-trunk/gump_mvn_settings.xml]
 -DEBUG- (Apache Gump generated) Apache Maven Settings in: /srv/gump/public/workspace/portals-pluto-trunk/gump_mvn_settings.xml
 -INFO- Failed with reason build failed
 -DEBUG- Maven POM in: /srv/gump/public/workspace/portals-pluto-trunk/pom.xml



The following work was performed:
http://vmgump.apache.org/gump/public/portals-pluto-trunk/portals-pluto-trunk-test/gump_work/build_portals-pluto-trunk_portals-pluto-trunk-test.html
Work Name: build_portals-pluto-trunk_portals-pluto-trunk-test (Type: Build)
Work ended in a state of : Failed
Elapsed: 24 secs
Command Line: /opt/maven2/bin/mvn --batch-mode --settings /srv/gump/public/workspace/portals-pluto-trunk/gump_mvn_settings.xml package 
[Working Directory: /srv/gump/public/workspace/portals-pluto-trunk]
M2_HOME: /opt/maven2
---------------------------------------------
[ERROR] FATAL ERROR
[INFO] ------------------------------------------------------------------------
[INFO] org/xmlpull/v1/XmlPullParserFactory
org.xmlpull.v1.XmlPullParserFactory
[INFO] ------------------------------------------------------------------------
[INFO] Trace
java.lang.NoClassDefFoundError: org/xmlpull/v1/XmlPullParserFactory
	at com.thoughtworks.xstream.io.xml.XppDriver.createParser(XppDriver.java:57)
	at com.thoughtworks.xstream.io.xml.AbstractXppDriver.createReader(AbstractXppDriver.java:54)
	at com.thoughtworks.xstream.XStream.fromXML(XStream.java:912)
	at org.apache.maven.plugin.war.util.WebappStructureSerializer.fromXml(WebappStructureSerializer.java:73)
	at org.apache.maven.plugin.war.AbstractWarMojo.buildWebapp(AbstractWarMojo.java:423)
	at org.apache.maven.plugin.war.AbstractWarMojo.buildExplodedWebapp(AbstractWarMojo.java:394)
	at org.apache.maven.plugin.war.WarMojo.performPackaging(WarMojo.java:195)
	at org.apache.maven.plugin.war.WarMojo.execute(WarMojo.java:157)
	at org.apache.maven.plugin.DefaultPluginManager.executeMojo(DefaultPluginManager.java:490)
	at org.apache.maven.lifecycle.DefaultLifecycleExecutor.executeGoals(DefaultLifecycleExecutor.java:694)
	at org.apache.maven.lifecycle.DefaultLifecycleExecutor.executeGoalWithLifecycle(DefaultLifecycleExecutor.java:556)
	at org.apache.maven.lifecycle.DefaultLifecycleExecutor.executeGoal(DefaultLifecycleExecutor.java:535)
	at org.apache.maven.lifecycle.DefaultLifecycleExecutor.executeGoalAndHandleFailures(DefaultLifecycleExecutor.java:387)
	at org.apache.maven.lifecycle.DefaultLifecycleExecutor.executeTaskSegments(DefaultLifecycleExecutor.java:348)
	at org.apache.maven.lifecycle.DefaultLifecycleExecutor.execute(DefaultLifecycleExecutor.java:180)
	at org.apache.maven.DefaultMaven.doExecute(DefaultMaven.java:328)
	at org.apache.maven.DefaultMaven.execute(DefaultMaven.java:138)
	at org.apache.maven.cli.MavenCli.main(MavenCli.java:362)
	at org.apache.maven.cli.compat.CompatibleMain.main(CompatibleMain.java:60)
	at sun.reflect.NativeMethodAccessorImpl.invoke0(Native Method)
	at sun.reflect.NativeMethodAccessorImpl.invoke(NativeMethodAccessorImpl.java:57)
	at sun.reflect.DelegatingMethodAccessorImpl.invoke(DelegatingMethodAccessorImpl.java:43)
	at java.lang.reflect.Method.invoke(Method.java:616)
	at org.codehaus.classworlds.Launcher.launchEnhanced(Launcher.java:315)
	at org.codehaus.classworlds.Launcher.launch(Launcher.java:255)
	at org.codehaus.classworlds.Launcher.mainWithExitCode(Launcher.java:430)
	at org.codehaus.classworlds.Launcher.main(Launcher.java:375)
Caused by: java.lang.ClassNotFoundException: org.xmlpull.v1.XmlPullParserFactory
	at java.net.URLClassLoader$1.run(URLClassLoader.java:217)
	at java.security.AccessController.doPrivileged(Native Method)
	at java.net.URLClassLoader.findClass(URLClassLoader.java:205)
	at java.lang.ClassLoader.loadClass(ClassLoader.java:321)
	at org.codehaus.classworlds.RealmClassLoader.loadClassDirect(RealmClassLoader.java:195)
	at org.codehaus.classworlds.DefaultClassRealm.loadClass(DefaultClassRealm.java:255)
	at org.codehaus.classworlds.DefaultClassRealm.loadClass(DefaultClassRealm.java:274)
	at org.codehaus.classworlds.RealmClassLoader.loadClass(RealmClassLoader.java:214)
	at java.lang.ClassLoader.loadClass(ClassLoader.java:266)
	... 27 more
[INFO] ------------------------------------------------------------------------
[INFO] Total time: 23 seconds
[INFO] Finished at: Sat Dec 31 07:01:29 UTC 2011
[INFO] Final Memory: 31M/75M
[INFO] ------------------------------------------------------------------------
---------------------------------------------

To subscribe to this information via syndicated feeds:
- RSS: http://vmgump.apache.org/gump/public/portals-pluto-trunk/portals-pluto-trunk-test/rss.xml
- Atom: http://vmgump.apache.org/gump/public/portals-pluto-trunk/portals-pluto-trunk-test/atom.xml

============================== Gump Tracking Only ===
Produced by Apache Gump(TM) version 2.3.
Gump Run 11000031122011, vmgump.apache.org:vmgump:11000031122011
Gump E-mail Identifier (unique within run) #48.

*********************************************************** G U M P
[GUMP@vmgump]: Project openjpa-kernel (in module openjpa) failed
To whom it may engage...
        
This is an automated request, but not an unsolicited one. For 
more information please visit http://gump.apache.org/nagged.html, 
and/or contact the folk at general@gump.apache.org.

Project openjpa-kernel has an issue affecting its community integration.
This issue affects 8 projects,
 and has been outstanding for 443 runs.
The current state of this project is 'Failed', with reason 'Build Failed'.
For reference only, the following projects are affected by this:
    - openjpa :  Apache OpenJPA is a Java persistence project that can be use...
    - openjpa-jdbc :  Apache OpenJPA is a Java persistence project that can be use...
    - openjpa-kernel :  Apache OpenJPA is a Java persistence project that can be use...
    - openjpa-persistence :  Apache OpenJPA is a Java persistence project that can be use...
    - openjpa-persistence-jdbc :  Apache OpenJPA is a Java persistence project that can be use...
    - openjpa-slice :  Apache OpenJPA is a Java persistence project that can be use...
    - openjpa-testsupport :  Apache OpenJPA is a Java persistence project that can be use...
    - openjpa-xmlstore :  Apache OpenJPA is a Java persistence project that can be use...


Full details are available at:
    http://vmgump.apache.org/gump/public/openjpa/openjpa-kernel/index.html

That said, some information snippets are provided here.

The following annotations (debug/informational/warning/error messages) were provided:
 -DEBUG- Sole jar output [openjpa-kernel-*[0-9T].jar] identifier set to project name
 -DEBUG- (Apache Gump generated) Apache Maven Settings in: /srv/gump/public/workspace/openjpa/openjpa-kernel/gump_mvn_settings.xml
 -INFO- Failed with reason build failed
 -DEBUG- Maven POM in: /srv/gump/public/workspace/openjpa/openjpa-kernel/pom.xml
 -INFO- Failed to extract fallback artifacts from Gump Repository



The following work was performed:
http://vmgump.apache.org/gump/public/openjpa/openjpa-kernel/gump_work/build_openjpa_openjpa-kernel.html
Work Name: build_openjpa_openjpa-kernel (Type: Build)
Work ended in a state of : Failed
Elapsed: 34 secs
Command Line: /opt/maven2/bin/mvn --batch-mode -Dcheckstyle.skip=true --settings /srv/gump/public/workspace/openjpa/openjpa-kernel/gump_mvn_settings.xml package 
[Working Directory: /srv/gump/public/workspace/openjpa/openjpa-kernel]
M2_HOME: /opt/maven2
---------------------------------------------
/srv/gump/public/workspace/openjpa/openjpa-kernel/src/main/java/org/apache/openjpa/enhance/PCDataGenerator.java:[732,44] cannot find symbol
symbol  : class Code
location: class org.apache.openjpa.enhance.PCDataGenerator
/srv/gump/public/workspace/openjpa/openjpa-kernel/src/main/java/org/apache/openjpa/enhance/PCDataGenerator.java:[733,36] cannot find symbol
symbol  : class Instruction
location: class org.apache.openjpa.enhance.PCDataGenerator
/srv/gump/public/workspace/openjpa/openjpa-kernel/src/main/java/org/apache/openjpa/enhance/PCDataGenerator.java:[732,12] cannot find symbol
symbol  : class Instruction
location: class org.apache.openjpa.enhance.PCDataGenerator
/srv/gump/public/workspace/openjpa/openjpa-kernel/src/main/java/org/apache/openjpa/enhance/PCDataGenerator.java:[762,33] cannot find symbol
symbol  : class BCClass
location: class org.apache.openjpa.enhance.PCDataGenerator
/srv/gump/public/workspace/openjpa/openjpa-kernel/src/main/java/org/apache/openjpa/enhance/PCDataGenerator.java:[769,32] cannot find symbol
symbol  : class BCClass
location: class org.apache.openjpa.enhance.PCDataGenerator
/srv/gump/public/workspace/openjpa/openjpa-kernel/src/main/java/org/apache/openjpa/enhance/PCDataGenerator.java:[855,26] cannot find symbol
symbol  : class BCClass
location: class org.apache.openjpa.enhance.PCDataGenerator
/srv/gump/public/workspace/openjpa/openjpa-kernel/src/main/java/org/apache/openjpa/enhance/PCDataGenerator.java:[855,38] cannot find symbol
symbol  : class Code
location: class org.apache.openjpa.enhance.PCDataGenerator
/srv/gump/public/workspace/openjpa/openjpa-kernel/src/main/java/org/apache/openjpa/enhance/PCDataGenerator.java:[944,32] cannot find symbol
symbol  : class BCClass
location: class org.apache.openjpa.enhance.PCDataGenerator
/srv/gump/public/workspace/openjpa/openjpa-kernel/src/main/java/org/apache/openjpa/enhance/PCDataGenerator.java:[967,28] cannot find symbol
symbol  : class BCClass
location: class org.apache.openjpa.enhance.PCDataGenerator
/srv/gump/public/workspace/openjpa/openjpa-kernel/src/main/java/org/apache/openjpa/enhance/PCDataGenerator.java:[1030,38] cannot find symbol
symbol  : class BCClass
location: class org.apache.openjpa.enhance.PCDataGenerator
/srv/gump/public/workspace/openjpa/openjpa-kernel/src/main/java/org/apache/openjpa/enhance/PCDataGenerator.java:[1049,29] cannot find symbol
symbol  : class Instruction
location: class org.apache.openjpa.enhance.PCDataGenerator
/srv/gump/public/workspace/openjpa/openjpa-kernel/src/main/java/org/apache/openjpa/enhance/PCDataGenerator.java:[1049,57] cannot find symbol
symbol  : class Instruction
location: class org.apache.openjpa.enhance.PCDataGenerator
/srv/gump/public/workspace/openjpa/openjpa-kernel/src/main/java/org/apache/openjpa/enhance/DynamicStorageGenerator.java:[98,18] cannot find symbol
symbol  : class Project
location: class org.apache.openjpa.enhance.DynamicStorageGenerator
/srv/gump/public/workspace/openjpa/openjpa-kernel/src/main/java/org/apache/openjpa/enhance/DynamicStorageGenerator.java:[99,18] cannot find symbol
symbol  : class BCClassLoader
location: class org.apache.openjpa.enhance.DynamicStorageGenerator

[INFO] ------------------------------------------------------------------------
[INFO] For more information, run Maven with the -e switch
[INFO] ------------------------------------------------------------------------
[INFO] Total time: 33 seconds
[INFO] Finished at: Sat Dec 31 07:23:32 UTC 2011
[INFO] Final Memory: 47M/176M
[INFO] ------------------------------------------------------------------------
---------------------------------------------

To subscribe to this information via syndicated feeds:
- RSS: http://vmgump.apache.org/gump/public/openjpa/openjpa-kernel/rss.xml
- Atom: http://vmgump.apache.org/gump/public/openjpa/openjpa-kernel/atom.xml

============================== Gump Tracking Only ===
Produced by Apache Gump(TM) version 2.3.
Gump Run 11000031122011, vmgump.apache.org:vmgump:11000031122011
Gump E-mail Identifier (unique within run) #49.

*********************************************************** G U M P
[GUMP@vmgump]: Project tapestry (in module tapestry) failed
To whom it may engage...
        
This is an automated request, but not an unsolicited one. For 
more information please visit http://gump.apache.org/nagged.html, 
and/or contact the folk at general@gump.apache.org.

Project tapestry has an issue affecting its community integration.
This issue affects 1 projects,
 and has been outstanding for 918 runs.
The current state of this project is 'Failed', with reason 'Build Failed'.
For reference only, the following projects are affected by this:
    - tapestry :  Component-based web application framework organized around i...


Full details are available at:
    http://vmgump.apache.org/gump/public/tapestry/tapestry/index.html

That said, some information snippets are provided here.

The following annotations (debug/informational/warning/error messages) were provided:
 -INFO- Optional dependency commons-fileupload prerequisite failed with reason build failed
 -DEBUG- (Apache Gump generated) Apache Maven Settings in: /srv/gump/public/workspace/tapestry/gump_mvn_settings.xml
 -INFO- Failed with reason build failed
 -INFO- Failed to extract fallback artifacts from Gump Repository



The following work was performed:
http://vmgump.apache.org/gump/public/tapestry/tapestry/gump_work/build_tapestry_tapestry.html
Work Name: build_tapestry_tapestry (Type: Build)
Work ended in a state of : Failed
Elapsed: 2 secs
Command Line: /opt/maven2/bin/mvn --batch-mode -DskipTests=true --settings /srv/gump/public/workspace/tapestry/gump_mvn_settings.xml package 
[Working Directory: /srv/gump/public/workspace/tapestry]
M2_HOME: /opt/maven2
---------------------------------------------
[INFO] Scanning for projects...
[INFO] ------------------------------------------------------------------------
[INFO] Building Maven Default Project
[INFO]    task-segment: [package]
[INFO] ------------------------------------------------------------------------
[INFO] ------------------------------------------------------------------------
[ERROR] BUILD ERROR
[INFO] ------------------------------------------------------------------------
[INFO] Cannot execute mojo: resources. It requires a project with an existing pom.xml, but the build is not using one.
[INFO] ------------------------------------------------------------------------
[INFO] For more information, run Maven with the -e switch
[INFO] ------------------------------------------------------------------------
[INFO] Total time: 1 second
[INFO] Finished at: Sat Dec 31 07:24:57 UTC 2011
[INFO] Final Memory: 4M/15M
[INFO] ------------------------------------------------------------------------
---------------------------------------------

To subscribe to this information via syndicated feeds:
- RSS: http://vmgump.apache.org/gump/public/tapestry/tapestry/rss.xml
- Atom: http://vmgump.apache.org/gump/public/tapestry/tapestry/atom.xml

============================== Gump Tracking Only ===
Produced by Apache Gump(TM) version 2.3.
Gump Run 11000031122011, vmgump.apache.org:vmgump:11000031122011
Gump E-mail Identifier (unique within run) #50.

*********************************************************** G U M P
[GUMP@vmgump]: Project ws-axis2 (in module ws-axis2) failed
To whom it may engage...
        
This is an automated request, but not an unsolicited one. For 
more information please visit http://gump.apache.org/nagged.html, 
and/or contact the folk at general@gump.apache.org.

Project ws-axis2 has an issue affecting its community integration.
This issue affects 2 projects,
 and has been outstanding for 59 runs.
The current state of this project is 'Failed', with reason 'Build Failed'.
For reference only, the following projects are affected by this:
    - ws-axis2 :  Apache Axis2 SOAP Stack
    - ws-axis2-test :  Apache Axis2 SOAP Stack


Full details are available at:
    http://vmgump.apache.org/gump/public/ws-axis2/ws-axis2/index.html

That said, some information snippets are provided here.

The following annotations (debug/informational/warning/error messages) were provided:
 -DEBUG- Sole jar output [ws-axis2-31122011] identifier set to project name
 -INFO- Optional dependency ws-commons-axiom failed with reason build failed
 -DEBUG- (Apache Gump generated) Apache Maven Settings in: /srv/gump/public/workspace/ws-axis2/gump_mvn_settings.xml
 -INFO- Failed with reason build failed
 -DEBUG- Maven POM in: /srv/gump/public/workspace/ws-axis2/pom.xml
 -INFO- Failed to extract fallback artifacts from Gump Repository



The following work was performed:
http://vmgump.apache.org/gump/public/ws-axis2/ws-axis2/gump_work/build_ws-axis2_ws-axis2.html
Work Name: build_ws-axis2_ws-axis2 (Type: Build)
Work ended in a state of : Failed
Elapsed: 1 min 50 secs
Command Line: /opt/maven2/bin/mvn --batch-mode -DskipTests=true --settings /srv/gump/public/workspace/ws-axis2/gump_mvn_settings.xml package 
[Working Directory: /srv/gump/public/workspace/ws-axis2]
M2_HOME: /opt/maven2
---------------------------------------------
Downloading: http://localhost:8192/maven2/org/apache/maven/shared/file-management/1.1/file-management-1.1.jar
Downloading: http://localhost:8192/maven2/org/codehaus/plexus/plexus-archiver/1.0-alpha-12/plexus-archiver-1.0-alpha-12.jar

Downloading: http://localhost:8192/maven2/org/apache/maven/shared/maven-shared-io/1.1/maven-shared-io-1.1.jar


Downloading: http://localhost:8192/maven2/org/codehaus/plexus/plexus-interpolation/1.7/plexus-interpolation-1.7.jar
Downloading: http://localhost:8192/maven2/org/apache/maven/shared/maven-filtering/1.0-beta-2/maven-filtering-1.0-beta-2.jar


Downloading: http://localhost:8192/maven2/org/codehaus/plexus/plexus-io/1.0-alpha-4/plexus-io-1.0-alpha-4.jar
Downloading: http://localhost:8192/maven2/org/apache/maven/shared/maven-repository-builder/1.0-alpha-2/maven-repository-builder-1.0-alpha-2.jar


Downloading: http://localhost:8192/maven2/org/codehaus/plexus/plexus-active-collections/1.0-beta-2/plexus-active-collections-1.0-beta-2.jar

[INFO] [assembly:single {execution: generate-test-zip}]
[INFO] Reading assembly descriptor: test-zip/assembly.xml
[INFO] Building zip: /srv/gump/public/workspace/ws-axis2/modules/kernel/target/test-zip.zip
[INFO] [resources:testResources {execution: default-testResources}]
[INFO] Using 'UTF-8' encoding to copy filtered resources.
[INFO] Copying 1 resource
[INFO] Copying 2 resources
[INFO] [antrun:run {execution: process-test-resources}]
[INFO] Executing tasks
     [copy] Copying 79 files to /srv/gump/public/workspace/ws-axis2/modules/kernel/target/test-resources

init:
     [echo] the files are up to date = ${jars.uptodate}

compile:
    [mkdir] Created dir: /srv/gump/public/workspace/ws-axis2/modules/kernel/test-resources/deployment/service2/build/classes
    [mkdir] Created dir: /srv/gump/public/workspace/ws-axis2/modules/kernel/test-resources/deployment/service2/build/lib
    [javac] /srv/gump/public/workspace/ws-axis2/modules/kernel/test-resources/deployment/service2/build.xml:39: warning: 'includeantruntime' was not set, defaulting to build.sysclasspath=last; set to false for repeatable builds
[INFO] ------------------------------------------------------------------------
[ERROR] BUILD ERROR
[INFO] ------------------------------------------------------------------------
[INFO] An Ant BuildException has occured: The following error occurred while executing this line:
/srv/gump/public/workspace/ws-axis2/modules/kernel/test-resources/deployment/service2/build.xml:39: Unable to find a javac compiler;
com.sun.tools.javac.Main is not on the classpath.
Perhaps JAVA_HOME does not point to the JDK.
It is currently set to "/usr/lib/jvm/java-6-openjdk/jre"

[INFO] ------------------------------------------------------------------------
[INFO] For more information, run Maven with the -e switch
[INFO] ------------------------------------------------------------------------
[INFO] Total time: 1 minute 49 seconds
[INFO] Finished at: Sat Dec 31 07:28:36 UTC 2011
[INFO] Final Memory: 51M/137M
[INFO] ------------------------------------------------------------------------
---------------------------------------------

To subscribe to this information via syndicated feeds:
- RSS: http://vmgump.apache.org/gump/public/ws-axis2/ws-axis2/rss.xml
- Atom: http://vmgump.apache.org/gump/public/ws-axis2/ws-axis2/atom.xml

============================== Gump Tracking Only ===
Produced by Apache Gump(TM) version 2.3.
Gump Run 11000031122011, vmgump.apache.org:vmgump:11000031122011
Gump E-mail Identifier (unique within run) #51.

*********************************************************** G U M P
[GUMP@vmgump]: Project cocoon3-reactor (in module cocoon3) failed
To whom it may engage...
        
This is an automated request, but not an unsolicited one. For 
more information please visit http://gump.apache.org/nagged.html, 
and/or contact the folk at general@gump.apache.org.

Project cocoon3-reactor has an issue affecting its community integration.
This issue affects 1 projects,
 and has been outstanding for 538 runs.
The current state of this project is 'Failed', with reason 'Build Failed'.
For reference only, the following projects are affected by this:
    - cocoon3-reactor :  Java XML Framework


Full details are available at:
    http://vmgump.apache.org/gump/public/cocoon3/cocoon3-reactor/index.html

That said, some information snippets are provided here.

The following annotations (debug/informational/warning/error messages) were provided:
 -DEBUG- (Apache Gump generated) Apache Maven Settings in: /srv/gump/public/workspace/cocoon3/gump_mvn_settings.xml
 -INFO- Failed with reason build failed
 -DEBUG- Maven POM in: /srv/gump/public/workspace/cocoon3/pom.xml



The following work was performed:
http://vmgump.apache.org/gump/public/cocoon3/cocoon3-reactor/gump_work/build_cocoon3_cocoon3-reactor.html
Work Name: build_cocoon3_cocoon3-reactor (Type: Build)
Work ended in a state of : Failed
Elapsed: 48 secs
Command Line: /opt/maven2/bin/mvn --batch-mode --settings /srv/gump/public/workspace/cocoon3/gump_mvn_settings.xml package 
[Working Directory: /srv/gump/public/workspace/cocoon3]
M2_HOME: /opt/maven2
---------------------------------------------
[INFO] Copying 3 resources
[INFO] Copying 3 resources
[INFO] [compiler:compile {execution: default-compile}]
[INFO] Nothing to compile - all classes are up to date
[debug] execute contextualize
[INFO] [resources:testResources {execution: default-testResources}]
[INFO] Using 'UTF-8' encoding to copy filtered resources.
[INFO] Copying 7 resources
[INFO] Copying 3 resources
[INFO] [compiler:testCompile {execution: default-testCompile}]
[INFO] Nothing to compile - all classes are up to date
[INFO] [surefire:test {execution: default-test}]
[INFO] Surefire report directory: /srv/gump/public/workspace/cocoon3/cocoon-optional/target/surefire-reports

-------------------------------------------------------
 T E S T S
-------------------------------------------------------
Running org.apache.cocoon.optional.pipeline.components.sax.jaxb.JAXBGeneratorTestCase
Tests run: 6, Failures: 0, Errors: 0, Skipped: 0, Time elapsed: 1.899 sec
Running org.apache.cocoon.optional.pipeline.components.sax.directory.DirectoryGeneratorTestCase
Tests run: 1, Failures: 0, Errors: 0, Skipped: 0, Time elapsed: 0.064 sec
Running org.apache.cocoon.optional.pipeline.components.sax.fop.FopSerializerTestCase
Tests run: 1, Failures: 0, Errors: 0, Skipped: 0, Time elapsed: 1.641 sec
Running org.apache.cocoon.optional.pipeline.components.sax.neko.NekoGeneratorTestCase
Tests run: 2, Failures: 0, Errors: 0, Skipped: 0, Time elapsed: 0.131 sec
Running org.apache.cocoon.optional.pipeline.components.sax.betwixt.BetwixtBeanGeneratorTest
Tests run: 2, Failures: 0, Errors: 0, Skipped: 0, Time elapsed: 0.296 sec
Running org.apache.cocoon.optional.pipeline.components.sax.solr.SolrConsumerTestCase
Tests run: 1, Failures: 0, Errors: 1, Skipped: 0, Time elapsed: 0.185 sec <<< FAILURE!

Results :

Tests in error: 
  testPipelineWithSolrConsumer(org.apache.cocoon.optional.pipeline.components.sax.solr.SolrConsumerTestCase): LUCENE_24

Tests run: 13, Failures: 0, Errors: 1, Skipped: 0

[INFO] ------------------------------------------------------------------------
[ERROR] BUILD FAILURE
[INFO] ------------------------------------------------------------------------
[INFO] There are test failures.

Please refer to /srv/gump/public/workspace/cocoon3/cocoon-optional/target/surefire-reports for the individual test results.
[INFO] ------------------------------------------------------------------------
[INFO] For more information, run Maven with the -e switch
[INFO] ------------------------------------------------------------------------
[INFO] Total time: 46 seconds
[INFO] Finished at: Sat Dec 31 07:41:17 UTC 2011
[INFO] Final Memory: 92M/221M
[INFO] ------------------------------------------------------------------------
---------------------------------------------

To subscribe to this information via syndicated feeds:
- RSS: http://vmgump.apache.org/gump/public/cocoon3/cocoon3-reactor/rss.xml
- Atom: http://vmgump.apache.org/gump/public/cocoon3/cocoon3-reactor/atom.xml

============================== Gump Tracking Only ===
Produced by Apache Gump(TM) version 2.3.
Gump Run 11000031122011, vmgump.apache.org:vmgump:11000031122011
Gump E-mail Identifier (unique within run) #52.

*********************************************************** G U M P
[GUMP@vmgump]: Project portals-bridges-script-test (in module portals-bridges) failed
To whom it may engage...
        
This is an automated request, but not an unsolicited one. For 
more information please visit http://gump.apache.org/nagged.html, 
and/or contact the folk at general@gump.apache.org.

Project portals-bridges-script-test has an issue affecting its community integration.
This issue affects 1 projects,
 and has been outstanding for 57 runs.
The current state of this project is 'Failed', with reason 'Build Failed'.
For reference only, the following projects are affected by this:
    - portals-bridges-script-test :  Support for JSR168 compliant Portlet development


Full details are available at:
    http://vmgump.apache.org/gump/public/portals-bridges/portals-bridges-script-test/index.html

That said, some information snippets are provided here.

The following annotations (debug/informational/warning/error messages) were provided:
 -WARNING- Overriding Maven settings: [/srv/gump/public/workspace/portals-bridges/bridges-script/trunk/portlet/gump_mvn_settings.xml]
 -DEBUG- (Apache Gump generated) Apache Maven Settings in: /srv/gump/public/workspace/portals-bridges/bridges-script/trunk/portlet/gump_mvn_settings.xml
 -INFO- Failed with reason build failed
 -DEBUG- Maven POM in: /srv/gump/public/workspace/portals-bridges/bridges-script/trunk/portlet/pom.xml



The following work was performed:
http://vmgump.apache.org/gump/public/portals-bridges/portals-bridges-script-test/gump_work/build_portals-bridges_portals-bridges-script-test.html
Work Name: build_portals-bridges_portals-bridges-script-test (Type: Build)
Work ended in a state of : Failed
Elapsed: 18 secs
Command Line: /opt/maven2/bin/mvn --batch-mode --settings /srv/gump/public/workspace/portals-bridges/bridges-script/trunk/portlet/gump_mvn_settings.xml package 
[Working Directory: /srv/gump/public/workspace/portals-bridges/bridges-script/trunk/portlet]
M2_HOME: /opt/maven2
---------------------------------------------
[INFO] Scanning for projects...
[INFO] ------------------------------------------------------------------------
[INFO] Building Apache Portals Bridges Script Bridge Portlet
[INFO]    task-segment: [package]
[INFO] ------------------------------------------------------------------------
[INFO] Setting property: classpath.resource.loader.class => 'org.codehaus.plexus.velocity.ContextClassLoaderResourceLoader'.
[INFO] Setting property: velocimacro.messages.on => 'false'.
[INFO] Setting property: resource.loader => 'classpath'.
[INFO] Setting property: resource.manager.logwhenfound => 'false'.
[INFO] [remote-resources:process {execution: default}]
[INFO] [resources:resources {execution: default-resources}]
[INFO] Using 'UTF-8' encoding to copy filtered resources.
[INFO] Copying 0 resource
[INFO] Copying 3 resources
[INFO] [compiler:compile {execution: default-compile}]
[INFO] Nothing to compile - all classes are up to date
[INFO] [resources:testResources {execution: default-testResources}]
[INFO] Using 'UTF-8' encoding to copy filtered resources.
[INFO] Copying 10 resources
[INFO] Copying 3 resources
[INFO] [compiler:testCompile {execution: default-testCompile}]
[INFO] Nothing to compile - all classes are up to date
[INFO] [surefire:test {execution: default-test}]
[INFO] Surefire report directory: /srv/gump/public/workspace/portals-bridges/bridges-script/trunk/portlet/target/surefire-reports

-------------------------------------------------------
 T E S T S
-------------------------------------------------------
Running org.apache.portals.bridges.script.TestHelloJythonScriptPortlet
Tests run: 5, Failures: 0, Errors: 5, Skipped: 0, Time elapsed: 0.622 sec <<< FAILURE!
Running org.apache.portals.bridges.script.TestHelloJRubyScriptPortlet
[INFO] ------------------------------------------------------------------------
[ERROR] BUILD FAILURE
[INFO] ------------------------------------------------------------------------
[INFO] There are test failures.

Please refer to /srv/gump/public/workspace/portals-bridges/bridges-script/trunk/portlet/target/surefire-reports for the individual test results.
[INFO] ------------------------------------------------------------------------
[INFO] For more information, run Maven with the -e switch
[INFO] ------------------------------------------------------------------------
[INFO] Total time: 17 seconds
[INFO] Finished at: Sat Dec 31 07:41:44 UTC 2011
[INFO] Final Memory: 17M/41M
[INFO] ------------------------------------------------------------------------
---------------------------------------------

To subscribe to this information via syndicated feeds:
- RSS: http://vmgump.apache.org/gump/public/portals-bridges/portals-bridges-script-test/rss.xml
- Atom: http://vmgump.apache.org/gump/public/portals-bridges/portals-bridges-script-test/atom.xml

============================== Gump Tracking Only ===
Produced by Apache Gump(TM) version 2.3.
Gump Run 11000031122011, vmgump.apache.org:vmgump:11000031122011
Gump E-mail Identifier (unique within run) #53.

*********************************************************** G U M P
[GUMP@vmgump]: Project apacheds-protocol-changepw (in module apacheds) failed
To whom it may engage...
        
This is an automated request, but not an unsolicited one. For 
more information please visit http://gump.apache.org/nagged.html, 
and/or contact the folk at general@gump.apache.org.

Project apacheds-protocol-changepw has an issue affecting its community integration.
This issue affects 1 projects,
 and has been outstanding for 29 runs.
The current state of this project is 'Failed', with reason 'Build Failed'.
For reference only, the following projects are affected by this:
    - apacheds-protocol-changepw :  Apache Directory Server


Full details are available at:
    http://vmgump.apache.org/gump/public/apacheds/apacheds-protocol-changepw/index.html

That said, some information snippets are provided here.

The following annotations (debug/informational/warning/error messages) were provided:
 -DEBUG- Sole jar output [apacheds-protocol-changepw-*[0-9T].jar] identifier set to project name
 -DEBUG- (Apache Gump generated) Apache Maven Settings in: /srv/gump/public/workspace/apacheds/protocol-changepw/gump_mvn_settings.xml
 -INFO- Failed with reason build failed
 -DEBUG- Maven POM in: /srv/gump/public/workspace/apacheds/protocol-changepw/pom.xml
 -INFO- Failed to extract fallback artifacts from Gump Repository



The following work was performed:
http://vmgump.apache.org/gump/public/apacheds/apacheds-protocol-changepw/gump_work/build_apacheds_apacheds-protocol-changepw.html
Work Name: build_apacheds_apacheds-protocol-changepw (Type: Build)
Work ended in a state of : Failed
Elapsed: 2 secs
Command Line: /opt/maven3/bin/mvn --batch-mode --settings /srv/gump/public/workspace/apacheds/protocol-changepw/gump_mvn_settings.xml install 
[Working Directory: /srv/gump/public/workspace/apacheds/protocol-changepw]
M2_HOME: /opt/maven3
---------------------------------------------
[INFO] Scanning for projects...
[ERROR] The build could not read 1 project -> [Help 1]
[ERROR]   
[ERROR]   The project org.apache.directory.server:apacheds-protocol-changepw:2.0.0-M3-SNAPSHOT (/srv/gump/public/workspace/apacheds/protocol-changepw/pom.xml) has 1 error
[ERROR]     Non-resolvable parent POM: Could not find artifact org.apache.directory.server:apacheds-parent:pom:2.0.0-M3-SNAPSHOT and 'parent.relativePath' points at wrong local POM @ line 22, column 11 -> [Help 2]
[ERROR] 
[ERROR] To see the full stack trace of the errors, re-run Maven with the -e switch.
[ERROR] Re-run Maven using the -X switch to enable full debug logging.
[ERROR] 
[ERROR] For more information about the errors and possible solutions, please read the following articles:
[ERROR] [Help 1] http://cwiki.apache.org/confluence/display/MAVEN/ProjectBuildingException
[ERROR] [Help 2] http://cwiki.apache.org/confluence/display/MAVEN/UnresolvableModelException
---------------------------------------------

To subscribe to this information via syndicated feeds:
- RSS: http://vmgump.apache.org/gump/public/apacheds/apacheds-protocol-changepw/rss.xml
- Atom: http://vmgump.apache.org/gump/public/apacheds/apacheds-protocol-changepw/atom.xml

============================== Gump Tracking Only ===
Produced by Apache Gump(TM) version 2.3.
Gump Run 11000031122011, vmgump.apache.org:vmgump:11000031122011
Gump E-mail Identifier (unique within run) #54.

*********************************************************** G U M P
[GUMP@vmgump]: Project cocoon-optional-test (in module cocoon3) failed
To whom it may engage...
        
This is an automated request, but not an unsolicited one. For 
more information please visit http://gump.apache.org/nagged.html, 
and/or contact the folk at general@gump.apache.org.

Project cocoon-optional-test has an issue affecting its community integration.
This issue affects 1 projects,
 and has been outstanding for 61 runs.
The current state of this project is 'Failed', with reason 'Build Failed'.
For reference only, the following projects are affected by this:
    - cocoon-optional-test :  Java XML Framework


Full details are available at:
    http://vmgump.apache.org/gump/public/cocoon3/cocoon-optional-test/index.html

That said, some information snippets are provided here.

The following annotations (debug/informational/warning/error messages) were provided:
 -WARNING- Overriding Maven settings: [/srv/gump/public/workspace/cocoon3/cocoon-optional/gump_mvn_settings.xml]
 -DEBUG- (Apache Gump generated) Apache Maven Settings in: /srv/gump/public/workspace/cocoon3/cocoon-optional/gump_mvn_settings.xml
 -INFO- Failed with reason build failed
 -DEBUG- Maven POM in: /srv/gump/public/workspace/cocoon3/cocoon-optional/pom.xml
 -INFO- Project Reports in: /srv/gump/public/workspace/cocoon3/cocoon-optional/target/surefire-reports



The following work was performed:
http://vmgump.apache.org/gump/public/cocoon3/cocoon-optional-test/gump_work/build_cocoon3_cocoon-optional-test.html
Work Name: build_cocoon3_cocoon-optional-test (Type: Build)
Work ended in a state of : Failed
Elapsed: 16 secs
Command Line: /opt/maven2/bin/mvn --batch-mode --settings /srv/gump/public/workspace/cocoon3/cocoon-optional/gump_mvn_settings.xml test 
[Working Directory: /srv/gump/public/workspace/cocoon3/cocoon-optional]
M2_HOME: /opt/maven2
---------------------------------------------
[INFO] Copying 3 resources
[INFO] Copying 3 resources
[INFO] [compiler:compile {execution: default-compile}]
[INFO] Nothing to compile - all classes are up to date
[debug] execute contextualize
[INFO] [resources:testResources {execution: default-testResources}]
[INFO] Using 'UTF-8' encoding to copy filtered resources.
[INFO] Copying 7 resources
[INFO] Copying 3 resources
[INFO] [compiler:testCompile {execution: default-testCompile}]
[INFO] Nothing to compile - all classes are up to date
[INFO] [surefire:test {execution: default-test}]
[INFO] Surefire report directory: /srv/gump/public/workspace/cocoon3/cocoon-optional/target/surefire-reports

-------------------------------------------------------
 T E S T S
-------------------------------------------------------
Running org.apache.cocoon.optional.pipeline.components.sax.jaxb.JAXBGeneratorTestCase
Tests run: 6, Failures: 0, Errors: 0, Skipped: 0, Time elapsed: 1.137 sec
Running org.apache.cocoon.optional.pipeline.components.sax.directory.DirectoryGeneratorTestCase
Tests run: 1, Failures: 0, Errors: 0, Skipped: 0, Time elapsed: 0.06 sec
Running org.apache.cocoon.optional.pipeline.components.sax.fop.FopSerializerTestCase
Tests run: 1, Failures: 0, Errors: 0, Skipped: 0, Time elapsed: 1.409 sec
Running org.apache.cocoon.optional.pipeline.components.sax.neko.NekoGeneratorTestCase
Tests run: 2, Failures: 0, Errors: 0, Skipped: 0, Time elapsed: 0.074 sec
Running org.apache.cocoon.optional.pipeline.components.sax.betwixt.BetwixtBeanGeneratorTest
Tests run: 2, Failures: 0, Errors: 0, Skipped: 0, Time elapsed: 0.26 sec
Running org.apache.cocoon.optional.pipeline.components.sax.solr.SolrConsumerTestCase
Tests run: 1, Failures: 0, Errors: 1, Skipped: 0, Time elapsed: 0.12 sec <<< FAILURE!

Results :

Tests in error: 
  testPipelineWithSolrConsumer(org.apache.cocoon.optional.pipeline.components.sax.solr.SolrConsumerTestCase): LUCENE_24

Tests run: 13, Failures: 0, Errors: 1, Skipped: 0

[INFO] ------------------------------------------------------------------------
[ERROR] BUILD FAILURE
[INFO] ------------------------------------------------------------------------
[INFO] There are test failures.

Please refer to /srv/gump/public/workspace/cocoon3/cocoon-optional/target/surefire-reports for the individual test results.
[INFO] ------------------------------------------------------------------------
[INFO] For more information, run Maven with the -e switch
[INFO] ------------------------------------------------------------------------
[INFO] Total time: 15 seconds
[INFO] Finished at: Sat Dec 31 07:48:22 UTC 2011
[INFO] Final Memory: 37M/88M
[INFO] ------------------------------------------------------------------------
---------------------------------------------

To subscribe to this information via syndicated feeds:
- RSS: http://vmgump.apache.org/gump/public/cocoon3/cocoon-optional-test/rss.xml
- Atom: http://vmgump.apache.org/gump/public/cocoon3/cocoon-optional-test/atom.xml

============================== Gump Tracking Only ===
Produced by Apache Gump(TM) version 2.3.
Gump Run 11000031122011, vmgump.apache.org:vmgump:11000031122011
Gump E-mail Identifier (unique within run) #55.

*********************************************************** G U M P
[GUMP@vmgump]: Project james-mailbox (in module james-mailbox) failed
To whom it may engage...
        
This is an automated request, but not an unsolicited one. For 
more information please visit http://gump.apache.org/nagged.html, 
and/or contact the folk at general@gump.apache.org.

Project james-mailbox has an issue affecting its community integration.
This issue affects 2 projects,
 and has been outstanding for 77 runs.
The current state of this project is 'Failed', with reason 'Build Failed'.
For reference only, the following projects are affected by this:
    - james-mailbox :  A library providing a flexible Mailbox storage accessible by...
    - james-mailbox-test :  A library providing a flexible Mailbox storage accessible by...


Full details are available at:
    http://vmgump.apache.org/gump/public/james-mailbox/james-mailbox/index.html

That said, some information snippets are provided here.

The following annotations (debug/informational/warning/error messages) were provided:
 -INFO- Optional dependency openjpa prerequisite failed with reason build failed
 -WARNING- Overriding Maven settings: [/srv/gump/public/workspace/james-mailbox/gump_mvn_settings.xml]
 -DEBUG- (Apache Gump generated) Apache Maven Settings in: /srv/gump/public/workspace/james-mailbox/gump_mvn_settings.xml
 -INFO- Failed with reason build failed
 -DEBUG- Maven POM in: /srv/gump/public/workspace/james-mailbox/pom.xml
 -INFO- Failed to extract fallback artifacts from Gump Repository



The following work was performed:
http://vmgump.apache.org/gump/public/james-mailbox/james-mailbox/gump_work/build_james-mailbox_james-mailbox.html
Work Name: build_james-mailbox_james-mailbox (Type: Build)
Work ended in a state of : Failed
Elapsed: 23 secs
Command Line: /opt/maven3/bin/mvn --batch-mode -DskipTests=true --settings /srv/gump/public/workspace/james-mailbox/gump_mvn_settings.xml install 
[Working Directory: /srv/gump/public/workspace/james-mailbox]
M2_HOME: /opt/maven3
---------------------------------------------
[ERROR] doc.add(new Field(SENT_DATE_FIELD_HOUR_RESOLUTION, DateTools.dateToString(sentDate, DateTools.Resolution.HOUR), Store.NO, Index.NOT_ANALYZED));
[ERROR] /srv/gump/public/workspace/james-mailbox/lucene/src/main/java/org/apache/james/mailbox/lucene/search/LuceneMessageSearchIndex.java:[585,142] cannot find symbol
[ERROR] symbol: variable Index
[ERROR] doc.add(new Field(SENT_DATE_FIELD_HOUR_RESOLUTION, DateTools.dateToString(sentDate, DateTools.Resolution.HOUR), Store.NO, Index.NOT_ANALYZED));
[ERROR] /srv/gump/public/workspace/james-mailbox/lucene/src/main/java/org/apache/james/mailbox/lucene/search/LuceneMessageSearchIndex.java:[585,28] internal error; cannot instantiate org.apache.lucene.document.Field.<init> at org.apache.lucene.document.Field to ()
[ERROR] /srv/gump/public/workspace/james-mailbox/lucene/src/main/java/org/apache/james/mailbox/lucene/search/LuceneMessageSearchIndex.java:[586,136] cannot find symbol
[ERROR] symbol: variable Store
[ERROR] doc.add(new Field(SENT_DATE_FIELD_MINUTE_RESOLUTION, DateTools.dateToString(sentDate, DateTools.Resolution.MINUTE), Store.NO, Index.NOT_ANALYZED));
[ERROR] /srv/gump/public/workspace/james-mailbox/lucene/src/main/java/org/apache/james/mailbox/lucene/search/LuceneMessageSearchIndex.java:[586,146] cannot find symbol
[ERROR] symbol: variable Index
[ERROR] doc.add(new Field(SENT_DATE_FIELD_MINUTE_RESOLUTION, DateTools.dateToString(sentDate, DateTools.Resolution.MINUTE), Store.NO, Index.NOT_ANALYZED));
[ERROR] /srv/gump/public/workspace/james-mailbox/lucene/src/main/java/org/apache/james/mailbox/lucene/search/LuceneMessageSearchIndex.java:[586,28] internal error; cannot instantiate org.apache.lucene.document.Field.<init> at org.apache.lucene.document.Field to ()
[ERROR] /srv/gump/public/workspace/james-mailbox/lucene/src/main/java/org/apache/james/mailbox/lucene/search/LuceneMessageSearchIndex.java:[587,136] cannot find symbol
[ERROR] symbol: variable Store
[ERROR] doc.add(new Field(SENT_DATE_FIELD_SECOND_RESOLUTION, DateTools.dateToString(sentDate, DateTools.Resolution.SECOND), Store.NO, Index.NOT_ANALYZED));
[ERROR] /srv/gump/public/workspace/james-mailbox/lucene/src/main/java/org/apache/james/mailbox/lucene/search/LuceneMessageSearchIndex.java:[587,146] cannot find symbol
[ERROR] symbol: variable Index
[ERROR] doc.add(new Field(SENT_DATE_FIELD_SECOND_RESOLUTION, DateTools.dateToString(sentDate, DateTools.Resolution.SECOND), Store.NO, Index.NOT_ANALYZED));
[ERROR] /srv/gump/public/workspace/james-mailbox/lucene/src/main/java/org/apache/james/mailbox/lucene/search/LuceneMessageSearchIndex.java:[587,28] internal error; cannot instantiate org.apache.lucene.document.Field.<init> at org.apache.lucene.document.Field to ()
[ERROR] /srv/gump/public/workspace/james-mailbox/lucene/src/main/java/org/apache/james/mailbox/lucene/search/LuceneMessageSearchIndex.java:[588,146] cannot find symbol
[ERROR] symbol: variable Store
[ERROR] doc.add(new Field(SENT_DATE_FIELD_MILLISECOND_RESOLUTION, DateTools.dateToString(sentDate, DateTools.Resolution.MILLISECOND), Store.NO, Index.NOT_ANALYZED));
[ERROR] /srv/gump/public/workspace/james-mailbox/lucene/src/main/java/org/apache/james/mailbox/lucene/search/LuceneMessageSearchIndex.java:[588,156] cannot find symbol
[ERROR] symbol: variable Index
[ERROR] doc.add(new Field(SENT_DATE_FIELD_MILLISECOND_RESOLUTION, DateTools.dateToString(sentDate, DateTools.Resolution.MILLISECOND), Store.NO, Index.NOT_ANALYZED));
[ERROR] /srv/gump/public/workspace/james-mailbox/lucene/src/main/java/org/apache/james/mailbox/lucene/search/LuceneMessageSearchIndex.java:[588,28] internal error; cannot instantiate org.apache.lucene.document.Field.<init> at org.apache.lucene.document.Field to ()
[ERROR] /srv/gump/public/workspace/james-mailbox/lucene/src/main/java/org/apache/james/mailbox/lucene/search/LuceneMessageSearchIndex.java:[591,146] cannot find symbol
[ERROR] symbol: variable Store
[ERROR] doc.add(new Field(SENT_DATE_SORT_FIELD_MILLISECOND_RESOLUTION,DateTools.dateToString(sentDate, DateTools.Resolution.MILLISECOND), Store.NO, Index.NOT_ANALYZED));
[ERROR] /srv/gump/public/workspace/james-mailbox/lucene/src/main/java/org/apache/james/mailbox/lucene/search/LuceneMessageSearchIndex.java:[591,156] cannot find symbol
[ERROR] symbol: variable Index
[ERROR] doc.add(new Field(SENT_DATE_SORT_FIELD_MILLISECOND_RESOLUTION,DateTools.dateToString(sentDate, DateTools.Resolution.MILLISECOND), Store.NO, Index.NOT_ANALYZED));
[ERROR] /srv/gump/public/workspace/james-mailbox/lucene/src/main/java/org/apache/james/mailbox/lucene/search/LuceneMessageSearchIndex.java:[591,24] internal error; cannot instantiate org.apache.lucene.document.Field.<init> at org.apache.lucene.document.Field to ()
[ERROR] /srv/gump/public/workspace/james-mailbox/lucene/src/main/java/org/apache/james/mailbox/lucene/search/LuceneMessageSearchIndex.java:[593,83] cannot find symbol
[ERROR] symbol: variable Store
[ERROR] doc.add(new Field(FIRST_FROM_MAILBOX_NAME_FIELD, firstFromMailbox, Store.YES, Index.NOT_ANALYZED));
[ERROR] /srv/gump/public/workspace/james-mailbox/lucene/src/main/java/org/apache/james/mailbox/lucene/search/LuceneMessageSearchIndex.java:[593,94] cannot find symbol
[ERROR] symbol: variable Index
[ERROR] doc.add(new Field(FIRST_FROM_MAILBOX_NAME_FIELD, firstFromMailbox, Store.YES, Index.NOT_ANALYZED));
[ERROR] /srv/gump/public/workspace/james-mailbox/lucene/src/main/java/org/apache/james/mailbox/lucene/search/LuceneMessageSearchIndex.java:[593,24] internal error; cannot instantiate org.apache.lucene.document.Field.<init> at org.apache.lucene.document.Field to ()
[ERROR] -> [Help 1]
[ERROR] 
[ERROR] To see the full stack trace of the errors, re-run Maven with the -e switch.
[ERROR] Re-run Maven using the -X switch to enable full debug logging.
[ERROR] 
[ERROR] For more information about the errors and possible solutions, please read the following articles:
[ERROR] [Help 1] http://cwiki.apache.org/confluence/display/MAVEN/MojoFailureException
[ERROR] 
[ERROR] After correcting the problems, you can resume the build with the command
[ERROR]   mvn <goals> -rf :apache-james-mailbox-lucene
---------------------------------------------

To subscribe to this information via syndicated feeds:
- RSS: http://vmgump.apache.org/gump/public/james-mailbox/james-mailbox/rss.xml
- Atom: http://vmgump.apache.org/gump/public/james-mailbox/james-mailbox/atom.xml

============================== Gump Tracking Only ===
Produced by Apache Gump(TM) version 2.3.
Gump Run 11000031122011, vmgump.apache.org:vmgump:11000031122011
Gump E-mail Identifier (unique within run) #56.

*********************************************************** G U M P
[GUMP@vmgump]: Project apacheds-server-tools (in module apacheds) failed
To whom it may engage...
        
This is an automated request, but not an unsolicited one. For 
more information please visit http://gump.apache.org/nagged.html, 
and/or contact the folk at general@gump.apache.org.

Project apacheds-server-tools has an issue affecting its community integration.
This issue affects 1 projects,
 and has been outstanding for 29 runs.
The current state of this project is 'Failed', with reason 'Build Failed'.
For reference only, the following projects are affected by this:
    - apacheds-server-tools :  Apache Directory Server


Full details are available at:
    http://vmgump.apache.org/gump/public/apacheds/apacheds-server-tools/index.html

That said, some information snippets are provided here.

The following annotations (debug/informational/warning/error messages) were provided:
 -DEBUG- Sole jar output [apacheds-server-tools-*[0-9T].jar] identifier set to project name
 -DEBUG- (Apache Gump generated) Apache Maven Settings in: /srv/gump/public/workspace/apacheds/server-tools/gump_mvn_settings.xml
 -INFO- Failed with reason build failed
 -DEBUG- Maven POM in: /srv/gump/public/workspace/apacheds/server-tools/pom.xml
 -INFO- Failed to extract fallback artifacts from Gump Repository



The following work was performed:
http://vmgump.apache.org/gump/public/apacheds/apacheds-server-tools/gump_work/build_apacheds_apacheds-server-tools.html
Work Name: build_apacheds_apacheds-server-tools (Type: Build)
Work ended in a state of : Failed
Elapsed: 1 sec
Command Line: /opt/maven3/bin/mvn --batch-mode --settings /srv/gump/public/workspace/apacheds/server-tools/gump_mvn_settings.xml install 
[Working Directory: /srv/gump/public/workspace/apacheds/server-tools]
M2_HOME: /opt/maven3
---------------------------------------------
[INFO] Scanning for projects...
[ERROR] The build could not read 1 project -> [Help 1]
[ERROR]   
[ERROR]   The project org.apache.directory.server:apacheds-server-tools:2.0.0-M3-SNAPSHOT (/srv/gump/public/workspace/apacheds/server-tools/pom.xml) has 1 error
[ERROR]     Non-resolvable parent POM: Could not find artifact org.apache.directory.server:apacheds-parent:pom:2.0.0-M3-SNAPSHOT and 'parent.relativePath' points at wrong local POM @ line 22, column 11 -> [Help 2]
[ERROR] 
[ERROR] To see the full stack trace of the errors, re-run Maven with the -e switch.
[ERROR] Re-run Maven using the -X switch to enable full debug logging.
[ERROR] 
[ERROR] For more information about the errors and possible solutions, please read the following articles:
[ERROR] [Help 1] http://cwiki.apache.org/confluence/display/MAVEN/ProjectBuildingException
[ERROR] [Help 2] http://cwiki.apache.org/confluence/display/MAVEN/UnresolvableModelException
---------------------------------------------

To subscribe to this information via syndicated feeds:
- RSS: http://vmgump.apache.org/gump/public/apacheds/apacheds-server-tools/rss.xml
- Atom: http://vmgump.apache.org/gump/public/apacheds/apacheds-server-tools/atom.xml

============================== Gump Tracking Only ===
Produced by Apache Gump(TM) version 2.3.
Gump Run 11000031122011, vmgump.apache.org:vmgump:11000031122011
Gump E-mail Identifier (unique within run) #57.

*********************************************************** G U M P
[GUMP@vmgump]: Project syncrepl (in module apacheds) failed
To whom it may engage...
        
This is an automated request, but not an unsolicited one. For 
more information please visit http://gump.apache.org/nagged.html, 
and/or contact the folk at general@gump.apache.org.

Project syncrepl has an issue affecting its community integration.
This issue affects 1 projects,
 and has been outstanding for 29 runs.
The current state of this project is 'Failed', with reason 'Build Failed'.
For reference only, the following projects are affected by this:
    - syncrepl :  Apache Directory Server


Full details are available at:
    http://vmgump.apache.org/gump/public/apacheds/syncrepl/index.html

That said, some information snippets are provided here.

The following annotations (debug/informational/warning/error messages) were provided:
 -DEBUG- Sole jar output [syncrepl-*[0-9T].jar] identifier set to project name
 -DEBUG- (Apache Gump generated) Apache Maven Settings in: /srv/gump/public/workspace/apacheds/syncrepl/gump_mvn_settings.xml
 -INFO- Failed with reason build failed
 -DEBUG- Maven POM in: /srv/gump/public/workspace/apacheds/syncrepl/pom.xml
 -INFO- Failed to extract fallback artifacts from Gump Repository



The following work was performed:
http://vmgump.apache.org/gump/public/apacheds/syncrepl/gump_work/build_apacheds_syncrepl.html
Work Name: build_apacheds_syncrepl (Type: Build)
Work ended in a state of : Failed
Elapsed: 1 sec
Command Line: /opt/maven3/bin/mvn --batch-mode --settings /srv/gump/public/workspace/apacheds/syncrepl/gump_mvn_settings.xml install 
[Working Directory: /srv/gump/public/workspace/apacheds/syncrepl]
M2_HOME: /opt/maven3
---------------------------------------------
[INFO] Scanning for projects...
[ERROR] The build could not read 1 project -> [Help 1]
[ERROR]   
[ERROR]   The project org.apache.directory.server:syncrepl:2.0.0-M3-SNAPSHOT (/srv/gump/public/workspace/apacheds/syncrepl/pom.xml) has 1 error
[ERROR]     Non-resolvable parent POM: Could not find artifact org.apache.directory.server:apacheds-parent:pom:2.0.0-M3-SNAPSHOT and 'parent.relativePath' points at wrong local POM @ line 24, column 11 -> [Help 2]
[ERROR] 
[ERROR] To see the full stack trace of the errors, re-run Maven with the -e switch.
[ERROR] Re-run Maven using the -X switch to enable full debug logging.
[ERROR] 
[ERROR] For more information about the errors and possible solutions, please read the following articles:
[ERROR] [Help 1] http://cwiki.apache.org/confluence/display/MAVEN/ProjectBuildingException
[ERROR] [Help 2] http://cwiki.apache.org/confluence/display/MAVEN/UnresolvableModelException
---------------------------------------------

To subscribe to this information via syndicated feeds:
- RSS: http://vmgump.apache.org/gump/public/apacheds/syncrepl/rss.xml
- Atom: http://vmgump.apache.org/gump/public/apacheds/syncrepl/atom.xml

============================== Gump Tracking Only ===
Produced by Apache Gump(TM) version 2.3.
Gump Run 11000031122011, vmgump.apache.org:vmgump:11000031122011
Gump E-mail Identifier (unique within run) #58.

*********************************************************** G U M P
[GUMP@vmgump]: Project apacheds-ldap-client-test (in module apacheds) failed
To whom it may engage...
        
This is an automated request, but not an unsolicited one. For 
more information please visit http://gump.apache.org/nagged.html, 
and/or contact the folk at general@gump.apache.org.

Project apacheds-ldap-client-test has an issue affecting its community integration.
This issue affects 1 projects,
 and has been outstanding for 29 runs.
The current state of this project is 'Failed', with reason 'Missing Build Outputs'.
For reference only, the following projects are affected by this:
    - apacheds-ldap-client-test :  Apache Directory Server


Full details are available at:
    http://vmgump.apache.org/gump/public/apacheds/apacheds-ldap-client-test/index.html

That said, some information snippets are provided here.

The following annotations (debug/informational/warning/error messages) were provided:
 -DEBUG- Sole jar output [apacheds-ldap-client-test-*[0-9T].jar] identifier set to project name
 -DEBUG- (Apache Gump generated) Apache Maven Settings in: /srv/gump/public/workspace/apacheds/ldap-client-test/gump_mvn_settings.xml
 -DEBUG- Maven POM in: /srv/gump/public/workspace/apacheds/ldap-client-test/pom.xml
 -INFO- Failed with reason missing build outputs
 -ERROR- Missing Output: /srv/gump/public/workspace/apacheds/ldap-client-test/target/apacheds-ldap-client-test-*[0-9T].jar
 -ERROR- See Directory Listing Work for Missing Outputs
 -INFO- Failed to extract fallback artifacts from Gump Repository



The following work was performed:
http://vmgump.apache.org/gump/public/apacheds/apacheds-ldap-client-test/gump_work/build_apacheds_apacheds-ldap-client-test.html
Work Name: build_apacheds_apacheds-ldap-client-test (Type: Build)
Work ended in a state of : Success
Elapsed: 49 secs
Command Line: /opt/maven3/bin/mvn --batch-mode --settings /srv/gump/public/workspace/apacheds/ldap-client-test/gump_mvn_settings.xml install 
[Working Directory: /srv/gump/public/workspace/apacheds/ldap-client-test]
M2_HOME: /opt/maven3
---------------------------------------------
[INFO] --- maven-resources-plugin:2.5:resources (default-resources) @ ldap-client-test ---
[debug] execute contextualize
[INFO] Using 'UTF-8' encoding to copy filtered resources.
[INFO] Copying 0 resource
[INFO] Copying 3 resources
[INFO] 
[INFO] --- maven-compiler-plugin:2.3.2:compile (default-compile) @ ldap-client-test ---
[INFO] Compiling 1 source file to /srv/gump/public/workspace/apacheds/ldap-client-test/target/classes
[INFO] 
[INFO] --- maven-resources-plugin:2.5:testResources (default-testResources) @ ldap-client-test ---
[debug] execute contextualize
[INFO] Using 'UTF-8' encoding to copy filtered resources.
[INFO] Copying 1 resource
[INFO] Copying 3 resources
[INFO] 
[INFO] --- maven-compiler-plugin:2.3.2:testCompile (default-testCompile) @ ldap-client-test ---
[INFO] Compiling 17 source files to /srv/gump/public/workspace/apacheds/ldap-client-test/target/test-classes
[INFO] 
[INFO] --- maven-surefire-plugin:2.10:test (default-test) @ ldap-client-test ---
[INFO] Surefire report directory: /srv/gump/public/workspace/apacheds/ldap-client-test/target/surefire-reports

-------------------------------------------------------
 T E S T S
-------------------------------------------------------
Running org.apache.directory.shared.client.api.LdapApiISuite
Tests run: 85, Failures: 0, Errors: 0, Skipped: 2, Time elapsed: 28.465 sec

Results :

Tests run: 85, Failures: 0, Errors: 0, Skipped: 2

[INFO] 
[INFO] --- maven-jar-plugin:2.3.2:jar (default-jar) @ ldap-client-test ---
[INFO] Building jar: /srv/gump/public/workspace/apacheds/ldap-client-test/target/ldap-client-test-2.0.0-M4-SNAPSHOT.jar
[INFO] 
[INFO] --- maven-site-plugin:3.0:attach-descriptor (attach-descriptor) @ ldap-client-test ---
[INFO] 
[INFO] --- tools-maven-plugin:1.4:verify-legal-files (verify-legal-files) @ ldap-client-test ---
[INFO] Checking legal files in: ldap-client-test-2.0.0-M4-SNAPSHOT.jar
[INFO] 
[INFO] --- maven-install-plugin:2.3.1:install (default-install) @ ldap-client-test ---
[INFO] Installing /srv/gump/public/workspace/apacheds/ldap-client-test/target/ldap-client-test-2.0.0-M4-SNAPSHOT.jar to /srv/gump/public/workspace/mvnlocalrepo/shared/org/apache/directory/server/ldap-client-test/2.0.0-M4-SNAPSHOT/ldap-client-test-2.0.0-M4-SNAPSHOT.jar
[INFO] Installing /srv/gump/public/workspace/apacheds/ldap-client-test/pom.xml to /srv/gump/public/workspace/mvnlocalrepo/shared/org/apache/directory/server/ldap-client-test/2.0.0-M4-SNAPSHOT/ldap-client-test-2.0.0-M4-SNAPSHOT.pom
[INFO] ------------------------------------------------------------------------
[INFO] BUILD SUCCESS
[INFO] ------------------------------------------------------------------------
[INFO] Total time: 47.432s
[INFO] Finished at: Sat Dec 31 08:12:53 UTC 2011
[INFO] Final Memory: 23M/57M
[INFO] ------------------------------------------------------------------------
---------------------------------------------

To subscribe to this information via syndicated feeds:
- RSS: http://vmgump.apache.org/gump/public/apacheds/apacheds-ldap-client-test/rss.xml
- Atom: http://vmgump.apache.org/gump/public/apacheds/apacheds-ldap-client-test/atom.xml

============================== Gump Tracking Only ===
Produced by Apache Gump(TM) version 2.3.
Gump Run 11000031122011, vmgump.apache.org:vmgump:11000031122011
Gump E-mail Identifier (unique within run) #59.

*********************************************************** G U M P
[GUMP@vmgump]: Project james-server (in module james-server) failed
To whom it may engage...
        
This is an automated request, but not an unsolicited one. For 
more information please visit http://gump.apache.org/nagged.html, 
and/or contact the folk at general@gump.apache.org.

Project james-server has an issue affecting its community integration.
This issue affects 2 projects,
 and has been outstanding for 118 runs.
The current state of this project is 'Failed', with reason 'Build Failed'.
For reference only, the following projects are affected by this:
    - james-server :  James Server
    - james-server-test :  James Server


Full details are available at:
    http://vmgump.apache.org/gump/public/james-server/james-server/index.html

That said, some information snippets are provided here.

The following annotations (debug/informational/warning/error messages) were provided:
 -INFO- Optional dependency james-jsieve failed with reason build failed
 -INFO- Optional dependency openjpa prerequisite failed with reason build failed
 -INFO- Optional dependency activemq-pool prerequisite failed with reason build failed
 -INFO- Optional dependency activemq-core failed with reason build failed
 -DEBUG- (Apache Gump generated) Apache Maven Settings in: /srv/gump/public/workspace/james-server/gump_mvn_settings.xml
 -INFO- Failed with reason build failed
 -DEBUG- Maven POM in: /srv/gump/public/workspace/james-server/pom.xml
 -INFO- Failed to extract fallback artifacts from Gump Repository



The following work was performed:
http://vmgump.apache.org/gump/public/james-server/james-server/gump_work/build_james-server_james-server.html
Work Name: build_james-server_james-server (Type: Build)
Work ended in a state of : Failed
Elapsed: 57 secs
Command Line: /opt/maven3/bin/mvn --batch-mode -Dmaven.test.skip=true --settings /srv/gump/public/workspace/james-server/gump_mvn_settings.xml install 
[Working Directory: /srv/gump/public/workspace/james-server]
MAVEN_OPTS: -Xmx768m 
M2_HOME: /opt/maven3
---------------------------------------------
[INFO] Apache James Server Container Spring .............. FAILURE [7.593s]
[INFO] Apache James Server DNS Server API ................ SKIPPED
[INFO] Apache James Server DNSService Implementation ..... SKIPPED
[INFO] Apache James Server DNSService Library ............ SKIPPED
[INFO] Apache James Server Queue API ..................... SKIPPED
[INFO] Apache James Server Common Utilities .............. SKIPPED
[INFO] Apache James Server FetchMail ..................... SKIPPED
[INFO] Apache James Server Protocols Library ............. SKIPPED
[INFO] Apache James Server IMAP .......................... SKIPPED
[INFO] Apache James Server Data Library .................. SKIPPED
[INFO] Apache James Server SMTP .......................... SKIPPED
[INFO] Apache James Server LMTP .......................... SKIPPED
[INFO] Apache James Server HBase Data Persistence ........ SKIPPED
[INFO] Apache James Server JPA Data Persistence .......... SKIPPED
[INFO] Apache James Server JCR Data Persistence .......... SKIPPED
[INFO] Apache James Server JDBC Data Persistence ......... SKIPPED
[INFO] Apache James Server File Data Persistence ......... SKIPPED
[INFO] Apache James Server Mailbox Adapter ............... SKIPPED
[INFO] Apache James Server Mailetcontainer Camel implementation  SKIPPED
[INFO] Apache James Server Mailets ....................... SKIPPED
[INFO] Apache James Server POP3 .......................... SKIPPED
[INFO] Apache James Server File Mail Queue ............... SKIPPED
[INFO] Apache James Server JMS Mail Queue ................ SKIPPED
[INFO] Apache James Server ActiveMQ Queue ................ SKIPPED
[INFO] Apache James Server LDAP Data Implementation ...... SKIPPED
[INFO] Apache James Server Client ........................ SKIPPED
[INFO] ------------------------------------------------------------------------
[INFO] BUILD FAILURE
[INFO] ------------------------------------------------------------------------
[INFO] Total time: 55.516s
[INFO] Finished at: Sat Dec 31 08:25:23 UTC 2011
[INFO] Final Memory: 49M/118M
[INFO] ------------------------------------------------------------------------
[ERROR] Failed to execute goal org.apache.maven.plugins:maven-compiler-plugin:2.3.2:compile (default-compile) on project james-server-container-spring: Compilation failure: Compilation failure:
[ERROR] /srv/gump/public/workspace/james-server/container-spring/src/main/java/org/apache/james/container/spring/bean/factory/mailrepositorystore/MailRepositoryStoreBeanFactory.java:[119,48] incompatible types
[ERROR] found   : java.util.List<java.lang.Object>
[ERROR] required: java.util.List<java.lang.String>
[ERROR] /srv/gump/public/workspace/james-server/container-spring/src/main/java/org/apache/james/container/spring/bean/factory/protocols/ProtocolHandlerLoaderBeanFactory.java:[29,7] org.apache.james.container.spring.bean.factory.protocols.ProtocolHandlerLoaderBeanFactory is not abstract and does not override abstract method load(java.lang.String,org.apache.james.protocols.api.handler.ProtocolHandlerConfiguration) in org.apache.james.protocols.api.handler.ProtocolHandlerLoader
[ERROR] /srv/gump/public/workspace/james-server/container-spring/src/main/java/org/apache/james/container/spring/bean/factory/protocols/ProtocolHandlerLoaderBeanFactory.java:[40,57] init(org.apache.james.protocols.api.handler.ProtocolHandlerConfiguration) in org.apache.james.protocols.api.handler.LifecycleAwareProtocolHandler cannot be applied to (org.apache.commons.configuration.Configuration)
[ERROR] /srv/gump/public/workspace/james-server/container-spring/src/main/java/org/apache/james/container/spring/bean/factory/protocols/ProtocolHandlerLoaderBeanFactory.java:[32,4] method does not override or implement a method from a supertype
[ERROR] -> [Help 1]
[ERROR] 
[ERROR] To see the full stack trace of the errors, re-run Maven with the -e switch.
[ERROR] Re-run Maven using the -X switch to enable full debug logging.
[ERROR] 
[ERROR] For more information about the errors and possible solutions, please read the following articles:
[ERROR] [Help 1] http://cwiki.apache.org/confluence/display/MAVEN/MojoFailureException
[ERROR] 
[ERROR] After correcting the problems, you can resume the build with the command
[ERROR]   mvn <goals> -rf :james-server-container-spring
---------------------------------------------

To subscribe to this information via syndicated feeds:
- RSS: http://vmgump.apache.org/gump/public/james-server/james-server/rss.xml
- Atom: http://vmgump.apache.org/gump/public/james-server/james-server/atom.xml

============================== Gump Tracking Only ===
Produced by Apache Gump(TM) version 2.3.
Gump Run 11000031122011, vmgump.apache.org:vmgump:11000031122011
Gump E-mail Identifier (unique within run) #61.

*********************************************************** G U M P
[GUMP@vmgump]: Project camel-jms-test (in module camel) failed
To whom it may engage...
        
This is an automated request, but not an unsolicited one. For 
more information please visit http://gump.apache.org/nagged.html, 
and/or contact the folk at general@gump.apache.org.

Project camel-jms-test has an issue affecting its community integration.
This issue affects 1 projects,
 and has been outstanding for 3 runs.
The current state of this project is 'Failed', with reason 'Build Timed Out'.
For reference only, the following projects are affected by this:
    - camel-jms-test :  Integration framework based on known Enterprise Integration
...


Full details are available at:
    http://vmgump.apache.org/gump/public/camel/camel-jms-test/index.html

That said, some information snippets are provided here.

The following annotations (debug/informational/warning/error messages) were provided:
 -WARNING- Overriding Maven settings: [/srv/gump/public/workspace/camel/components/camel-jms/gump_mvn_settings.xml]
 -DEBUG- (Apache Gump generated) Apache Maven Settings in: /srv/gump/public/workspace/camel/components/camel-jms/gump_mvn_settings.xml
 -INFO- Failed with reason build timed out
 -DEBUG- Maven POM in: /srv/gump/public/workspace/camel/components/camel-jms/pom.xml
 -INFO- Project Reports in: /srv/gump/public/workspace/camel/components/camel-jms/target/surefire-report
 -WARNING- No directory [/srv/gump/public/workspace/camel/components/camel-jms/target/surefire-report]



The following work was performed:
http://vmgump.apache.org/gump/public/camel/camel-jms-test/gump_work/build_camel_camel-jms-test.html
Work Name: build_camel_camel-jms-test (Type: Build)
Work ended in a state of : Failed
Elapsed: 60 mins
Command Line: /opt/maven2/bin/mvn --batch-mode --settings /srv/gump/public/workspace/camel/components/camel-jms/gump_mvn_settings.xml test 
[Working Directory: /srv/gump/public/workspace/camel/components/camel-jms]
M2_HOME: /opt/maven2
---------------------------------------------
Tests run: 2, Failures: 0, Errors: 0, Skipped: 0, Time elapsed: 5.905 sec
Running org.apache.camel.component.jms.JmsSimpleRequestReplyFixedReplyQueueTest
Tests run: 2, Failures: 0, Errors: 0, Skipped: 0, Time elapsed: 5.763 sec
Running org.apache.camel.component.jms.JmsSimpleRequestReplyTest
Tests run: 2, Failures: 0, Errors: 0, Skipped: 0, Time elapsed: 5.771 sec
Running org.apache.camel.component.jms.JmsSpringLoadBalanceFailoverTest
Tests run: 1, Failures: 0, Errors: 0, Skipped: 0, Time elapsed: 7.14 sec
Running org.apache.camel.component.jms.JmsSuspendResumeTest
Tests run: 1, Failures: 0, Errors: 0, Skipped: 0, Time elapsed: 5.213 sec
Running org.apache.camel.component.jms.JmsTestConnectionOnStartupTest
Tests run: 2, Failures: 0, Errors: 0, Skipped: 0, Time elapsed: 1.444 sec
Running org.apache.camel.component.jms.JmsThrottlingInflightRoutePolicyTest
Tests run: 1, Failures: 0, Errors: 0, Skipped: 0, Time elapsed: 5.533 sec
Running org.apache.camel.component.jms.JmsTransactedRouteTest
Tests run: 1, Failures: 0, Errors: 0, Skipped: 0, Time elapsed: 2.668 sec
Running org.apache.camel.component.jms.JmsTransferExceptionTest
Tests run: 2, Failures: 0, Errors: 0, Skipped: 0, Time elapsed: 4.766 sec
Running org.apache.camel.component.jms.JmsTransferExchangeFromSplitterTest
Tests run: 1, Failures: 0, Errors: 0, Skipped: 0, Time elapsed: 2.761 sec
Running org.apache.camel.component.jms.JmsTransferExchangeTest
Tests run: 3, Failures: 0, Errors: 0, Skipped: 0, Time elapsed: 4.902 sec
Running org.apache.camel.component.jms.JmsUseOriginalBodyTest
Tests run: 2, Failures: 0, Errors: 0, Skipped: 0, Time elapsed: 3.881 sec
Running org.apache.camel.component.jms.JmsXMLRouteTest
Tests run: 9, Failures: 0, Errors: 0, Skipped: 0, Time elapsed: 12.738 sec
Running org.apache.camel.component.jms.JmsXPathHeaderTest
Tests run: 3, Failures: 0, Errors: 0, Skipped: 0, Time elapsed: 5.14 sec
Running org.apache.camel.component.jms.ManagedJmsEndpointTest
Tests run: 1, Failures: 0, Errors: 0, Skipped: 0, Time elapsed: 3.336 sec
Running org.apache.camel.component.jms.MapJmsMessageTest
Tests run: 2, Failures: 0, Errors: 0, Skipped: 0, Time elapsed: 3.728 sec
Running org.apache.camel.component.jms.PassThroughJmsKeyFormatStrategyTest
Tests run: 2, Failures: 0, Errors: 0, Skipped: 0, Time elapsed: 0.121 sec
Running org.apache.camel.component.jms.PayloadByteArrayJmsTest
Tests run: 3, Failures: 0, Errors: 0, Skipped: 0, Time elapsed: 4.8 sec
Running org.apache.camel.component.jms.ProduceMessageConverterTest
Tests run: 1, Failures: 0, Errors: 0, Skipped: 0, Time elapsed: 2.534 sec
Running org.apache.camel.component.jms.ReplyToDestinationSelectorNameTest
Tests run: 1, Failures: 0, Errors: 0, Skipped: 0, Time elapsed: 3.833 sec
Running org.apache.camel.component.jms.SetFaultBodyAfterJmsRequestReplyIssueTest
Tests run: 1, Failures: 0, Errors: 0, Skipped: 0, Time elapsed: 2.687 sec
Running org.apache.camel.component.jms.SpringJmsRoutingSlipInOutTest
Tests run: 1, Failures: 0, Errors: 0, Skipped: 0, Time elapsed: 6.387 sec
Running org.apache.camel.component.jms.SpringJmsSelectorTest
Tests run: 1, Failures: 0, Errors: 0, Skipped: 0, Time elapsed: 5.199 sec
Running org.apache.camel.component.jms.SpringJmsXPathHeaderTest
Tests run: 3, Failures: 0, Errors: 0, Skipped: 0, Time elapsed: 9.9 sec
Running org.apache.camel.component.jms.TwoConsumerOnSameTopicTest
Tests run: 4, Failures: 0, Errors: 0, Skipped: 0, Time elapsed: 13.653 sec
Running org.apache.camel.component.jms.activemq.ActiveMQConsumeWildcardQueuesTest
---------------------------------------------

To subscribe to this information via syndicated feeds:
- RSS: http://vmgump.apache.org/gump/public/camel/camel-jms-test/rss.xml
- Atom: http://vmgump.apache.org/gump/public/camel/camel-jms-test/atom.xml

============================== Gump Tracking Only ===
Produced by Apache Gump(TM) version 2.3.
Gump Run 11000031122011, vmgump.apache.org:vmgump:11000031122011
Gump E-mail Identifier (unique within run) #62.


--
Apache Gump
http://gump.apache.org/ [Instance: vmgump]

---------------------------------------------------------------------
To unsubscribe, e-mail: general-unsubscribe@gump.apache.org
For additional commands, e-mail: general-help@gump.apache.org


Mime
View raw message