gump-general mailing list archives

Site index · List index
Message view « Date » · « Thread »
Top « Date » · « Thread »
From g...@vmgump.apache.org
Subject BATCH: All dressed up, with nowhere to go...
Date Wed, 23 Nov 2011 20:40:07 GMT
Dear Gumpmeisters,
            
The following 1 notifys should have been sent

*********************************************************** G U M P
[GUMP@vmgump]: Project lucene-java-contrib-test (in module lucene-java) failed
*********************************************************** G U M P
[GUMP@vmgump]: Project lucene-java-contrib-test (in module lucene-java) failed
To whom it may engage...
        
This is an automated request, but not an unsolicited one. For 
more information please visit http://gump.apache.org/nagged.html, 
and/or contact the folk at general@gump.apache.org.

Project lucene-java-contrib-test has an issue affecting its community integration.
This issue affects 1 projects.
The current state of this project is 'Failed', with reason 'Build Failed'.
For reference only, the following projects are affected by this:
    - lucene-java-contrib-test :  Java Based Search Engine


Full details are available at:
    http://vmgump.apache.org/gump/public/lucene-java/lucene-java-contrib-test/index.html

That said, some information snippets are provided here.

The following annotations (debug/informational/warning/error messages) were provided:
 -DEBUG- Dependency on javacc exists, no need to add for property javacc.home.
 -INFO- Failed with reason build failed



The following work was performed:
http://vmgump.apache.org/gump/public/lucene-java/lucene-java-contrib-test/gump_work/build_lucene-java_lucene-java-contrib-test.html
Work Name: build_lucene-java_lucene-java-contrib-test (Type: Build)
Work ended in a state of : Failed
Elapsed: 1 min 54 secs
Command Line: /usr/lib/jvm/java-6-openjdk/bin/java -Djava.awt.headless=true -Dbuild.sysclasspath=only
-Xbootclasspath/p:/srv/gump/public/workspace/xml-xalan/build/xalan-unbundled.jar:/srv/gump/public/workspace/xml-xalan/build/serializer.jar:/srv/gump/public/workspace/xml-commons/java/external/build/xml-apis.jar:/srv/gump/public/workspace/xml-xerces2/build/xercesImpl.jar
org.apache.tools.ant.Main -Dgump.merge=/srv/gump/public/gump/work/merge.xml -Dversion=23112011
-Djavacc.home=/srv/gump/packages/javacc-3.1 test 
[Working Directory: /srv/gump/public/workspace/lucene-java/lucene]
CLASSPATH: /usr/lib/jvm/java-6-openjdk/lib/tools.jar:/srv/gump/public/workspace/lucene-java/lucene/build/classes/tools:/srv/gump/public/workspace/lucene-java/lucene/build/classes/test:/srv/gump/public/workspace/lucene-java/lucene/build/contrib/demo/classes/test:/srv/gump/public/workspace/lucene-java/lucene/build/contrib/highlighter/classes/test:/srv/gump/public/workspace/lucene-java/lucene/build/contrib/instantiated/classes/test:/srv/gump/public/workspace/lucene-java/lucene/build/contrib/memory/classes/test:/srv/gump/public/workspace/lucene-java/lucene/build/contrib/misc/classes/test:/srv/gump/public/workspace/lucene-java/lucene/build/contrib/sandbox/classes/test:/srv/gump/public/workspace/lucene-java/lucene/build/contrib/spatial/classes/test:/srv/gump/public/workspace/lucene-java/modules/queries/build/classes/test:/srv/gump/public/workspace/lucene-java/modules/queryparser/build/classes/test:/srv/gump/public/workspace/ant/dist/lib/ant.jar:/srv/gump/public/workspace/ant/dist/l
 ib/ant-launcher.jar:/srv/gump/public/workspace/ant/dist/lib/ant-jmf.jar:/srv/gump/public/workspace/ant/dist/lib/ant-junit.jar:/srv/gump/public/workspace/ant/dist/lib/ant-swing.jar:/srv/gump/public/workspace/ant/dist/lib/ant-apache-resolver.jar:/srv/gump/public/workspace/ant/dist/lib/ant-apache-xalan2.jar:/srv/gump/public/workspace/xml-commons/java/build/resolver.jar:/srv/gump/public/workspace/apache-commons/compress/target/commons-compress-1.4-SNAPSHOT.jar:/srv/gump/public/workspace/commons-digester-2.x/target/commons-digester-2.2-SNAPSHOT.jar:/srv/gump/public/workspace/apache-commons/logging/target/commons-logging-23112011.jar:/srv/gump/public/workspace/apache-commons/logging/target/commons-logging-api-23112011.jar:/srv/gump/packages/caucho-libs/hessian-3.0.8.jar:/srv/gump/public/workspace/icu4j/main/classes/core/out/lib/icu4j-core.jar:/srv/gump/public/workspace/icu4j/main/classes/collate/out/lib/icu4j-collate.jar:/srv/gump/public/workspace/icu4j/main/classes/currdata/out/l
 ib/icu4j-currdata.jar:/srv/gump/public/workspace/icu4j/main/classes/langdata/out/lib/icu4j-langdata.jar:/srv/gump/public/workspace/icu4j/main/classes/regiondata/out/lib/icu4j-regiondata.jar:/srv/gump/public/workspace/icu4j/main/classes/translit/out/lib/icu4j-translit.jar:/srv/gump/public/workspace/icu4j/main/classes/charset/out/lib/icu4j-charset.jar:/srv/gump/public/workspace/icu4j/main/classes/localespi/out/lib/icu4j-localespi.jar:/srv/gump/packages/apache-attic/jakarta-regexp-1.5.jar:/srv/gump/public/workspace/jakarta-servletapi-5/jsr154/dist/lib/servlet-api.jar:/srv/gump/packages/javacc-3.1/bin/lib/javacc.jar:/srv/gump/public/workspace/jline/target/jline-0.9.95-SNAPSHOT.jar:/srv/gump/packages/jtidy/jtidy-r938.jar:/srv/gump/public/workspace/junit/dist/junit-23112011.jar:/srv/gump/public/workspace/junit/dist/junit-dep-23112011.jar:/srv/gump/public/workspace/lucene-java/lucene/build/lucene-core-23112011.jar:/srv/gump/public/workspace/lucene-java/modules/analysis/build/icu/lu
 cene-analyzers-icu-23112011.jar:/srv/gump/public/workspace/lucene-java/modules/analysis/build/smartcn/lucene-analyzers-smartcn-23112011.jar:/srv/gump/public/workspace/lucene-java/modules/analysis/build/common/lucene-analyzers-common-23112011.jar:/srv/gump/public/workspace/lucene-java/modules/analysis/build/stempel/lucene-analyzers-stempel-23112011.jar:/srv/gump/public/workspace/lucene-java/modules/analysis/build/phonetic/lucene-analyzers-phonetic-23112011.jar:/srv/gump/public/workspace/lucene-java/modules/analysis/build/morfologik/lucene-analyzers-morfologik-23112011.jar:/srv/gump/public/workspace/lucene-java/modules/queries/build/lucene-queries-23112011.jar:/srv/gump/public/workspace/lucene-java/lucene/build/contrib/sandbox/lucene-sandbox-23112011.jar:/srv/gump/public/workspace/lucene-java/modules/queryparser/build/lucene-queryparser-23112011.jar:/srv/gump/public/workspace/lucene-java/lucene/build/contrib/demo/lucene-demo-23112011.jar:/srv/gump/public/workspace/lucene-java/
 lucene/build/contrib/memory/lucene-memory-23112011.jar:/srv/gump/public/workspace/lucene-java/lucene/build/contrib/highlighter/lucene-highlighter-23112011.jar:/srv/gump/public/workspace/lucene-java/lucene/build/contrib/misc/lucene-misc-23112011.jar:/srv/gump/public/workspace/lucene-java/lucene/build/contrib/spatial/lucene-spatial-23112011.jar:/srv/gump/public/workspace/lucene-java/lucene/build/lucene-test-framework-23112011.jar:/srv/gump/packages/nekohtml-0.9.5/nekohtml.jar:/srv/gump/public/workspace/xml-commons/java/external/build/xml-apis-ext.jar
---------------------------------------------
    [junit] 
    [junit] Testcase: testGetRandomAcceptedString(org.apache.lucene.util.automaton.TestBasicOperations):
FAILED
    [junit] ensure your setUp() calls super.setUp()!!!
    [junit] junit.framework.AssertionFailedError: ensure your setUp() calls super.setUp()!!!
    [junit] 	at org.apache.lucene.util.LuceneTestCase$2.starting(LuceneTestCase.java:501)
    [junit] 	at org.apache.lucene.util.LuceneTestCase$3$1.evaluate(LuceneTestCase.java:521)
    [junit] 	at org.apache.lucene.util.LuceneTestCaseRunner.runChild(LuceneTestCaseRunner.java:149)
    [junit] 	at org.apache.lucene.util.LuceneTestCaseRunner.runChild(LuceneTestCaseRunner.java:51)
    [junit] 
    [junit] 
    [junit] Testcase: org.apache.lucene.util.automaton.TestBasicOperations:	Caused an ERROR
    [junit] java.lang.AssertionError: ensure your setUp() calls super.setUp() and your tearDown()
calls super.tearDown()!!!
    [junit] java.lang.RuntimeException: java.lang.AssertionError: ensure your setUp() calls
super.setUp() and your tearDown() calls super.tearDown()!!!
    [junit] 	at org.apache.lucene.util.LuceneTestCase.afterClassLuceneTestCaseJ4(LuceneTestCase.java:398)
    [junit] Caused by: java.lang.AssertionError: ensure your setUp() calls super.setUp() and
your tearDown() calls super.tearDown()!!!
    [junit] 	at org.apache.lucene.util.LuceneTestCase.afterClassLuceneTestCaseJ4(LuceneTestCase.java:340)
    [junit] 
    [junit] 
    [junit] Tests run: 7, Failures: 7, Errors: 1, Time elapsed: 0.035 sec
    [junit] 
    [junit] ------------- Standard Error -----------------
    [junit] NOTE: reproduce with (hopefully): ant test -Dtestcase=TestBasicOperations -Dtests.seed=-1a84c6102212425d:0:-4903dc6cb3c913ff
-Dargs="-Dfile.encoding=UTF-8"
    [junit] NOTE: test params are: codec=Lucene40: {}, sim=RandomSimilarityProvider(queryNorm=true,coord=true):
{}, locale=ru_RU, timezone=Asia/Kolkata
    [junit] NOTE: all tests run in this JVM:
    [junit] [TestAssertions, TestCachingTokenFilter, Test2BPostings, TestCodecs, TestDocumentWriter,
TestIndexCommit, TestIndexReaderOnDiskFull, TestIndexableField, TestMultiLevelSkipList, TestNoMergePolicy,
TestOmitTf, TestReaderClosed, TestSegmentTermEnum, TestTransactions, TestSurrogates, TestDocValues,
TestAutomatonQuery, TestCachingCollector, TestComplexExplanations, TestCustomSearcherSort,
TestFieldCache, TestFieldCacheRewriteMethod, TestQueryWrapperFilter, TestRegexpRandom2, TestScorerPerf,
TestTopDocsCollector, TestFieldMaskingSpanQuery, TestByteArrayDataInput, TestLock, TestArrayUtil,
TestDoubleBarrelLRUCache, TestFieldCacheSanityChecker, TestUnicodeUtil, TestBasicOperations]
    [junit] NOTE: Linux 2.6.32-35-server amd64/Sun Microsystems Inc. 1.6.0_20 (64-bit)/cpus=1,threads=1,free=24642592,total=29384704
    [junit] ------------- ---------------- ---------------
    [junit] TEST org.apache.lucene.util.automaton.TestBasicOperations FAILED
    [junit] Tests FAILED

BUILD FAILED
/srv/gump/public/workspace/lucene-java/lucene/common-build.xml:645: 
The following error occurred while executing this line:
/srv/gump/public/workspace/lucene-java/lucene/common-build.xml:629: Tests failed!
The following error occurred while executing this line:
/srv/gump/public/workspace/lucene-java/lucene/common-build.xml:629: Tests failed!
The following error occurred while executing this line:
/srv/gump/public/workspace/lucene-java/lucene/common-build.xml:629: Tests failed!
The following error occurred while executing this line:
/srv/gump/public/workspace/lucene-java/lucene/common-build.xml:629: Tests failed!
The following error occurred while executing this line:
/srv/gump/public/workspace/lucene-java/lucene/common-build.xml:629: Tests failed!
The following error occurred while executing this line:
/srv/gump/public/workspace/lucene-java/lucene/common-build.xml:629: Tests failed!
The following error occurred while executing this line:
/srv/gump/public/workspace/lucene-java/lucene/common-build.xml:629: Tests failed!
The following error occurred while executing this line:
/srv/gump/public/workspace/lucene-java/lucene/common-build.xml:629: Tests failed!

Total time: 1 minute 54 seconds
---------------------------------------------

To subscribe to this information via syndicated feeds:
- RSS: http://vmgump.apache.org/gump/public/lucene-java/lucene-java-contrib-test/rss.xml
- Atom: http://vmgump.apache.org/gump/public/lucene-java/lucene-java-contrib-test/atom.xml

============================== Gump Tracking Only ===
Produced by Apache Gump(TM) version 2.3.
Gump Run 05001223112011, vmgump.apache.org:vmgump:05001223112011
Gump E-mail Identifier (unique within run) #1.


--
Apache Gump
http://gump.apache.org/ [Instance: vmgump]

---------------------------------------------------------------------
To unsubscribe, e-mail: general-unsubscribe@gump.apache.org
For additional commands, e-mail: general-help@gump.apache.org


Mime
View raw message