gump-general mailing list archives

Site index · List index
Message view « Date » · « Thread »
Top « Date » · « Thread »
From g...@vmgump.apache.org
Subject BATCH: All dressed up, with nowhere to go...
Date Sun, 25 Sep 2011 02:17:00 GMT
Dear Gumpmeisters,
            
The following 1 notifys should have been sent

*********************************************************** G U M P
[GUMP@vmgump]: Project lucene-java-contrib-test (in module lucene-java) failed
*********************************************************** G U M P
[GUMP@vmgump]: Project lucene-java-contrib-test (in module lucene-java) failed
To whom it may engage...
        
This is an automated request, but not an unsolicited one. For 
more information please visit http://gump.apache.org/nagged.html, 
and/or contact the folk at general@gump.apache.org.

Project lucene-java-contrib-test has an issue affecting its community integration.
This issue affects 1 projects.
The current state of this project is 'Failed', with reason 'Build Failed'.
For reference only, the following projects are affected by this:
    - lucene-java-contrib-test :  Java Based Search Engine


Full details are available at:
    http://vmgump.apache.org/gump/public/lucene-java/lucene-java-contrib-test/index.html

That said, some information snippets are provided here.

The following annotations (debug/informational/warning/error messages) were provided:
 -DEBUG- Dependency on javacc exists, no need to add for property javacc.home.
 -INFO- Failed with reason build failed



The following work was performed:
http://vmgump.apache.org/gump/public/lucene-java/lucene-java-contrib-test/gump_work/build_lucene-java_lucene-java-contrib-test.html
Work Name: build_lucene-java_lucene-java-contrib-test (Type: Build)
Work ended in a state of : Failed
Elapsed: 1 min 55 secs
Command Line: /usr/lib/jvm/java-6-openjdk/bin/java -Djava.awt.headless=true -Dbuild.sysclasspath=only
-Xbootclasspath/p:/srv/gump/public/workspace/xml-xalan/build/xalan-unbundled.jar:/srv/gump/public/workspace/xml-xalan/build/serializer.jar:/srv/gump/public/workspace/xml-commons/java/external/build/xml-apis.jar:/srv/gump/public/workspace/xml-xerces2/build/xercesImpl.jar
org.apache.tools.ant.Main -Dgump.merge=/srv/gump/public/gump/work/merge.xml -Dversion=24092011
-Djavacc.home=/srv/gump/packages/javacc-3.1 test 
[Working Directory: /srv/gump/public/workspace/lucene-java/lucene]
CLASSPATH: /usr/lib/jvm/java-6-openjdk/lib/tools.jar:/srv/gump/public/workspace/lucene-java/lucene/build/classes/tools:/srv/gump/public/workspace/lucene-java/lucene/build/classes/test:/srv/gump/public/workspace/lucene-java/lucene/build/contrib/demo/classes/test:/srv/gump/public/workspace/lucene-java/lucene/build/contrib/highlighter/classes/test:/srv/gump/public/workspace/lucene-java/lucene/build/contrib/instantiated/classes/test:/srv/gump/public/workspace/lucene-java/lucene/build/contrib/memory/classes/test:/srv/gump/public/workspace/lucene-java/lucene/build/contrib/misc/classes/test:/srv/gump/public/workspace/lucene-java/lucene/build/contrib/sandbox/classes/test:/srv/gump/public/workspace/lucene-java/lucene/build/contrib/spatial/classes/test:/srv/gump/public/workspace/lucene-java/modules/queries/build/classes/test:/srv/gump/public/workspace/lucene-java/modules/queryparser/build/classes/test:/srv/gump/public/workspace/ant/dist/lib/ant.jar:/srv/gump/public/workspace/ant/dist/l
 ib/ant-launcher.jar:/srv/gump/public/workspace/ant/dist/lib/ant-jmf.jar:/srv/gump/public/workspace/ant/dist/lib/ant-junit.jar:/srv/gump/public/workspace/ant/dist/lib/ant-swing.jar:/srv/gump/public/workspace/ant/dist/lib/ant-apache-resolver.jar:/srv/gump/public/workspace/ant/dist/lib/ant-apache-xalan2.jar:/srv/gump/public/workspace/xml-commons/java/build/resolver.jar:/srv/gump/public/workspace/apache-commons/compress/target/commons-compress-1.3-SNAPSHOT.jar:/srv/gump/public/workspace/commons-digester-2.x/target/commons-digester-2.2-SNAPSHOT.jar:/srv/gump/public/workspace/apache-commons/logging/target/commons-logging-24092011.jar:/srv/gump/public/workspace/apache-commons/logging/target/commons-logging-api-24092011.jar:/srv/gump/packages/caucho-libs/hessian-3.0.8.jar:/srv/gump/public/workspace/icu4j/main/classes/core/out/lib/icu4j-core.jar:/srv/gump/public/workspace/icu4j/main/classes/collate/out/lib/icu4j-collate.jar:/srv/gump/public/workspace/icu4j/main/classes/currdata/out/l
 ib/icu4j-currdata.jar:/srv/gump/public/workspace/icu4j/main/classes/langdata/out/lib/icu4j-langdata.jar:/srv/gump/public/workspace/icu4j/main/classes/regiondata/out/lib/icu4j-regiondata.jar:/srv/gump/public/workspace/icu4j/main/classes/translit/out/lib/icu4j-translit.jar:/srv/gump/public/workspace/icu4j/main/classes/charset/out/lib/icu4j-charset.jar:/srv/gump/public/workspace/icu4j/main/classes/localespi/out/lib/icu4j-localespi.jar:/srv/gump/packages/apache-attic/jakarta-regexp-1.5.jar:/srv/gump/public/workspace/jakarta-servletapi-5/jsr154/dist/lib/servlet-api.jar:/srv/gump/packages/javacc-3.1/bin/lib/javacc.jar:/srv/gump/public/workspace/jline/target/jline-0.9.95-SNAPSHOT.jar:/srv/gump/packages/jtidy/jtidy-r938.jar:/srv/gump/public/workspace/junit/dist/junit-24092011.jar:/srv/gump/public/workspace/junit/dist/junit-dep-24092011.jar:/srv/gump/public/workspace/lucene-java/lucene/build/lucene-core-24092011.jar:/srv/gump/public/workspace/lucene-java/modules/analysis/build/icu/lu
 cene-analyzers-icu-24092011.jar:/srv/gump/public/workspace/lucene-java/modules/analysis/build/smartcn/lucene-analyzers-smartcn-24092011.jar:/srv/gump/public/workspace/lucene-java/modules/analysis/build/common/lucene-analyzers-common-24092011.jar:/srv/gump/public/workspace/lucene-java/modules/analysis/build/stempel/lucene-analyzers-stempel-24092011.jar:/srv/gump/public/workspace/lucene-java/modules/analysis/build/phonetic/lucene-analyzers-phonetic-24092011.jar:/srv/gump/public/workspace/lucene-java/modules/analysis/build/morfologik/lucene-analyzers-morfologik-24092011.jar:/srv/gump/public/workspace/lucene-java/modules/queries/build/lucene-queries-24092011.jar:/srv/gump/public/workspace/lucene-java/modules/queryparser/build/lucene-queryparser-24092011.jar:/srv/gump/public/workspace/lucene-java/lucene/build/contrib/demo/lucene-demo-24092011.jar:/srv/gump/public/workspace/lucene-java/lucene/build/contrib/highlighter/lucene-highlighter-24092011.jar:/srv/gump/public/workspace/luce
 ne-java/lucene/build/contrib/instantiated/lucene-instantiated-24092011.jar:/srv/gump/public/workspace/lucene-java/lucene/build/contrib/memory/lucene-memory-24092011.jar:/srv/gump/public/workspace/lucene-java/lucene/build/contrib/misc/lucene-misc-24092011.jar:/srv/gump/public/workspace/lucene-java/lucene/build/contrib/sandbox/lucene-sandbox-24092011.jar:/srv/gump/public/workspace/lucene-java/lucene/build/contrib/spatial/lucene-spatial-24092011.jar:/srv/gump/public/workspace/lucene-java/lucene/build/lucene-test-framework-24092011.jar:/srv/gump/packages/nekohtml-0.9.5/nekohtml.jar:/srv/gump/public/workspace/xml-commons/java/external/build/xml-apis-ext.jar
---------------------------------------------
    [junit] 
    [junit] Testcase: testControlledEquality(org.apache.lucene.util.packed.TestPackedInts):
FAILED
    [junit] ensure your setUp() calls super.setUp()!!!
    [junit] junit.framework.AssertionFailedError: ensure your setUp() calls super.setUp()!!!
    [junit] 	at org.apache.lucene.util.LuceneTestCase$1.starting(LuceneTestCase.java:591)
    [junit] 	at org.apache.lucene.util.LuceneTestCase$2$1.evaluate(LuceneTestCase.java:611)
    [junit] 	at org.apache.lucene.util.LuceneTestCaseRunner.runChild(LuceneTestCaseRunner.java:148)
    [junit] 	at org.apache.lucene.util.LuceneTestCaseRunner.runChild(LuceneTestCaseRunner.java:50)
    [junit] 
    [junit] 
    [junit] Testcase: org.apache.lucene.util.packed.TestPackedInts:	Caused an ERROR
    [junit] java.lang.AssertionError: ensure your setUp() calls super.setUp() and your tearDown()
calls super.tearDown()!!!
    [junit] java.lang.RuntimeException: java.lang.AssertionError: ensure your setUp() calls
super.setUp() and your tearDown() calls super.tearDown()!!!
    [junit] 	at org.apache.lucene.util.LuceneTestCase.afterClassLuceneTestCaseJ4(LuceneTestCase.java:470)
    [junit] Caused by: java.lang.AssertionError: ensure your setUp() calls super.setUp() and
your tearDown() calls super.tearDown()!!!
    [junit] 	at org.apache.lucene.util.LuceneTestCase.afterClassLuceneTestCaseJ4(LuceneTestCase.java:414)
    [junit] 
    [junit] 
    [junit] Tests run: 8, Failures: 8, Errors: 1, Time elapsed: 0.046 sec
    [junit] 
    [junit] ------------- Standard Error -----------------
    [junit] NOTE: reproduce with (hopefully): ant test -Dtestcase=TestPackedInts -Dtests.seed=290fd520df6b443a:0:70a4683fc6839c4e
    [junit] NOTE: test params are: codec=PreFlex, sim=RandomSimilarityProvider(queryNorm=false,coord=false):
{}, locale=sk, timezone=Canada/Mountain
    [junit] NOTE: all tests run in this JVM:
    [junit] [TestCachingTokenFilter, Test2BPostings, TestAtomicUpdate, TestDeletionPolicy,
TestDocTermOrds, TestIndexReaderOnDiskFull, TestIndexWriterConfig, TestIndexWriterExceptions,
TestNRTThreads, TestNoMergePolicy, TestPayloadProcessorProvider, TestPayloads, TestSnapshotDeletionPolicy,
TestTerm, TestIntBlockCodec, TestExplanations, TestFuzzyQuery, TestMultiValuedNumericRangeQuery,
TestPrefixInBooleanQuery, TestQueryTermVector, TestSimilarity, TestSimpleExplanationsOfNonMatches,
TestTermRangeQuery, TestTermVectors, TestPayloadNearQuery, TestSpansAdvanced, TestFileSwitchDirectory,
TestBytesRefHash, TestIndexableBinaryStringTools, TestPriorityQueue, TestUTF32ToUTF8, TestPackedInts]
    [junit] NOTE: Linux 2.6.32-33-server amd64/Sun Microsystems Inc. 1.6.0_20 (64-bit)/cpus=1,threads=1,free=13749368,total=35545088
    [junit] ------------- ---------------- ---------------
    [junit] TEST org.apache.lucene.util.packed.TestPackedInts FAILED
    [junit] Tests FAILED

BUILD FAILED
/srv/gump/public/workspace/lucene-java/lucene/common-build.xml:633: 
The following error occurred while executing this line:
/srv/gump/public/workspace/lucene-java/lucene/common-build.xml:617: Tests failed!
The following error occurred while executing this line:
/srv/gump/public/workspace/lucene-java/lucene/common-build.xml:617: Tests failed!
The following error occurred while executing this line:
/srv/gump/public/workspace/lucene-java/lucene/common-build.xml:617: Tests failed!
The following error occurred while executing this line:
/srv/gump/public/workspace/lucene-java/lucene/common-build.xml:617: Tests failed!
The following error occurred while executing this line:
/srv/gump/public/workspace/lucene-java/lucene/common-build.xml:617: Tests failed!
The following error occurred while executing this line:
/srv/gump/public/workspace/lucene-java/lucene/common-build.xml:617: Tests failed!
The following error occurred while executing this line:
/srv/gump/public/workspace/lucene-java/lucene/common-build.xml:617: Tests failed!
The following error occurred while executing this line:
/srv/gump/public/workspace/lucene-java/lucene/common-build.xml:617: Tests failed!

Total time: 1 minute 54 seconds
---------------------------------------------

To subscribe to this information via syndicated feeds:
- RSS: http://vmgump.apache.org/gump/public/lucene-java/lucene-java-contrib-test/rss.xml
- Atom: http://vmgump.apache.org/gump/public/lucene-java/lucene-java-contrib-test/atom.xml

============================== Gump Tracking Only ===
Produced by Apache Gump(TM) version 2.3.
Gump Run 06001824092011, vmgump.apache.org:vmgump:06001824092011
Gump E-mail Identifier (unique within run) #1.


--
Apache Gump
http://gump.apache.org/ [Instance: vmgump]

---------------------------------------------------------------------
To unsubscribe, e-mail: general-unsubscribe@gump.apache.org
For additional commands, e-mail: general-help@gump.apache.org


Mime
View raw message