gump-general mailing list archives

Site index · List index
Message view « Date » · « Thread »
Top « Date » · « Thread »
From g...@vmgump.apache.org
Subject BATCH: All dressed up, with nowhere to go...
Date Sat, 13 Aug 2011 01:33:46 GMT
Dear Gumpmeisters,
            
The following 4 notifys should have been sent

*********************************************************** G U M P
[GUMP@vmgump]: Project lucene-java-analyzers-test (in module lucene-java) failed
[GUMP@vmgump]: Project lucene-java-contrib (in module lucene-java) failed
[GUMP@vmgump]: Project wss4j (in module ws-wss4j) failed
[GUMP@vmgump]: Project portals-pluto-trunk-test (in module portals-pluto-trunk) failed
*********************************************************** G U M P
[GUMP@vmgump]: Project lucene-java-analyzers-test (in module lucene-java) failed
To whom it may engage...
        
This is an automated request, but not an unsolicited one. For 
more information please visit http://gump.apache.org/nagged.html, 
and/or contact the folk at general@gump.apache.org.

Project lucene-java-analyzers-test has an issue affecting its community integration.
This issue affects 1 projects.
The current state of this project is 'Failed', with reason 'Build Failed'.
For reference only, the following projects are affected by this:
    - lucene-java-analyzers-test :  Java Based Search Engine


Full details are available at:
    http://vmgump.apache.org/gump/public/lucene-java/lucene-java-analyzers-test/index.html

That said, some information snippets are provided here.

The following annotations (debug/informational/warning/error messages) were provided:
 -INFO- Failed with reason build failed



The following work was performed:
http://vmgump.apache.org/gump/public/lucene-java/lucene-java-analyzers-test/gump_work/build_lucene-java_lucene-java-analyzers-test.html
Work Name: build_lucene-java_lucene-java-analyzers-test (Type: Build)
Work ended in a state of : Failed
Elapsed: 31 secs
Command Line: /usr/lib/jvm/java-6-openjdk/bin/java -Djava.awt.headless=true -Dbuild.sysclasspath=only
-Xbootclasspath/p:/srv/gump/public/workspace/xml-commons/java/external/build/xml-apis.jar:/srv/gump/public/workspace/xml-xerces2/build/xercesImpl.jar
org.apache.tools.ant.Main -Dgump.merge=/srv/gump/public/gump/work/merge.xml -Dversion=12082011
test 
[Working Directory: /srv/gump/public/workspace/lucene-java/modules/analysis]
CLASSPATH: /usr/lib/jvm/java-6-openjdk/lib/tools.jar:/srv/gump/public/workspace/lucene-java/lucene/build/classes/test:/srv/gump/public/workspace/lucene-java/lucene/build/classes/tools:/srv/gump/public/workspace/lucene-java/modules/analysis/build/icu/classes/test:/srv/gump/public/workspace/lucene-java/modules/analysis/build/smartcn/classes/test:/srv/gump/public/workspace/lucene-java/modules/analysis/build/common/classes/test:/srv/gump/public/workspace/lucene-java/modules/analysis/build/stempel/classes/test:/srv/gump/public/workspace/lucene-java/modules/analysis/build/phonetic/classes/test:/srv/gump/public/workspace/lucene-java/modules/analysis/build/morfologik/classes/test:/srv/gump/public/workspace/ant/dist/lib/ant.jar:/srv/gump/public/workspace/ant/dist/lib/ant-launcher.jar:/srv/gump/public/workspace/ant/dist/lib/ant-jmf.jar:/srv/gump/public/workspace/ant/dist/lib/ant-junit.jar:/srv/gump/public/workspace/ant/dist/lib/ant-swing.jar:/srv/gump/public/workspace/ant/dist/lib/ant-
 apache-resolver.jar:/srv/gump/public/workspace/ant/dist/lib/ant-apache-xalan2.jar:/srv/gump/packages/junit3.8.1/junit.jar:/srv/gump/public/workspace/xml-commons/java/build/resolver.jar:/srv/gump/public/workspace/commons-codec-1.x/dist/commons-codec-12082011.jar:/srv/gump/public/workspace/icu4j/main/classes/core/out/lib/icu4j-core.jar:/srv/gump/public/workspace/icu4j/main/classes/collate/out/lib/icu4j-collate.jar:/srv/gump/public/workspace/icu4j/main/classes/currdata/out/lib/icu4j-currdata.jar:/srv/gump/public/workspace/icu4j/main/classes/langdata/out/lib/icu4j-langdata.jar:/srv/gump/public/workspace/icu4j/main/classes/regiondata/out/lib/icu4j-regiondata.jar:/srv/gump/public/workspace/icu4j/main/classes/translit/out/lib/icu4j-translit.jar:/srv/gump/public/workspace/icu4j/main/classes/charset/out/lib/icu4j-charset.jar:/srv/gump/public/workspace/icu4j/main/classes/localespi/out/lib/icu4j-localespi.jar:/srv/gump/public/workspace/junit/dist/junit-12082011.jar:/srv/gump/public/wor
 kspace/junit/dist/junit-dep-12082011.jar:/srv/gump/public/workspace/lucene-java/lucene/build/lucene-core-12082011.jar:/srv/gump/public/workspace/lucene-java/modules/analysis/build/icu/lucene-analyzers-icu-12082011.jar:/srv/gump/public/workspace/lucene-java/modules/analysis/build/smartcn/lucene-analyzers-smartcn-12082011.jar:/srv/gump/public/workspace/lucene-java/modules/analysis/build/common/lucene-analyzers-common-12082011.jar:/srv/gump/public/workspace/lucene-java/modules/analysis/build/stempel/lucene-analyzers-stempel-12082011.jar:/srv/gump/public/workspace/lucene-java/modules/analysis/build/phonetic/lucene-analyzers-phonetic-12082011.jar:/srv/gump/public/workspace/lucene-java/modules/analysis/build/morfologik/lucene-analyzers-morfologik-12082011.jar:/srv/gump/public/workspace/lucene-java/lucene/build/lucene-test-framework-12082011.jar:/srv/gump/public/workspace/xml-commons/java/external/build/xml-apis-ext.jar
---------------------------------------------
    [junit] ensure your setUp() calls super.setUp()!!!
    [junit] junit.framework.AssertionFailedError: ensure your setUp() calls super.setUp()!!!
    [junit] 	at org.apache.lucene.util.LuceneTestCase$1.starting(LuceneTestCase.java:561)
    [junit] 	at org.apache.lucene.util.LuceneTestCase$LuceneTestCaseRunner.runChild(LuceneTestCase.java:1526)
    [junit] 	at org.apache.lucene.util.LuceneTestCase$LuceneTestCaseRunner.runChild(LuceneTestCase.java:1428)
    [junit] 
    [junit] 
    [junit] Testcase: testFarsiRangeQueryCollating(org.apache.lucene.collation.TestCollationKeyAnalyzer):
FAILED
    [junit] ensure your setUp() calls super.setUp()!!!
    [junit] junit.framework.AssertionFailedError: ensure your setUp() calls super.setUp()!!!
    [junit] 	at org.apache.lucene.util.LuceneTestCase$1.starting(LuceneTestCase.java:561)
    [junit] 	at org.apache.lucene.util.LuceneTestCase$LuceneTestCaseRunner.runChild(LuceneTestCase.java:1526)
    [junit] 	at org.apache.lucene.util.LuceneTestCase$LuceneTestCaseRunner.runChild(LuceneTestCase.java:1428)
    [junit] 
    [junit] 
    [junit] Testcase: testFarsiTermRangeQuery(org.apache.lucene.collation.TestCollationKeyAnalyzer):
FAILED
    [junit] ensure your setUp() calls super.setUp()!!!
    [junit] junit.framework.AssertionFailedError: ensure your setUp() calls super.setUp()!!!
    [junit] 	at org.apache.lucene.util.LuceneTestCase$1.starting(LuceneTestCase.java:561)
    [junit] 	at org.apache.lucene.util.LuceneTestCase$LuceneTestCaseRunner.runChild(LuceneTestCase.java:1526)
    [junit] 	at org.apache.lucene.util.LuceneTestCase$LuceneTestCaseRunner.runChild(LuceneTestCase.java:1428)
    [junit] 
    [junit] 
    [junit] Tests run: 5, Failures: 5, Errors: 0, Time elapsed: 0.165 sec
    [junit] 
    [junit] TEST org.apache.lucene.collation.TestCollationKeyAnalyzer FAILED
    [junit] Tests FAILED

BUILD FAILED
/srv/gump/public/workspace/lucene-java/modules/analysis/build.xml:91: The following error
occurred while executing this line:
/srv/gump/public/workspace/lucene-java/lucene/contrib/contrib-build.xml:62: The following
error occurred while executing this line:
/srv/gump/public/workspace/lucene-java/lucene/common-build.xml:628: 
The following error occurred while executing this line:
/srv/gump/public/workspace/lucene-java/lucene/common-build.xml:612: Tests failed!
The following error occurred while executing this line:
/srv/gump/public/workspace/lucene-java/lucene/common-build.xml:612: Tests failed!
The following error occurred while executing this line:
/srv/gump/public/workspace/lucene-java/lucene/common-build.xml:612: Tests failed!
The following error occurred while executing this line:
/srv/gump/public/workspace/lucene-java/lucene/common-build.xml:612: Tests failed!
The following error occurred while executing this line:
/srv/gump/public/workspace/lucene-java/lucene/common-build.xml:612: Tests failed!
The following error occurred while executing this line:
/srv/gump/public/workspace/lucene-java/lucene/common-build.xml:612: Tests failed!
The following error occurred while executing this line:
/srv/gump/public/workspace/lucene-java/lucene/common-build.xml:612: Tests failed!
The following error occurred while executing this line:
/srv/gump/public/workspace/lucene-java/lucene/common-build.xml:612: Tests failed!

Total time: 30 seconds
---------------------------------------------

To subscribe to this information via syndicated feeds:
- RSS: http://vmgump.apache.org/gump/public/lucene-java/lucene-java-analyzers-test/rss.xml
- Atom: http://vmgump.apache.org/gump/public/lucene-java/lucene-java-analyzers-test/atom.xml

============================== Gump Tracking Only ===
Produced by Apache Gump(TM) version 2.3.
Gump Run 05001812082011, vmgump.apache.org:vmgump:05001812082011
Gump E-mail Identifier (unique within run) #1.

*********************************************************** G U M P
[GUMP@vmgump]: Project lucene-java-contrib (in module lucene-java) failed
To whom it may engage...
        
This is an automated request, but not an unsolicited one. For 
more information please visit http://gump.apache.org/nagged.html, 
and/or contact the folk at general@gump.apache.org.

Project lucene-java-contrib has an issue affecting its community integration.
This issue affects 4 projects.
The current state of this project is 'Failed', with reason 'Build Failed'.
For reference only, the following projects are affected by this:
    - lucene-java-contrib :  Java Based Search Engine
    - lucene-java-contrib-test :  Java Based Search Engine
    - solr :  Java Based Search Engine
    - solr-test :  Java Based Search Engine


Full details are available at:
    http://vmgump.apache.org/gump/public/lucene-java/lucene-java-contrib/index.html

That said, some information snippets are provided here.

The following annotations (debug/informational/warning/error messages) were provided:
 -DEBUG- Dependency on javacc exists, no need to add for property javacc.home.
 -INFO- Failed with reason build failed
 -INFO- Failed to extract fallback artifacts from Gump Repository



The following work was performed:
http://vmgump.apache.org/gump/public/lucene-java/lucene-java-contrib/gump_work/build_lucene-java_lucene-java-contrib.html
Work Name: build_lucene-java_lucene-java-contrib (Type: Build)
Work ended in a state of : Failed
Elapsed: 57 secs
Command Line: /usr/lib/jvm/java-6-openjdk/bin/java -Djava.awt.headless=true -Dbuild.sysclasspath=only
-Xbootclasspath/p:/srv/gump/public/workspace/xml-commons/java/external/build/xml-apis.jar:/srv/gump/public/workspace/xml-xerces2/build/xercesImpl.jar
org.apache.tools.ant.Main -Dgump.merge=/srv/gump/public/gump/work/merge.xml -Dversion=12082011
-Djavacc.home=/srv/gump/packages/javacc-3.1 package 
[Working Directory: /srv/gump/public/workspace/lucene-java/lucene]
CLASSPATH: /usr/lib/jvm/java-6-openjdk/lib/tools.jar:/srv/gump/public/workspace/lucene-java/lucene/build/classes/test:/srv/gump/public/workspace/lucene-java/lucene/build/classes/tools:/srv/gump/public/workspace/lucene-java/lucene/build/contrib/demo/classes/java:/srv/gump/public/workspace/lucene-java/lucene/build/contrib/highlighter/classes/java:/srv/gump/public/workspace/lucene-java/lucene/build/contrib/instantiated/classes/java:/srv/gump/public/workspace/lucene-java/lucene/build/contrib/memory/classes/java:/srv/gump/public/workspace/lucene-java/lucene/build/contrib/misc/classes/java:/srv/gump/public/workspace/lucene-java/lucene/build/contrib/queries/classes/java:/srv/gump/public/workspace/lucene-java/lucene/build/contrib/queryparser/classes/java:/srv/gump/public/workspace/lucene-java/lucene/build/contrib/spatial/classes/java:/srv/gump/public/workspace/lucene-java/lucene/build/contrib/wordnet/classes/java:/srv/gump/public/workspace/lucene-java/lucene/build/contrib/xml-query-p
 arser/classes/java:/srv/gump/public/workspace/ant/dist/lib/ant.jar:/srv/gump/public/workspace/ant/dist/lib/ant-launcher.jar:/srv/gump/public/workspace/ant/dist/lib/ant-jmf.jar:/srv/gump/public/workspace/ant/dist/lib/ant-junit.jar:/srv/gump/public/workspace/ant/dist/lib/ant-swing.jar:/srv/gump/public/workspace/ant/dist/lib/ant-apache-resolver.jar:/srv/gump/public/workspace/ant/dist/lib/ant-apache-xalan2.jar:/srv/gump/packages/junit3.8.1/junit.jar:/srv/gump/public/workspace/xml-commons/java/build/resolver.jar:/srv/gump/public/workspace/apache-commons/cli/target/commons-cli-1.3-SNAPSHOT.jar:/srv/gump/public/workspace/apache-commons/compress/target/commons-compress-1.3-SNAPSHOT.jar:/srv/gump/public/workspace/commons-digester-2.x/target/commons-digester-2.2-SNAPSHOT.jar:/srv/gump/public/workspace/apache-commons/logging/target/commons-logging-12082011.jar:/srv/gump/public/workspace/apache-commons/logging/target/commons-logging-api-12082011.jar:/srv/gump/packages/caucho-libs/hessia
 n-3.0.8.jar:/srv/gump/public/workspace/icu4j/main/classes/core/out/lib/icu4j-core.jar:/srv/gump/public/workspace/icu4j/main/classes/collate/out/lib/icu4j-collate.jar:/srv/gump/public/workspace/icu4j/main/classes/currdata/out/lib/icu4j-currdata.jar:/srv/gump/public/workspace/icu4j/main/classes/langdata/out/lib/icu4j-langdata.jar:/srv/gump/public/workspace/icu4j/main/classes/regiondata/out/lib/icu4j-regiondata.jar:/srv/gump/public/workspace/icu4j/main/classes/translit/out/lib/icu4j-translit.jar:/srv/gump/public/workspace/icu4j/main/classes/charset/out/lib/icu4j-charset.jar:/srv/gump/public/workspace/icu4j/main/classes/localespi/out/lib/icu4j-localespi.jar:/srv/gump/packages/apache-attic/jakarta-regexp-1.5.jar:/srv/gump/public/workspace/jakarta-servletapi-5/jsr154/dist/lib/servlet-api.jar:/srv/gump/packages/javacc-3.1/bin/lib/javacc.jar:/srv/gump/public/workspace/jline/target/jline-0.9.95-SNAPSHOT.jar:/srv/gump/packages/jtidy/jtidy-r938.jar:/srv/gump/public/workspace/junit/dist
 /junit-12082011.jar:/srv/gump/public/workspace/junit/dist/junit-dep-12082011.jar:/srv/gump/public/workspace/lucene-java/lucene/build/lucene-core-12082011.jar:/srv/gump/public/workspace/lucene-java/modules/analysis/build/icu/lucene-analyzers-icu-12082011.jar:/srv/gump/public/workspace/lucene-java/modules/analysis/build/smartcn/lucene-analyzers-smartcn-12082011.jar:/srv/gump/public/workspace/lucene-java/modules/analysis/build/common/lucene-analyzers-common-12082011.jar:/srv/gump/public/workspace/lucene-java/modules/analysis/build/stempel/lucene-analyzers-stempel-12082011.jar:/srv/gump/public/workspace/lucene-java/modules/analysis/build/phonetic/lucene-analyzers-phonetic-12082011.jar:/srv/gump/public/workspace/lucene-java/modules/analysis/build/morfologik/lucene-analyzers-morfologik-12082011.jar:/srv/gump/public/workspace/lucene-java/lucene/build/lucene-test-framework-12082011.jar:/srv/gump/packages/nekohtml-0.9.5/nekohtml.jar:/srv/gump/public/workspace/xml-commons/java/externa
 l/build/xml-apis-ext.jar
---------------------------------------------
  [javadoc] location: class org.apache.lucene.xmlparser.CorePlusExtensionsParser
  [javadoc] 	public CorePlusExtensionsParser(Analyzer analyzer, QueryParser parser)
  [javadoc] 	                                                   ^
  [javadoc] /srv/gump/public/workspace/lucene-java/lucene/contrib/xml-query-parser/src/java/org/apache/lucene/xmlparser/CorePlusExtensionsParser.java:54:
cannot find symbol
  [javadoc] symbol  : class QueryParser
  [javadoc] location: class org.apache.lucene.xmlparser.CorePlusExtensionsParser
  [javadoc] 	private CorePlusExtensionsParser(String defaultField,Analyzer analyzer, QueryParser
parser)
  [javadoc] 	                                                                        ^
  [javadoc] /srv/gump/public/workspace/lucene-java/lucene/contrib/xml-query-parser/src/java/org/apache/lucene/xmlparser/builders/LikeThisQueryBuilder.java:14:
package org.apache.lucene.queries.mlt does not exist
  [javadoc] import org.apache.lucene.queries.mlt.MoreLikeThisQuery;
  [javadoc]                                     ^
  [javadoc] /srv/gump/public/workspace/lucene-java/lucene/contrib/xml-query-parser/src/java/org/apache/lucene/xmlparser/builders/UserInputQueryBuilder.java:4:
package org.apache.lucene.queryparser.classic does not exist
  [javadoc] import org.apache.lucene.queryparser.classic.ParseException;
  [javadoc]                                             ^
  [javadoc] /srv/gump/public/workspace/lucene-java/lucene/contrib/xml-query-parser/src/java/org/apache/lucene/xmlparser/builders/UserInputQueryBuilder.java:5:
package org.apache.lucene.queryparser.classic does not exist
  [javadoc] import org.apache.lucene.queryparser.classic.QueryParser;
  [javadoc]                                             ^
  [javadoc] /srv/gump/public/workspace/lucene-java/lucene/contrib/xml-query-parser/src/java/org/apache/lucene/xmlparser/builders/UserInputQueryBuilder.java:38:
cannot find symbol
  [javadoc] symbol  : class QueryParser
  [javadoc] location: class org.apache.lucene.xmlparser.builders.UserInputQueryBuilder
  [javadoc] 	QueryParser unSafeParser;
  [javadoc] 	^
  [javadoc] /srv/gump/public/workspace/lucene-java/lucene/contrib/xml-query-parser/src/java/org/apache/lucene/xmlparser/builders/UserInputQueryBuilder.java:46:
cannot find symbol
  [javadoc] symbol  : class QueryParser
  [javadoc] location: class org.apache.lucene.xmlparser.builders.UserInputQueryBuilder
  [javadoc] 	public UserInputQueryBuilder(QueryParser parser) {
  [javadoc] 	                             ^
  [javadoc] /srv/gump/public/workspace/lucene-java/lucene/contrib/xml-query-parser/src/java/org/apache/lucene/xmlparser/builders/UserInputQueryBuilder.java:91:
cannot find symbol
  [javadoc] symbol  : class QueryParser
  [javadoc] location: class org.apache.lucene.xmlparser.builders.UserInputQueryBuilder
  [javadoc] 	protected QueryParser createQueryParser(String fieldName, Analyzer analyzer)
  [javadoc] 	          ^
  [javadoc] Standard Doclet version 1.6.0_20
  [javadoc] Building tree for all the packages and classes...
  [javadoc] Generating /srv/gump/public/workspace/lucene-java/lucene/build/docs/api/all/org/apache/lucene/store/instantiated//package-summary.html...
  [javadoc] Copying file /srv/gump/public/workspace/lucene-java/lucene/contrib/instantiated/src/java/org/apache/lucene/store/instantiated/doc-files/classdiagram.uxf
to directory /srv/gump/public/workspace/lucene-java/lucene/build/docs/api/all/org/apache/lucene/store/instantiated/doc-files...
  [javadoc] Copying file /srv/gump/public/workspace/lucene-java/lucene/contrib/instantiated/src/java/org/apache/lucene/store/instantiated/doc-files/classdiagram.png
to directory /srv/gump/public/workspace/lucene-java/lucene/build/docs/api/all/org/apache/lucene/store/instantiated/doc-files...
  [javadoc] Copying file /srv/gump/public/workspace/lucene-java/lucene/contrib/instantiated/src/java/org/apache/lucene/store/instantiated/doc-files/HitCollectionBench.jpg
to directory /srv/gump/public/workspace/lucene-java/lucene/build/docs/api/all/org/apache/lucene/store/instantiated/doc-files...
  [javadoc] Generating /srv/gump/public/workspace/lucene-java/lucene/build/docs/api/all/serialized-form.html...
  [javadoc] Copying file /srv/gump/public/workspace/lucene-java/lucene/build/docs/api/prettify/stylesheet+prettify.css
to file /srv/gump/public/workspace/lucene-java/lucene/build/docs/api/all/stylesheet+prettify.css...
  [javadoc] Building index for all the packages and classes...
  [javadoc] Building index for all classes...
  [javadoc] Generating /srv/gump/public/workspace/lucene-java/lucene/build/docs/api/all/help-doc.html...
  [javadoc] 14 warnings

BUILD FAILED
/srv/gump/public/workspace/lucene-java/lucene/build.xml:240: The following error occurred
while executing this line:
/srv/gump/public/workspace/lucene-java/lucene/common-build.xml:876: Javadocs warnings were
found!

Total time: 56 seconds
---------------------------------------------

To subscribe to this information via syndicated feeds:
- RSS: http://vmgump.apache.org/gump/public/lucene-java/lucene-java-contrib/rss.xml
- Atom: http://vmgump.apache.org/gump/public/lucene-java/lucene-java-contrib/atom.xml

============================== Gump Tracking Only ===
Produced by Apache Gump(TM) version 2.3.
Gump Run 05001812082011, vmgump.apache.org:vmgump:05001812082011
Gump E-mail Identifier (unique within run) #2.

*********************************************************** G U M P
[GUMP@vmgump]: Project wss4j (in module ws-wss4j) failed
To whom it may engage...
        
This is an automated request, but not an unsolicited one. For 
more information please visit http://gump.apache.org/nagged.html, 
and/or contact the folk at general@gump.apache.org.

Project wss4j has an issue affecting its community integration.
This issue affects 2 projects.
The current state of this project is 'Failed', with reason 'Build Failed'.
For reference only, the following projects are affected by this:
    - wss4j :  WS-FX Project
    - wss4j-test :  WS-FX Project


Full details are available at:
    http://vmgump.apache.org/gump/public/ws-wss4j/wss4j/index.html

That said, some information snippets are provided here.

The following annotations (debug/informational/warning/error messages) were provided:
 -DEBUG- Sole jar output [wss4j-@DATE@.jar] identifier set to project name
 -INFO- Failed with reason build failed
 -INFO- Failed to extract fallback artifacts from Gump Repository



The following work was performed:
http://vmgump.apache.org/gump/public/ws-wss4j/wss4j/gump_work/build_ws-wss4j_wss4j.html
Work Name: build_ws-wss4j_wss4j (Type: Build)
Work ended in a state of : Failed
Elapsed: 21 secs
Command Line: /usr/lib/jvm/java-6-openjdk/bin/java -Djava.awt.headless=true -Dbuild.sysclasspath=only
-Dant.build.clonevm=true -Xbootclasspath/p:/srv/gump/public/workspace/xml-xerces2/build/xercesImpl.jar:/srv/gump/public/workspace/xml-xalan/build/xalan-unbundled.jar:/srv/gump/public/workspace/xml-xalan/build/serializer.jar:/srv/gump/public/workspace/xml-commons/java/external/build/xml-apis.jar
org.apache.tools.ant.Main -Dgump.merge=/srv/gump/public/gump/work/merge.xml -Dskip.tests=true
-Djar.library=wss4j-@DATE@.jar gump 
[Working Directory: /srv/gump/public/workspace/ws-wss4j]
CLASSPATH: /usr/lib/jvm/java-6-openjdk/lib/tools.jar:/srv/gump/public/workspace/ws-wss4j/build/classes:/srv/gump/public/workspace/ant/dist/lib/ant.jar:/srv/gump/public/workspace/ant/dist/lib/ant-launcher.jar:/srv/gump/public/workspace/ant/dist/lib/ant-jmf.jar:/srv/gump/public/workspace/ant/dist/lib/ant-junit.jar:/srv/gump/public/workspace/ant/dist/lib/ant-swing.jar:/srv/gump/public/workspace/ant/dist/lib/ant-apache-resolver.jar:/srv/gump/public/workspace/ant/dist/lib/ant-apache-xalan2.jar:/srv/gump/packages/junit3.8.1/junit.jar:/srv/gump/public/workspace/xml-commons/java/build/resolver.jar:/srv/gump/public/workspace/ws-addressing/target/addressing-12082011.jar:/srv/gump/packages/bouncycastle-jdk14/bcprov-ext-jdk14-145.jar:/srv/gump/public/workspace/ws-axis/build/lib/axis.jar:/srv/gump/public/workspace/ws-axis/build/lib/axis-ant.jar:/srv/gump/public/workspace/ws-axis/build/lib/jaxrpc.jar:/srv/gump/public/workspace/ws-axis/build/lib/saaj.jar:/srv/gump/public/workspace/commons-c
 odec-1.x/dist/commons-codec-12082011.jar:/srv/gump/public/workspace/apache-commons/discovery/dist/commons-discovery.jar:/srv/gump/public/workspace/httpcomponents/oac.hc3x/dist/commons-httpclient.jar:/srv/gump/public/workspace/apache-commons/logging/target/commons-logging-12082011.jar:/srv/gump/public/workspace/apache-commons/logging/target/commons-logging-api-12082011.jar:/srv/gump/packages/jaf-1.1ea/activation.jar:/srv/gump/packages/javamail-1.4/mail.jar:/srv/gump/packages/javamail-1.4/lib/mailapi.jar:/srv/gump/packages/jce/jce-jdk13-116.jar:/srv/gump/packages/jsse1.0.3/lib/jsse.jar:/srv/gump/packages/jsse1.0.3/lib/jnet.jar:/srv/gump/packages/jsse1.0.3/lib/jcert.jar:/srv/gump/public/workspace/junit/dist/junit-12082011.jar:/srv/gump/public/workspace/junit/dist/junit-dep-12082011.jar:/srv/gump/public/workspace/logging-log4j-12/dist/lib/log4j-12082011.jar:/srv/gump/packages/opensaml/opensaml-2.5.1.jar:/srv/gump/public/workspace/wsdl4j/build/lib/wsdl4j.jar:/srv/gump/public/work
 space/wsdl4j/build/lib/qname.jar:/srv/gump/public/workspace/apache-commons/bcel/target/bcel-6.0-SNAPSHOT.jar:/srv/gump/public/workspace/xml-xalan/tools/java_cup.jar:/srv/gump/public/workspace/xml-xalan/lib/runtime.jar:/srv/gump/public/workspace/xml-xalan/tools/JLex.jar:/srv/gump/public/workspace/santuario/build/xmlsec-12082011.jar:/srv/gump/public/workspace/xml-commons/java/external/build/xml-apis-ext.jar
---------------------------------------------
    [javac]             ^
    [javac] /srv/gump/public/workspace/ws-wss4j/src/main/java/org/apache/ws/security/saml/ext/AssertionWrapper.java:624:
cannot find symbol
    [javac] symbol  : class SignatureValidator
    [javac] location: class org.apache.ws.security.saml.ext.AssertionWrapper
    [javac]             SignatureValidator sigValidator = new SignatureValidator(credential);
    [javac]                                                   ^
    [javac] /srv/gump/public/workspace/ws-wss4j/src/main/java/org/apache/ws/security/saml/ext/AssertionWrapper.java:627:
cannot find symbol
    [javac] symbol  : class ValidationException
    [javac] location: class org.apache.ws.security.saml.ext.AssertionWrapper
    [javac]             } catch (ValidationException ex) {
    [javac]                      ^
    [javac] /srv/gump/public/workspace/ws-wss4j/src/main/java/org/apache/ws/security/saml/ext/AssertionWrapper.java:722:
cannot find symbol
    [javac] symbol  : class Signature
    [javac] location: class org.apache.ws.security.saml.ext.AssertionWrapper
    [javac]         Signature sig = null;
    [javac]         ^
    [javac] /srv/gump/public/workspace/ws-wss4j/src/main/java/org/apache/ws/security/saml/ext/AssertionWrapper.java:723:
cannot find symbol
    [javac] symbol  : method getSignature()
    [javac] location: interface org.opensaml.saml2.core.Assertion
    [javac]         if (saml2 != null && saml2.getSignature() != null) {
    [javac]                                   ^
    [javac] /srv/gump/public/workspace/ws-wss4j/src/main/java/org/apache/ws/security/saml/ext/AssertionWrapper.java:724:
cannot find symbol
    [javac] symbol  : method getSignature()
    [javac] location: interface org.opensaml.saml2.core.Assertion
    [javac]             sig = saml2.getSignature();
    [javac]                        ^
    [javac] /srv/gump/public/workspace/ws-wss4j/src/main/java/org/apache/ws/security/saml/ext/AssertionWrapper.java:725:
cannot find symbol
    [javac] symbol  : method getSignature()
    [javac] location: interface org.opensaml.saml1.core.Assertion
    [javac]         } else if (saml1 != null && saml1.getSignature() != null) {
    [javac]                                          ^
    [javac] /srv/gump/public/workspace/ws-wss4j/src/main/java/org/apache/ws/security/saml/ext/AssertionWrapper.java:726:
cannot find symbol
    [javac] symbol  : method getSignature()
    [javac] location: interface org.opensaml.saml1.core.Assertion
    [javac]             sig = saml1.getSignature();
    [javac]                        ^
    [javac] /srv/gump/public/workspace/ws-wss4j/src/main/java/org/apache/ws/security/processor/EncryptedKeyProcessor.java:161:
cannot find symbol
    [javac] symbol  : method getKeyLengthFromURI(java.lang.String)
    [javac] location: class org.apache.xml.security.algorithms.JCEMapper
    [javac]                 size = JCEMapper.getKeyLengthFromURI(algorithmURI);
    [javac]                                 ^
    [javac] /srv/gump/public/workspace/ws-wss4j/src/main/java/org/apache/ws/security/processor/SAMLTokenProcessor.java:95:
reference to AssertionWrapper is ambiguous, both method AssertionWrapper(org.w3c.dom.Element)
in org.apache.ws.security.saml.ext.AssertionWrapper and method AssertionWrapper(XMLObject)
in org.apache.ws.security.saml.ext.AssertionWrapper match
    [javac]         AssertionWrapper assertion = new AssertionWrapper(token);
    [javac]                                      ^
    [javac] 100 errors

BUILD FAILED
/srv/gump/public/workspace/ws-wss4j/build.xml:276: Compile failed; see the compiler error
output for details.

Total time: 21 seconds
---------------------------------------------

To subscribe to this information via syndicated feeds:
- RSS: http://vmgump.apache.org/gump/public/ws-wss4j/wss4j/rss.xml
- Atom: http://vmgump.apache.org/gump/public/ws-wss4j/wss4j/atom.xml

============================== Gump Tracking Only ===
Produced by Apache Gump(TM) version 2.3.
Gump Run 05001812082011, vmgump.apache.org:vmgump:05001812082011
Gump E-mail Identifier (unique within run) #3.

*********************************************************** G U M P
[GUMP@vmgump]: Project portals-pluto-trunk-test (in module portals-pluto-trunk) failed
To whom it may engage...
        
This is an automated request, but not an unsolicited one. For 
more information please visit http://gump.apache.org/nagged.html, 
and/or contact the folk at general@gump.apache.org.

Project portals-pluto-trunk-test has an issue affecting its community integration.
This issue affects 1 projects.
The current state of this project is 'Failed', with reason 'Build Failed'.
For reference only, the following projects are affected by this:
    - portals-pluto-trunk-test :  JSR168 Container


Full details are available at:
    http://vmgump.apache.org/gump/public/portals-pluto-trunk/portals-pluto-trunk-test/index.html

That said, some information snippets are provided here.

The following annotations (debug/informational/warning/error messages) were provided:
 -WARNING- Overriding Maven settings: [/srv/gump/public/workspace/portals-pluto-trunk/gump_mvn_settings.xml]
 -DEBUG- (Apache Gump generated) Apache Maven Settings in: /srv/gump/public/workspace/portals-pluto-trunk/gump_mvn_settings.xml
 -INFO- Failed with reason build failed
 -DEBUG- Maven POM in: /srv/gump/public/workspace/portals-pluto-trunk/pom.xml



The following work was performed:
http://vmgump.apache.org/gump/public/portals-pluto-trunk/portals-pluto-trunk-test/gump_work/build_portals-pluto-trunk_portals-pluto-trunk-test.html
Work Name: build_portals-pluto-trunk_portals-pluto-trunk-test (Type: Build)
Work ended in a state of : Failed
Elapsed: 19 secs
Command Line: /opt/maven2/bin/mvn --batch-mode --settings /srv/gump/public/workspace/portals-pluto-trunk/gump_mvn_settings.xml
package 
[Working Directory: /srv/gump/public/workspace/portals-pluto-trunk]
M2_HOME: /opt/maven2
---------------------------------------------
[ERROR] FATAL ERROR
[INFO] ------------------------------------------------------------------------
[INFO] org/xmlpull/v1/XmlPullParserFactory
org.xmlpull.v1.XmlPullParserFactory
[INFO] ------------------------------------------------------------------------
[INFO] Trace
java.lang.NoClassDefFoundError: org/xmlpull/v1/XmlPullParserFactory
	at com.thoughtworks.xstream.io.xml.XppDriver.createParser(XppDriver.java:57)
	at com.thoughtworks.xstream.io.xml.AbstractXppDriver.createReader(AbstractXppDriver.java:58)
	at com.thoughtworks.xstream.XStream.fromXML(XStream.java:895)
	at org.apache.maven.plugin.war.util.WebappStructureSerializer.fromXml(WebappStructureSerializer.java:73)
	at org.apache.maven.plugin.war.AbstractWarMojo.buildWebapp(AbstractWarMojo.java:423)
	at org.apache.maven.plugin.war.AbstractWarMojo.buildExplodedWebapp(AbstractWarMojo.java:394)
	at org.apache.maven.plugin.war.WarMojo.performPackaging(WarMojo.java:195)
	at org.apache.maven.plugin.war.WarMojo.execute(WarMojo.java:157)
	at org.apache.maven.plugin.DefaultPluginManager.executeMojo(DefaultPluginManager.java:490)
	at org.apache.maven.lifecycle.DefaultLifecycleExecutor.executeGoals(DefaultLifecycleExecutor.java:694)
	at org.apache.maven.lifecycle.DefaultLifecycleExecutor.executeGoalWithLifecycle(DefaultLifecycleExecutor.java:556)
	at org.apache.maven.lifecycle.DefaultLifecycleExecutor.executeGoal(DefaultLifecycleExecutor.java:535)
	at org.apache.maven.lifecycle.DefaultLifecycleExecutor.executeGoalAndHandleFailures(DefaultLifecycleExecutor.java:387)
	at org.apache.maven.lifecycle.DefaultLifecycleExecutor.executeTaskSegments(DefaultLifecycleExecutor.java:348)
	at org.apache.maven.lifecycle.DefaultLifecycleExecutor.execute(DefaultLifecycleExecutor.java:180)
	at org.apache.maven.DefaultMaven.doExecute(DefaultMaven.java:328)
	at org.apache.maven.DefaultMaven.execute(DefaultMaven.java:138)
	at org.apache.maven.cli.MavenCli.main(MavenCli.java:362)
	at org.apache.maven.cli.compat.CompatibleMain.main(CompatibleMain.java:60)
	at sun.reflect.NativeMethodAccessorImpl.invoke0(Native Method)
	at sun.reflect.NativeMethodAccessorImpl.invoke(NativeMethodAccessorImpl.java:57)
	at sun.reflect.DelegatingMethodAccessorImpl.invoke(DelegatingMethodAccessorImpl.java:43)
	at java.lang.reflect.Method.invoke(Method.java:616)
	at org.codehaus.classworlds.Launcher.launchEnhanced(Launcher.java:315)
	at org.codehaus.classworlds.Launcher.launch(Launcher.java:255)
	at org.codehaus.classworlds.Launcher.mainWithExitCode(Launcher.java:430)
	at org.codehaus.classworlds.Launcher.main(Launcher.java:375)
Caused by: java.lang.ClassNotFoundException: org.xmlpull.v1.XmlPullParserFactory
	at java.net.URLClassLoader$1.run(URLClassLoader.java:217)
	at java.security.AccessController.doPrivileged(Native Method)
	at java.net.URLClassLoader.findClass(URLClassLoader.java:205)
	at java.lang.ClassLoader.loadClass(ClassLoader.java:321)
	at org.codehaus.classworlds.RealmClassLoader.loadClassDirect(RealmClassLoader.java:195)
	at org.codehaus.classworlds.DefaultClassRealm.loadClass(DefaultClassRealm.java:255)
	at org.codehaus.classworlds.DefaultClassRealm.loadClass(DefaultClassRealm.java:274)
	at org.codehaus.classworlds.RealmClassLoader.loadClass(RealmClassLoader.java:214)
	at java.lang.ClassLoader.loadClass(ClassLoader.java:266)
	... 27 more
[INFO] ------------------------------------------------------------------------
[INFO] Total time: 18 seconds
[INFO] Finished at: Sat Aug 13 00:52:25 UTC 2011
[INFO] Final Memory: 31M/74M
[INFO] ------------------------------------------------------------------------
---------------------------------------------

To subscribe to this information via syndicated feeds:
- RSS: http://vmgump.apache.org/gump/public/portals-pluto-trunk/portals-pluto-trunk-test/rss.xml
- Atom: http://vmgump.apache.org/gump/public/portals-pluto-trunk/portals-pluto-trunk-test/atom.xml

============================== Gump Tracking Only ===
Produced by Apache Gump(TM) version 2.3.
Gump Run 05001812082011, vmgump.apache.org:vmgump:05001812082011
Gump E-mail Identifier (unique within run) #5.


--
Apache Gump
http://gump.apache.org/ [Instance: vmgump]

---------------------------------------------------------------------
To unsubscribe, e-mail: general-unsubscribe@gump.apache.org
For additional commands, e-mail: general-help@gump.apache.org


Mime
View raw message