gump-general mailing list archives

Site index · List index
Message view « Date » · « Thread »
Top « Date » · « Thread »
From g...@vmgump.apache.org
Subject BATCH: All dressed up, with nowhere to go...
Date Sat, 23 Jul 2011 13:42:08 GMT
Dear Gumpmeisters,
            
The following 40 notifys should have been sent

*********************************************************** G U M P
[GUMP@vmgump]: Project nant (in module nant) failed
[GUMP@vmgump]: Project expat-configure (in module expat) failed
[GUMP@vmgump]: Module junit success, but with warnings.
[GUMP@vmgump]: Project lucene-java-test (in module lucene-java) failed
[GUMP@vmgump]: Project jmock2-test (in module jmock2) failed
[GUMP@vmgump]: Project lucene-java-analyzers (in module lucene-java) failed
[GUMP@vmgump]: Project santuario-tests (in module santuario) failed
[GUMP@vmgump]: Project cocoon-pipeline (in module cocoon3) failed
[GUMP@vmgump]: Project pdfbox-lucene (in module pdfbox) failed
[GUMP@vmgump]: Project cocoon-monitoring (in module cocoon3) failed
[GUMP@vmgump]: Project castor-reactor (in module castor) failed
[GUMP@vmgump]: Project cocoon-sax (in module cocoon3) failed
[GUMP@vmgump]: Project httpcomponents-client (in module httpcomponents) failed
[GUMP@vmgump]: Project jtidy-svn (in module jtidy) failed
[GUMP@vmgump]: Module opensaml-xmltooling failed
[GUMP@vmgump]: Project opensaml-xmltooling (in module opensaml-xmltooling) failed
[GUMP@vmgump]: Project camel-spring-test (in module camel) failed
[GUMP@vmgump]: Project commons-jci-reactor (in module apache-commons) failed
[GUMP@vmgump]: Module opensaml-openws failed
[GUMP@vmgump]: Project apache-standard-mailets-test (in module apache-mailet) failed
[GUMP@vmgump]: Project camel-test (in module camel) failed
[GUMP@vmgump]: Project velocity-tools-generic (in module velocity-tools) failed
[GUMP@vmgump]: Project htmlunit (in module htmlunit) failed
[GUMP@vmgump]: Module opensaml failed
[GUMP@vmgump]: Project cocoon22-blocks-modules (in module cocoon) failed
[GUMP@vmgump]: Project james-jsieve (in module james-jsieve) failed
[GUMP@vmgump]: Project commons-jelly-tags-ant-test (in module commons-jelly) failed
[GUMP@vmgump]: Project cocoon22-reactor (in module cocoon) failed
[GUMP@vmgump]: Project ws-commons-axiom (in module ws-axis2-commons) failed
[GUMP@vmgump]: Project ws-axis2 (in module ws-axis2) failed
[GUMP@vmgump]: Project openjpa-kernel (in module openjpa) failed
[GUMP@vmgump]: Project tapestry (in module tapestry) failed
[GUMP@vmgump]: Project cocoon3-reactor (in module cocoon3) failed
[GUMP@vmgump]: Project portals-bridges-script-test (in module portals-bridges) failed
[GUMP@vmgump]: Project portals-pluto-trunk-test (in module portals-pluto-trunk) failed
[GUMP@vmgump]: Project james-mailbox (in module james-mailbox) failed
[GUMP@vmgump]: Project apacheds-protocol-changepw (in module apacheds) failed
[GUMP@vmgump]: Project apacheds-protocol-ldap (in module apacheds) failed
[GUMP@vmgump]: Project activemq-jaas-test (in module activemq) failed
[GUMP@vmgump]: Project james-server (in module james-server) failed
*********************************************************** G U M P
[GUMP@vmgump]: Project nant (in module nant) failed
To whom it may engage...
        
This is an automated request, but not an unsolicited one. For 
more information please visit http://gump.apache.org/nagged.html, 
and/or contact the folk at general@gump.apache.org.

Project nant has an issue affecting its community integration.
This issue affects 1 projects,
 and has been outstanding for 110 runs.
The current state of this project is 'Failed', with reason 'Build Failed'.
For reference only, the following projects are affected by this:
    - nant :  NAnt is a free .NET build tool. In theory it is kind of like...


Full details are available at:
    http://vmgump.apache.org/gump/public/nant/nant/index.html

That said, some information snippets are provided here.

The following annotations (debug/informational/warning/error messages) were provided:
 -INFO- Failed with reason build failed



The following work was performed:
http://vmgump.apache.org/gump/public/nant/nant/gump_work/build_nant_nant.html
Work Name: build_nant_nant (Type: Build)
Work ended in a state of : Failed
Elapsed: 
Command Line: make 
[Working Directory: /srv/gump/public/workspace/nant]
---------------------------------------------
mkdir -p bootstrap
cp -R lib/ bootstrap/lib
# Mono loads log4net before privatebinpath is set-up, so we need this in the same directory
# as NAnt.exe
cp lib/common/neutral/log4net.dll bootstrap
cp src/NAnt.Console/App.config bootstrap/NAnt.exe.config
mcs  -target:exe -define:MONO -out:bootstrap/NAnt.exe -r:bootstrap/log4net.dll \
		-r:System.Configuration.dll -recurse:src/NAnt.Console/*.cs src/CommonAssemblyInfo.cs
error CS0006: cannot find metadata file `System.Configuration.dll'
Compilation failed: 1 error(s), 0 warnings
make: *** [bootstrap/NAnt.exe] Error 1
---------------------------------------------

To subscribe to this information via syndicated feeds:
- RSS: http://vmgump.apache.org/gump/public/nant/nant/rss.xml
- Atom: http://vmgump.apache.org/gump/public/nant/nant/atom.xml

============================== Gump Tracking Only ===
Produced by Apache Gump(TM) version 2.3.
Gump Run 07000623072011, vmgump.apache.org:vmgump:07000623072011
Gump E-mail Identifier (unique within run) #1.

*********************************************************** G U M P
[GUMP@vmgump]: Project expat-configure (in module expat) failed
To whom it may engage...
        
This is an automated request, but not an unsolicited one. For 
more information please visit http://gump.apache.org/nagged.html, 
and/or contact the folk at general@gump.apache.org.

Project expat-configure has an issue affecting its community integration.
This issue affects 22 projects,
 and has been outstanding for 595 runs.
The current state of this project is 'Failed', with reason 'Build Failed'.
For reference only, the following projects are affected by this:
    - apache-httpd-buildconf :  Apache HTTP Server
    - apache-httpd-configure :  Apache HTTP Server
    - apache-httpd-make :  Apache HTTP Server
    - apache-httpd-make-install :  Apache HTTP Server
    - apr-configure :  Apache Portable Runtime
    - apr-iconv-buildconf :  Apache Portable Runtime
    - apr-iconv-configure :  Apache Portable Runtime
    - apr-iconv-make :  Apache Portable Runtime
    - apr-make :  Apache Portable Runtime
    - apr-make-install :  Apache Portable Runtime
    - expat :  The Expat XML Parser
    - expat-configure :  The Expat XML Parser
    - expat-make :  The Expat XML Parser
    - jakarta-tomcat-jk-native :  Connectors to various web servers
    - jakarta-tomcat-jk-native-buildconf :  Connectors to various web servers
    - jakarta-tomcat-jk-native-configure :  Connectors to various web servers
    - logging-log4cxx-ant :  Apache log4cxx
    - logging-log4cxx-ant-no_wchar_t :  Apache log4cxx
    - logging-log4cxx-ant-static :  Apache log4cxx
    - logging-log4cxx-configure :  Apache log4cxx
    - logging-log4cxx-make :  Apache log4cxx
    - logging-log4cxx-make-install :  Apache log4cxx


Full details are available at:
    http://vmgump.apache.org/gump/public/expat/expat-configure/index.html

That said, some information snippets are provided here.

The following annotations (debug/informational/warning/error messages) were provided:
 -INFO- Failed with reason build failed



The following work was performed:
http://vmgump.apache.org/gump/public/expat/expat-configure/gump_work/buildscript_expat_expat-configure.html
Work Name: buildscript_expat_expat-configure (Type: Build)
Work ended in a state of : Failed
Elapsed: 1 sec
Command Line: /srv/gump/public/workspace/expat/configure --prefix=/srv/gump/public/workspace/expat/dest-23072011 
[Working Directory: /srv/gump/public/workspace/expat]
---------------------------------------------
/srv/gump/public/workspace/expat/configure: line 3336: AC_LIBTOOL_WIN32_DLL: command not found
/srv/gump/public/workspace/expat/configure: line 3343: LTOPTIONS_VERSION: command not found
/srv/gump/public/workspace/expat/configure: line 3344: LTSUGAR_VERSION: command not found
/srv/gump/public/workspace/expat/configure: line 3345: LTVERSION_VERSION: command not found
/srv/gump/public/workspace/expat/configure: line 3346: LTOBSOLETE_VERSION: command not found
checking build system type... x86_64-unknown-linux-gnu
checking host system type... x86_64-unknown-linux-gnu
checking for gcc... gcc
checking whether the C compiler works... yes
checking for C compiler default output file name... a.out
checking for suffix of executables... 
checking whether we are cross compiling... no
checking for suffix of object files... o
checking whether we are using the GNU C compiler... yes
checking whether gcc accepts -g... yes
checking for gcc option to accept ISO C89... none needed
checking for a sed that does not truncate output... /bin/sed
/srv/gump/public/workspace/expat/configure: line 4283: syntax error near unexpected token `lt_decl_varnames,'
/srv/gump/public/workspace/expat/configure: line 4283: `lt_if_append_uniq(lt_decl_varnames, SED, , ,'
---------------------------------------------

To subscribe to this information via syndicated feeds:
- RSS: http://vmgump.apache.org/gump/public/expat/expat-configure/rss.xml
- Atom: http://vmgump.apache.org/gump/public/expat/expat-configure/atom.xml

============================== Gump Tracking Only ===
Produced by Apache Gump(TM) version 2.3.
Gump Run 07000623072011, vmgump.apache.org:vmgump:07000623072011
Gump E-mail Identifier (unique within run) #2.

*********************************************************** G U M P
[GUMP@vmgump]: Module junit success, but with warnings.
To whom it may engage...
        
This is an automated request, but not an unsolicited one. For 
more information please visit http://gump.apache.org/nagged.html, 
and/or contact the folk at general@gump.apache.org.

Module junit contains errors.
The current state of this module is 'Success'.

Full details are available at:
    http://vmgump.apache.org/gump/public/junit/index.html

That said, some information snippets are provided here.

The following annotations (debug/informational/warning/error messages) were provided:
 -ERROR- *** Failed to update from source control.Stale contents ***



The following work was performed:
http://vmgump.apache.org/gump/public/junit/gump_work/update_junit.html
Work Name: update_junit (Type: Update)
Work ended in a state of : Failed
Elapsed: 1 sec
Command Line: git pull --quiet 
[Working Directory: /srv/gump/public/workspace/cvs/junit]
---------------------------------------------

*** Please tell me who you are.

Run

  git config --global user.email "you@example.com"
  git config --global user.name "Your Name"

to set your account's default identity.
Omit --global to set the identity only in this repository.

fatal: empty ident  <gump@vmgump.apache.org
> not allowed
---------------------------------------------

To subscribe to this information via syndicated feeds:
- RSS: http://vmgump.apache.org/gump/public/junit/rss.xml
- Atom: http://vmgump.apache.org/gump/public/junit/atom.xml

============================== Gump Tracking Only ===
Produced by Apache Gump(TM) version 2.3.
Gump Run 07000623072011, vmgump.apache.org:vmgump:07000623072011
Gump E-mail Identifier (unique within run) #3.

*********************************************************** G U M P
[GUMP@vmgump]: Project lucene-java-test (in module lucene-java) failed
To whom it may engage...
        
This is an automated request, but not an unsolicited one. For 
more information please visit http://gump.apache.org/nagged.html, 
and/or contact the folk at general@gump.apache.org.

Project lucene-java-test has an issue affecting its community integration.
This issue affects 1 projects,
 and has been outstanding for 133 runs.
The current state of this project is 'Failed', with reason 'Build Failed'.
For reference only, the following projects are affected by this:
    - lucene-java-test :  Java Based Search Engine


Full details are available at:
    http://vmgump.apache.org/gump/public/lucene-java/lucene-java-test/index.html

That said, some information snippets are provided here.

The following annotations (debug/informational/warning/error messages) were provided:
 -DEBUG- Dependency on javacc exists, no need to add for property javacc.home.
 -INFO- Failed with reason build failed



The following work was performed:
http://vmgump.apache.org/gump/public/lucene-java/lucene-java-test/gump_work/build_lucene-java_lucene-java-test.html
Work Name: build_lucene-java_lucene-java-test (Type: Build)
Work ended in a state of : Failed
Elapsed: 2 mins 19 secs
Command Line: /usr/lib/jvm/java-6-openjdk/bin/java -Djava.awt.headless=true -Dbuild.sysclasspath=only -Xbootclasspath/p:/srv/gump/public/workspace/xml-commons/java/external/build/xml-apis.jar:/srv/gump/public/workspace/xml-xerces2/build/xercesImpl.jar org.apache.tools.ant.Main -Dgump.merge=/srv/gump/public/gump/work/merge.xml -Dversion=23072011 -Djavacc.home=/srv/gump/packages/javacc-3.1 test-core 
[Working Directory: /srv/gump/public/workspace/lucene-java/lucene]
CLASSPATH: /usr/lib/jvm/java-6-openjdk/lib/tools.jar:/srv/gump/public/workspace/lucene-java/lucene/build/classes/test:/srv/gump/public/workspace/lucene-java/lucene/build/classes/tools:/srv/gump/public/workspace/ant/dist/lib/ant.jar:/srv/gump/public/workspace/ant/dist/lib/ant-launcher.jar:/srv/gump/public/workspace/ant/dist/lib/ant-jmf.jar:/srv/gump/public/workspace/ant/dist/lib/ant-junit.jar:/srv/gump/public/workspace/ant/dist/lib/ant-swing.jar:/srv/gump/public/workspace/ant/dist/lib/ant-apache-resolver.jar:/srv/gump/public/workspace/ant/dist/lib/ant-apache-xalan2.jar:/srv/gump/packages/junit3.8.1/junit.jar:/srv/gump/public/workspace/xml-commons/java/build/resolver.jar:/srv/gump/packages/javacc-3.1/bin/lib/javacc.jar:/srv/gump/public/workspace/junit/dist/junit-23072011.jar:/srv/gump/public/workspace/junit/dist/junit-dep-23072011.jar:/srv/gump/public/workspace/lucene-java/lucene/build/lucene-core-23072011.jar:/srv/gump/public/workspace/lucene-java/lucene/build/lucene-test-fram
 ework-23072011.jar:/srv/gump/public/workspace/xml-commons/java/external/build/xml-apis-ext.jar
---------------------------------------------
    [junit] 
    [junit] Testcase: testEmptySingletonNFAConcatenate(org.apache.lucene.util.automaton.TestBasicOperations):	FAILED
    [junit] ensure your setUp() calls super.setUp()!!!
    [junit] junit.framework.AssertionFailedError: ensure your setUp() calls super.setUp()!!!
    [junit] 	at org.apache.lucene.util.LuceneTestCase$1.starting(LuceneTestCase.java:537)
    [junit] 	at org.apache.lucene.util.LuceneTestCase$LuceneTestCaseRunner.runChild(LuceneTestCase.java:1486)
    [junit] 	at org.apache.lucene.util.LuceneTestCase$LuceneTestCaseRunner.runChild(LuceneTestCase.java:1404)
    [junit] 
    [junit] 
    [junit] Testcase: testSingleton(org.apache.lucene.util.automaton.TestBasicOperations):	FAILED
    [junit] ensure your setUp() calls super.setUp()!!!
    [junit] junit.framework.AssertionFailedError: ensure your setUp() calls super.setUp()!!!
    [junit] 	at org.apache.lucene.util.LuceneTestCase$1.starting(LuceneTestCase.java:537)
    [junit] 	at org.apache.lucene.util.LuceneTestCase$LuceneTestCaseRunner.runChild(LuceneTestCase.java:1486)
    [junit] 	at org.apache.lucene.util.LuceneTestCase$LuceneTestCaseRunner.runChild(LuceneTestCase.java:1404)
    [junit] 
    [junit] 
    [junit] Testcase: testGetRandomAcceptedString(org.apache.lucene.util.automaton.TestBasicOperations):	FAILED
    [junit] ensure your setUp() calls super.setUp()!!!
    [junit] junit.framework.AssertionFailedError: ensure your setUp() calls super.setUp()!!!
    [junit] 	at org.apache.lucene.util.LuceneTestCase$1.starting(LuceneTestCase.java:537)
    [junit] 	at org.apache.lucene.util.LuceneTestCase$LuceneTestCaseRunner.runChild(LuceneTestCase.java:1486)
    [junit] 	at org.apache.lucene.util.LuceneTestCase$LuceneTestCaseRunner.runChild(LuceneTestCase.java:1404)
    [junit] 
    [junit] 
    [junit] Tests run: 7, Failures: 7, Errors: 0, Time elapsed: 0.041 sec
    [junit] 
    [junit] TEST org.apache.lucene.util.automaton.TestBasicOperations FAILED
    [junit] Tests FAILED

BUILD FAILED
/srv/gump/public/workspace/lucene-java/lucene/common-build.xml:604: 
The following error occurred while executing this line:
/srv/gump/public/workspace/lucene-java/lucene/common-build.xml:588: Tests failed!
The following error occurred while executing this line:
/srv/gump/public/workspace/lucene-java/lucene/common-build.xml:588: Tests failed!
The following error occurred while executing this line:
/srv/gump/public/workspace/lucene-java/lucene/common-build.xml:588: Tests failed!
The following error occurred while executing this line:
/srv/gump/public/workspace/lucene-java/lucene/common-build.xml:588: Tests failed!
The following error occurred while executing this line:
/srv/gump/public/workspace/lucene-java/lucene/common-build.xml:588: Tests failed!
The following error occurred while executing this line:
/srv/gump/public/workspace/lucene-java/lucene/common-build.xml:588: Tests failed!
The following error occurred while executing this line:
/srv/gump/public/workspace/lucene-java/lucene/common-build.xml:588: Tests failed!
The following error occurred while executing this line:
/srv/gump/public/workspace/lucene-java/lucene/common-build.xml:588: Tests failed!

Total time: 2 minutes 19 seconds
---------------------------------------------

To subscribe to this information via syndicated feeds:
- RSS: http://vmgump.apache.org/gump/public/lucene-java/lucene-java-test/rss.xml
- Atom: http://vmgump.apache.org/gump/public/lucene-java/lucene-java-test/atom.xml

============================== Gump Tracking Only ===
Produced by Apache Gump(TM) version 2.3.
Gump Run 07000623072011, vmgump.apache.org:vmgump:07000623072011
Gump E-mail Identifier (unique within run) #5.

*********************************************************** G U M P
[GUMP@vmgump]: Project jmock2-test (in module jmock2) failed
To whom it may engage...
        
This is an automated request, but not an unsolicited one. For 
more information please visit http://gump.apache.org/nagged.html, 
and/or contact the folk at general@gump.apache.org.

Project jmock2-test has an issue affecting its community integration.
This issue affects 1 projects.
The current state of this project is 'Failed', with reason 'Build Failed'.
For reference only, the following projects are affected by this:
    - jmock2-test :  jMock is a library for testing Java code using mock objects.


Full details are available at:
    http://vmgump.apache.org/gump/public/jmock2/jmock2-test/index.html

That said, some information snippets are provided here.

The following annotations (debug/informational/warning/error messages) were provided:
 -INFO- Failed with reason build failed



The following work was performed:
http://vmgump.apache.org/gump/public/jmock2/jmock2-test/gump_work/build_jmock2_jmock2-test.html
Work Name: build_jmock2_jmock2-test (Type: Build)
Work ended in a state of : Failed
Elapsed: 17 secs
Command Line: /usr/lib/jvm/java-6-openjdk/bin/java -Djava.awt.headless=true -Dbuild.sysclasspath=only -Xbootclasspath/p:/srv/gump/public/workspace/xml-xerces2/build/xercesImpl.jar:/srv/gump/public/workspace/xml-commons/java/external/build/xml-apis.jar org.apache.tools.ant.Main -Dgump.merge=/srv/gump/public/gump/work/merge.xml -Dversion=23072011 run.tests 
[Working Directory: /srv/gump/public/workspace/jmock2]
CLASSPATH: /usr/lib/jvm/java-6-openjdk/lib/tools.jar:/srv/gump/public/workspace/jmock2/build/jmock-23072011/jmock-23072011.jar:/srv/gump/public/workspace/jmock2/build/jmock-23072011/jmock-junit3-23072011.jar:/srv/gump/public/workspace/jmock2/build/jmock-23072011/jmock-junit4-23072011.jar:/srv/gump/public/workspace/jmock2/build/jmock-23072011/jmock-legacy-23072011.jar:/srv/gump/public/workspace/jmock2/build/jmock-23072011/jmock-script-23072011.jar:/srv/gump/public/workspace/jmock2/build/jmock-23072011/jmock-tests-23072011.jar:/srv/gump/public/workspace/ant/dist/lib/ant.jar:/srv/gump/public/workspace/ant/dist/lib/ant-launcher.jar:/srv/gump/public/workspace/ant/dist/lib/ant-jmf.jar:/srv/gump/public/workspace/ant/dist/lib/ant-junit.jar:/srv/gump/public/workspace/ant/dist/lib/ant-swing.jar:/srv/gump/public/workspace/ant/dist/lib/ant-apache-resolver.jar:/srv/gump/public/workspace/ant/dist/lib/ant-apache-xalan2.jar:/srv/gump/packages/bsh-2.0b4/bsh-2.0b4.jar:/srv/gump/packages/bsh-2.
 0b4/bsh-bsf-2.0b4.jar:/srv/gump/packages/bsh-2.0b4/bsh-classpath-2.0b4.jar:/srv/gump/packages/bsh-2.0b4/bsh-commands-2.0b4.jar:/srv/gump/packages/bsh-2.0b4/bsh-core-2.0b4.jar:/srv/gump/packages/bsh-2.0b4/bsh-reflect-2.0b4.jar:/srv/gump/packages/bsh-2.0b4/bsh-util-2.0b4.jar:/srv/gump/packages/cglib/cglib-nodep-2.2.jar:/srv/gump/public/workspace/hamcrest/hamcrest-java/build/hamcrest-core-23072011.jar:/srv/gump/public/workspace/hamcrest/hamcrest-java/build/hamcrest-generator-23072011.jar:/srv/gump/public/workspace/hamcrest/hamcrest-java/build/hamcrest-library-23072011.jar:/srv/gump/public/workspace/hamcrest/hamcrest-java/build/hamcrest-unit-test-23072011.jar:/srv/gump/public/workspace/junit/dist/junit-23072011.jar:/srv/gump/public/workspace/junit/dist/junit-dep-23072011.jar:/srv/gump/packages/junit3.8.1/junit.jar:/srv/gump/public/workspace/xml-commons/java/external/build/xml-apis-ext.jar:/srv/gump/public/workspace/objenesis/main/target/objenesis-1.2.jar
---------------------------------------------
    [junit] the Mockery is not thread-safe: use a Synchroniser to ensure thread safety
    [junit] the Mockery is not thread-safe: use a Synchroniser to ensure thread safety
    [junit] ------------- ---------------- ---------------
    [junit] Testsuite: org.jmock.test.acceptance.RecordingAcceptanceTests
    [junit] Tests run: 5, Failures: 0, Errors: 0, Time elapsed: 0.008 sec
    [junit] 
    [junit] Testsuite: org.jmock.test.acceptance.RedeclaredObjectMethodsAcceptanceTests
    [junit] Tests run: 3, Failures: 0, Errors: 0, Time elapsed: 0.156 sec
    [junit] 
    [junit] Testsuite: org.jmock.test.acceptance.ReturningIteratorsAcceptanceTests
    [junit] Tests run: 2, Failures: 0, Errors: 0, Time elapsed: 0.008 sec
    [junit] 
    [junit] Testsuite: org.jmock.test.acceptance.ReturningValuesAcceptanceTests
    [junit] the Mockery is not thread-safe: use a Synchroniser to ensure thread safety
    [junit] the Mockery is not thread-safe: use a Synchroniser to ensure thread safety
    [junit] Tests run: 16, Failures: 0, Errors: 0, Time elapsed: 0.062 sec
    [junit] 
    [junit] Testsuite: org.jmock.test.acceptance.SequenceAcceptanceTests
    [junit] Tests run: 7, Failures: 0, Errors: 0, Time elapsed: 0.023 sec
    [junit] 
    [junit] Testsuite: org.jmock.test.acceptance.ThrowingExceptionsAcceptanceTests
    [junit] Tests run: 4, Failures: 0, Errors: 0, Time elapsed: 0.005 sec
    [junit] 
    [junit] Testsuite: org.jmock.test.acceptance.UnorderedExpectationsAcceptanceTests
    [junit] Tests run: 5, Failures: 0, Errors: 0, Time elapsed: 0.006 sec
    [junit] 
    [junit] Testsuite: org.jmock.test.acceptance.WarnAboutMultipleThreadsAcceptanceTests
    [junit] the Mockery is not thread-safe: use a Synchroniser to ensure thread safety
    [junit] Tests run: 1, Failures: 0, Errors: 1, Time elapsed: 0.023 sec
    [junit] 
    [junit] ------------- Standard Error -----------------
    [junit] the Mockery is not thread-safe: use a Synchroniser to ensure thread safety
    [junit] ------------- ---------------- ---------------
    [junit] Testcase: testKillsThreadsThatTryToCallMockeryThatIsNotThreadSafe(org.jmock.test.acceptance.WarnAboutMultipleThreadsAcceptanceTests):	Caused an ERROR
    [junit] 
    [junit] Expected: <1>
    [junit]      got: <0>
    [junit] 
    [junit] java.lang.AssertionError: 
    [junit] Expected: <1>
    [junit]      got: <0>
    [junit] 
    [junit] 	at org.jmock.test.acceptance.WarnAboutMultipleThreadsAcceptanceTests.testKillsThreadsThatTryToCallMockeryThatIsNotThreadSafe(WarnAboutMultipleThreadsAcceptanceTests.java:49)
    [junit] 
    [junit] 

BUILD FAILED
/srv/gump/public/workspace/jmock2/build.xml:225: Tests failed

Total time: 16 seconds
---------------------------------------------

To subscribe to this information via syndicated feeds:
- RSS: http://vmgump.apache.org/gump/public/jmock2/jmock2-test/rss.xml
- Atom: http://vmgump.apache.org/gump/public/jmock2/jmock2-test/atom.xml

============================== Gump Tracking Only ===
Produced by Apache Gump(TM) version 2.3.
Gump Run 07000623072011, vmgump.apache.org:vmgump:07000623072011
Gump E-mail Identifier (unique within run) #8.

*********************************************************** G U M P
[GUMP@vmgump]: Project lucene-java-analyzers (in module lucene-java) failed
To whom it may engage...
        
This is an automated request, but not an unsolicited one. For 
more information please visit http://gump.apache.org/nagged.html, 
and/or contact the folk at general@gump.apache.org.

Project lucene-java-analyzers has an issue affecting its community integration.
This issue affects 6 projects,
 and has been outstanding for 44 runs.
The current state of this project is 'Failed', with reason 'Build Failed'.
For reference only, the following projects are affected by this:
    - lucene-java-analyzers :  Java Based Search Engine
    - lucene-java-analyzers-test :  Java Based Search Engine
    - lucene-java-contrib :  Java Based Search Engine
    - lucene-java-contrib-test :  Java Based Search Engine
    - solr :  Java Based Search Engine
    - solr-test :  Java Based Search Engine


Full details are available at:
    http://vmgump.apache.org/gump/public/lucene-java/lucene-java-analyzers/index.html

That said, some information snippets are provided here.

The following annotations (debug/informational/warning/error messages) were provided:
 -INFO- Failed with reason build failed
 -INFO- Failed to extract fallback artifacts from Gump Repository



The following work was performed:
http://vmgump.apache.org/gump/public/lucene-java/lucene-java-analyzers/gump_work/build_lucene-java_lucene-java-analyzers.html
Work Name: build_lucene-java_lucene-java-analyzers (Type: Build)
Work ended in a state of : Failed
Elapsed: 25 secs
Command Line: /usr/lib/jvm/java-6-openjdk/bin/java -Djava.awt.headless=true -Dbuild.sysclasspath=only -Xbootclasspath/p:/srv/gump/public/workspace/xml-commons/java/external/build/xml-apis.jar:/srv/gump/public/workspace/xml-xerces2/build/xercesImpl.jar org.apache.tools.ant.Main -Dgump.merge=/srv/gump/public/gump/work/merge.xml -Dversion=23072011 
[Working Directory: /srv/gump/public/workspace/lucene-java/modules/analysis]
CLASSPATH: /usr/lib/jvm/java-6-openjdk/lib/tools.jar:/srv/gump/public/workspace/lucene-java/modules/analysis/build/common/classes/java:/srv/gump/public/workspace/ant/dist/lib/ant.jar:/srv/gump/public/workspace/ant/dist/lib/ant-launcher.jar:/srv/gump/public/workspace/ant/dist/lib/ant-jmf.jar:/srv/gump/public/workspace/ant/dist/lib/ant-junit.jar:/srv/gump/public/workspace/ant/dist/lib/ant-swing.jar:/srv/gump/public/workspace/ant/dist/lib/ant-apache-resolver.jar:/srv/gump/public/workspace/ant/dist/lib/ant-apache-xalan2.jar:/srv/gump/packages/junit3.8.1/junit.jar:/srv/gump/public/workspace/xml-commons/java/build/resolver.jar:/srv/gump/public/workspace/apache-commons/codec/dist/commons-codec-23072011.jar:/srv/gump/public/workspace/icu4j/main/classes/core/out/lib/icu4j-core.jar:/srv/gump/public/workspace/icu4j/main/classes/collate/out/lib/icu4j-collate.jar:/srv/gump/public/workspace/icu4j/main/classes/currdata/out/lib/icu4j-currdata.jar:/srv/gump/public/workspace/icu4j/main/classes
 /langdata/out/lib/icu4j-langdata.jar:/srv/gump/public/workspace/icu4j/main/classes/regiondata/out/lib/icu4j-regiondata.jar:/srv/gump/public/workspace/icu4j/main/classes/translit/out/lib/icu4j-translit.jar:/srv/gump/public/workspace/icu4j/main/classes/charset/out/lib/icu4j-charset.jar:/srv/gump/public/workspace/icu4j/main/classes/localespi/out/lib/icu4j-localespi.jar:/srv/gump/public/workspace/junit/dist/junit-23072011.jar:/srv/gump/public/workspace/junit/dist/junit-dep-23072011.jar:/srv/gump/public/workspace/lucene-java/lucene/build/lucene-core-23072011.jar:/srv/gump/public/workspace/lucene-java/lucene/build/lucene-test-framework-23072011.jar:/srv/gump/public/workspace/xml-commons/java/external/build/xml-apis-ext.jar
---------------------------------------------
    [javac]                 ^
    [javac] /srv/gump/public/workspace/lucene-java/modules/analysis/morfologik/src/java/org/apache/lucene/analysis/morfologik/MorfologikAnalyzer.java:49: cannot find symbol
    [javac] symbol  : class DICTIONARY
    [javac] location: class org.apache.lucene.analysis.morfologik.MorfologikAnalyzer
    [javac]   public MorfologikAnalyzer(final Version vers, final DICTIONARY dict) {
    [javac]                                                       ^
    [javac] /srv/gump/public/workspace/lucene-java/modules/analysis/morfologik/src/java/org/apache/lucene/analysis/morfologik/MorfologikFilter.java:25: package morfologik.stemming does not exist
    [javac] import morfologik.stemming.*;
    [javac] ^
    [javac] /srv/gump/public/workspace/lucene-java/modules/analysis/morfologik/src/java/org/apache/lucene/analysis/morfologik/MorfologikFilter.java:26: package morfologik.stemming.PolishStemmer does not exist
    [javac] import morfologik.stemming.PolishStemmer.DICTIONARY;
    [javac]                                         ^
    [javac] /srv/gump/public/workspace/lucene-java/modules/analysis/morfologik/src/java/org/apache/lucene/analysis/morfologik/MorfologikFilter.java:55: cannot find symbol
    [javac] symbol  : class IStemmer
    [javac] location: class org.apache.lucene.analysis.morfologik.MorfologikFilter
    [javac]   private final IStemmer stemmer;
    [javac]                 ^
    [javac] /srv/gump/public/workspace/lucene-java/modules/analysis/morfologik/src/java/org/apache/lucene/analysis/morfologik/MorfologikFilter.java:57: cannot find symbol
    [javac] symbol  : class WordData
    [javac] location: class org.apache.lucene.analysis.morfologik.MorfologikFilter
    [javac]   private List<WordData> lemmaList;
    [javac]                ^
    [javac] /srv/gump/public/workspace/lucene-java/modules/analysis/morfologik/src/java/org/apache/lucene/analysis/morfologik/MorfologikFilter.java:67: cannot find symbol
    [javac] symbol  : class DICTIONARY
    [javac] location: class org.apache.lucene.analysis.morfologik.MorfologikFilter
    [javac]   public MorfologikFilter(final TokenStream in, final DICTIONARY dict, final Version version) {
    [javac]                                                       ^
    [javac] /srv/gump/public/workspace/lucene-java/modules/analysis/morfologik/src/java/org/apache/lucene/analysis/morfologik/MorfologikAnalyzer.java:60: cannot find symbol
    [javac] symbol  : variable DICTIONARY
    [javac] location: class org.apache.lucene.analysis.morfologik.MorfologikAnalyzer
    [javac]     this(vers, DICTIONARY.MORFOLOGIK);
    [javac]                ^
    [javac] /srv/gump/public/workspace/lucene-java/modules/analysis/morfologik/src/java/org/apache/lucene/analysis/morfologik/MorfologikFilter.java:70: cannot find symbol
    [javac] symbol  : class PolishStemmer
    [javac] location: class org.apache.lucene.analysis.morfologik.MorfologikFilter
    [javac]     this.stemmer = new PolishStemmer(dict);
    [javac]                        ^
    [javac] /srv/gump/public/workspace/lucene-java/modules/analysis/morfologik/src/java/org/apache/lucene/analysis/morfologik/MorfologikFilter.java:76: cannot find symbol
    [javac] symbol  : class WordData
    [javac] location: class org.apache.lucene.analysis.morfologik.MorfologikFilter
    [javac]     final WordData lemma = lemmaList.get(lemmaListIndex++);
    [javac]           ^
    [javac] 11 errors

BUILD FAILED
/srv/gump/public/workspace/lucene-java/modules/analysis/build.xml:52: The following error occurred while executing this line:
/srv/gump/public/workspace/lucene-java/lucene/common-build.xml:313: The following error occurred while executing this line:
/srv/gump/public/workspace/lucene-java/lucene/common-build.xml:761: Compile failed; see the compiler error output for details.

Total time: 24 seconds
---------------------------------------------

To subscribe to this information via syndicated feeds:
- RSS: http://vmgump.apache.org/gump/public/lucene-java/lucene-java-analyzers/rss.xml
- Atom: http://vmgump.apache.org/gump/public/lucene-java/lucene-java-analyzers/atom.xml

============================== Gump Tracking Only ===
Produced by Apache Gump(TM) version 2.3.
Gump Run 07000623072011, vmgump.apache.org:vmgump:07000623072011
Gump E-mail Identifier (unique within run) #9.

*********************************************************** G U M P
[GUMP@vmgump]: Project santuario-tests (in module santuario) failed
To whom it may engage...
        
This is an automated request, but not an unsolicited one. For 
more information please visit http://gump.apache.org/nagged.html, 
and/or contact the folk at general@gump.apache.org.

Project santuario-tests has an issue affecting its community integration.
This issue affects 1 projects.
The current state of this project is 'Failed', with reason 'Build Failed'.
For reference only, the following projects are affected by this:
    - santuario-tests :  XML-Signature Syntax and Processing


Full details are available at:
    http://vmgump.apache.org/gump/public/santuario/santuario-tests/index.html

That said, some information snippets are provided here.

The following annotations (debug/informational/warning/error messages) were provided:
 -DEBUG- Dependency on jce exists, no need to add for property lib.jce.
 -DEBUG- Dependency on junit exists, no need to add for property lib.junit.
 -INFO- Failed with reason build failed



The following work was performed:
http://vmgump.apache.org/gump/public/santuario/santuario-tests/gump_work/build_santuario_santuario-tests.html
Work Name: build_santuario_santuario-tests (Type: Build)
Work ended in a state of : Failed
Elapsed: 1 min 39 secs
Command Line: /usr/lib/jvm/java-6-openjdk/bin/java -Djava.awt.headless=true -Dbuild.sysclasspath=only -Dant.build.clonevm=true -Xbootclasspath/p:/srv/gump/public/workspace/xml-commons/java/external/build/xml-apis.jar:/srv/gump/public/workspace/xml-xerces2/build/xercesImpl.jar:/srv/gump/public/workspace/xml-xalan/build/xalan-unbundled.jar:/srv/gump/public/workspace/xml-xalan/build/serializer.jar org.apache.tools.ant.Main -Dgump.merge=/srv/gump/public/gump/work/merge.xml -Djce.download.sha1=c1f0e975e8c8e0a0105787b249a50615b485d109 -Dlib.jce=/srv/gump/packages/jce/jce-jdk13-116.jar -Dlib.junit=/srv/gump/public/workspace/junit/dist/junit-23072011.jar -Djce.download.md5=85c64cd754719a4bc8da7e9aa0e113fd test 
[Working Directory: /srv/gump/public/workspace/santuario]
CLASSPATH: /usr/lib/jvm/java-6-openjdk/lib/tools.jar:/srv/gump/public/workspace/santuario/build/test:/srv/gump/public/workspace/santuario:/srv/gump/public/workspace/santuario/build/xmlsec-23072011.jar:/srv/gump/public/workspace/ant/dist/lib/ant.jar:/srv/gump/public/workspace/ant/dist/lib/ant-launcher.jar:/srv/gump/public/workspace/ant/dist/lib/ant-jmf.jar:/srv/gump/public/workspace/ant/dist/lib/ant-junit.jar:/srv/gump/public/workspace/ant/dist/lib/ant-swing.jar:/srv/gump/public/workspace/ant/dist/lib/ant-apache-resolver.jar:/srv/gump/public/workspace/ant/dist/lib/ant-apache-xalan2.jar:/srv/gump/public/workspace/xml-commons/java/external/build/xml-apis-ext.jar:/srv/gump/packages/jce/jce-jdk13-116.jar:/srv/gump/public/workspace/apache-commons/logging/target/commons-logging-23072011.jar:/srv/gump/public/workspace/apache-commons/logging/target/commons-logging-api-23072011.jar:/srv/gump/public/workspace/junit/dist/junit-23072011.jar:/srv/gump/public/workspace/junit/dist/junit-dep-
 23072011.jar
---------------------------------------------
    [junit] Testsuite: org.apache.xml.security.test.utils.IdResolverTest
    [junit] Tests run: 3, Failures: 0, Errors: 0, Time elapsed: 0.109 sec
    [junit] Tests run: 3, Failures: 0, Errors: 0, Time elapsed: 0.109 sec
    [junit] 
    [junit] Testcase: testIdSoap took 0.045 sec
    [junit] Testcase: testIdWithOtherIdSoap took 0.004 sec
    [junit] Testcase: testANoId took 0.003 sec
    [junit] Running org.apache.xml.security.test.utils.OldApiTest
    [junit] Testsuite: org.apache.xml.security.test.utils.OldApiTest
    [junit] Tests run: 3, Failures: 0, Errors: 0, Time elapsed: 0.116 sec
    [junit] Tests run: 3, Failures: 0, Errors: 0, Time elapsed: 0.116 sec
    [junit] 
    [junit] Testcase: testOldResourceResolverSpi took 0.042 sec
    [junit] Testcase: testOldKeyResolverSpi took 0.01 sec
    [junit] Testcase: testOldKeyResolverSpiInKeyInfo took 0.007 sec
    [junit] Running org.apache.xml.security.test.utils.resolver.ResolverDirectHTTPTest
    [junit] Testsuite: org.apache.xml.security.test.utils.resolver.ResolverDirectHTTPTest
    [junit] Tests run: 1, Failures: 0, Errors: 0, Time elapsed: 0.16 sec
    [junit] Tests run: 1, Failures: 0, Errors: 0, Time elapsed: 0.16 sec
    [junit] 
    [junit] Testcase: testBug40783 took 0.107 sec
    [junit] Running org.apache.xml.security.test.utils.resolver.ResourceResolverTest
    [junit] Testsuite: org.apache.xml.security.test.utils.resolver.ResourceResolverTest
    [junit] Tests run: 2, Failures: 0, Errors: 0, Time elapsed: 0.069 sec
    [junit] Tests run: 2, Failures: 0, Errors: 0, Time elapsed: 0.069 sec
    [junit] 
    [junit] Testcase: testCustomResolver took 0.011 sec
    [junit] Testcase: testLocalFileWithEmptyBaseURI took 0.004 sec
    [junit] Running org.apache.xml.security.test.version.VersionTest
    [junit] Testsuite: org.apache.xml.security.test.version.VersionTest
    [junit] Tests run: 2, Failures: 1, Errors: 0, Time elapsed: 0.124 sec
    [junit] Tests run: 2, Failures: 1, Errors: 0, Time elapsed: 0.124 sec
    [junit] 
    [junit] Testcase: testConvertVersion took 0.005 sec
    [junit] Testcase: testVersion took 0.063 sec
    [junit] 	FAILED
    [junit] 
    [junit] junit.framework.AssertionFailedError: 
    [junit] 	at org.apache.xml.security.test.version.VersionTest.testVersion(Unknown Source)
    [junit] 
    [junit] Test org.apache.xml.security.test.version.VersionTest FAILED
[junitreport] Processing /srv/gump/public/workspace/santuario/build/docs/xml/junit/TESTS-TestSuites.xml to /tmp/null1988316756
[junitreport] Loading stylesheet jar:file:/srv/gump/public/workspace/ant/dist/lib/ant-junit.jar!/org/apache/tools/ant/taskdefs/optional/junit/xsl/junit-frames.xsl
[junitreport] Transform time: 4952ms
[junitreport] Deleting: /tmp/null1988316756

BUILD FAILED
/srv/gump/public/workspace/santuario/build.xml:334: Unit Tests Failed

Total time: 1 minute 38 seconds
---------------------------------------------

To subscribe to this information via syndicated feeds:
- RSS: http://vmgump.apache.org/gump/public/santuario/santuario-tests/rss.xml
- Atom: http://vmgump.apache.org/gump/public/santuario/santuario-tests/atom.xml

============================== Gump Tracking Only ===
Produced by Apache Gump(TM) version 2.3.
Gump Run 07000623072011, vmgump.apache.org:vmgump:07000623072011
Gump E-mail Identifier (unique within run) #11.

*********************************************************** G U M P
[GUMP@vmgump]: Project cocoon-pipeline (in module cocoon3) failed
To whom it may engage...
        
This is an automated request, but not an unsolicited one. For 
more information please visit http://gump.apache.org/nagged.html, 
and/or contact the folk at general@gump.apache.org.

Project cocoon-pipeline has an issue affecting its community integration.
This issue affects 2 projects.
The current state of this project is 'Failed', with reason 'Build Failed'.
For reference only, the following projects are affected by this:
    - cocoon-all :  Java XML Framework
    - cocoon-pipeline :  Java XML Framework


Full details are available at:
    http://vmgump.apache.org/gump/public/cocoon3/cocoon-pipeline/index.html

That said, some information snippets are provided here.

The following annotations (debug/informational/warning/error messages) were provided:
 -DEBUG- Sole jar output [cocoon-pipeline-*[0-9T].jar] identifier set to project name
 -DEBUG- (Apache Gump generated) Apache Maven Settings in: /srv/gump/public/workspace/cocoon3/cocoon-pipeline/gump_mvn_settings.xml
 -INFO- Failed with reason build failed
 -DEBUG- Maven POM in: /srv/gump/public/workspace/cocoon3/cocoon-pipeline/pom.xml
 -DEBUG- Extracted fallback artifacts from Gump Repository



The following work was performed:
http://vmgump.apache.org/gump/public/cocoon3/cocoon-pipeline/gump_work/build_cocoon3_cocoon-pipeline.html
Work Name: build_cocoon3_cocoon-pipeline (Type: Build)
Work ended in a state of : Failed
Elapsed: 6 secs
Command Line: /opt/maven2/bin/mvn --batch-mode --settings /srv/gump/public/workspace/cocoon3/cocoon-pipeline/gump_mvn_settings.xml install 
[Working Directory: /srv/gump/public/workspace/cocoon3/cocoon-pipeline]
M2_HOME: /opt/maven2
---------------------------------------------
[INFO] Unable to find resource 'xmlunit:xmlunit:pom:1.3' in repository maven2-repository.dev.java.net (http://download.java.net/maven/2/)
Downloading: http://localhost:8192/maven2/xmlunit/xmlunit/1.3/xmlunit-1.3.pom

Downloading: http://localhost:8192/maven/2/org/apache/cocoon/util/cocoon-util/3.0.0-beta-1-SNAPSHOT/cocoon-util-3.0.0-beta-1-SNAPSHOT.jar
Downloading: http://localhost:8192/maven/2/xmlunit/xmlunit/1.3/xmlunit-1.3.jar
[INFO] Unable to find resource 'org.apache.cocoon.util:cocoon-util:jar:3.0.0-beta-1-SNAPSHOT' in repository maven2-repository.dev.java.net (http://download.java.net/maven/2/)
Downloading: http://localhost:8192/repo/m2-snapshot-repository/org/apache/cocoon/util/cocoon-util/3.0.0-beta-1-SNAPSHOT/cocoon-util-3.0.0-beta-1-SNAPSHOT.jar
[INFO] Unable to find resource 'org.apache.cocoon.util:cocoon-util:jar:3.0.0-beta-1-SNAPSHOT' in repository apache.snapshots (http://repository.apache.org/snapshots)
195K downloaded  (xmlunit-1.3.jar)
[INFO] ------------------------------------------------------------------------
[ERROR] BUILD ERROR
[INFO] ------------------------------------------------------------------------
[INFO] Failed to resolve artifact.

Missing:
----------
1) org.apache.cocoon.util:cocoon-util:jar:3.0.0-beta-1-SNAPSHOT

  Try downloading the file manually from the project website.

  Then, install it using the command: 
      mvn install:install-file -DgroupId=org.apache.cocoon.util -DartifactId=cocoon-util -Dversion=3.0.0-beta-1-SNAPSHOT -Dpackaging=jar -Dfile=/path/to/file

  Alternatively, if you host your own repository you can deploy the file there: 
      mvn deploy:deploy-file -DgroupId=org.apache.cocoon.util -DartifactId=cocoon-util -Dversion=3.0.0-beta-1-SNAPSHOT -Dpackaging=jar -Dfile=/path/to/file -Durl=[url] -DrepositoryId=[id]

  Path to dependency: 
  	1) org.apache.cocoon.pipeline:cocoon-pipeline:jar:3.0.0-beta-1-SNAPSHOT
  	2) org.apache.cocoon.util:cocoon-util:jar:3.0.0-beta-1-SNAPSHOT

----------
1 required artifact is missing.

for artifact: 
  org.apache.cocoon.pipeline:cocoon-pipeline:jar:3.0.0-beta-1-SNAPSHOT

from the specified remote repositories:
  gump-maven2-repository.dev.java.net (http://localhost:8192/maven/2),
  gump-central (http://localhost:8192/maven2),
  gump-apache.snapshots (http://localhost:8192/repo/m2-snapshot-repository)



[INFO] ------------------------------------------------------------------------
[INFO] For more information, run Maven with the -e switch
[INFO] ------------------------------------------------------------------------
[INFO] Total time: 5 seconds
[INFO] Finished at: Sat Jul 23 08:19:51 UTC 2011
[INFO] Final Memory: 12M/31M
[INFO] ------------------------------------------------------------------------
---------------------------------------------

To subscribe to this information via syndicated feeds:
- RSS: http://vmgump.apache.org/gump/public/cocoon3/cocoon-pipeline/rss.xml
- Atom: http://vmgump.apache.org/gump/public/cocoon3/cocoon-pipeline/atom.xml

============================== Gump Tracking Only ===
Produced by Apache Gump(TM) version 2.3.
Gump Run 07000623072011, vmgump.apache.org:vmgump:07000623072011
Gump E-mail Identifier (unique within run) #12.

*********************************************************** G U M P
[GUMP@vmgump]: Project pdfbox-lucene (in module pdfbox) failed
To whom it may engage...
        
This is an automated request, but not an unsolicited one. For 
more information please visit http://gump.apache.org/nagged.html, 
and/or contact the folk at general@gump.apache.org.

Project pdfbox-lucene has an issue affecting its community integration.
This issue affects 1 projects,
 and has been outstanding for 2 runs.
The current state of this project is 'Failed', with reason 'Build Failed'.
For reference only, the following projects are affected by this:
    - pdfbox-lucene :  Apache PDFBox is an open source Java PDF library for working...


Full details are available at:
    http://vmgump.apache.org/gump/public/pdfbox/pdfbox-lucene/index.html

That said, some information snippets are provided here.

The following annotations (debug/informational/warning/error messages) were provided:
 -DEBUG- Sole jar output [pdfbox-lucene-*[0-9T].jar] identifier set to project name
 -INFO- Optional dependency lucene-java-contrib prerequisite failed with reason build failed
 -DEBUG- (Apache Gump generated) Apache Maven Settings in: /srv/gump/public/workspace/pdfbox/lucene/gump_mvn_settings.xml
 -INFO- Failed with reason build failed
 -DEBUG- Maven POM in: /srv/gump/public/workspace/pdfbox/lucene/pom.xml
 -INFO- Failed to extract fallback artifacts from Gump Repository



The following work was performed:
http://vmgump.apache.org/gump/public/pdfbox/pdfbox-lucene/gump_work/build_pdfbox_pdfbox-lucene.html
Work Name: build_pdfbox_pdfbox-lucene (Type: Build)
Work ended in a state of : Failed
Elapsed: 10 secs
Command Line: /opt/maven2/bin/mvn --batch-mode --settings /srv/gump/public/workspace/pdfbox/lucene/gump_mvn_settings.xml package 
[Working Directory: /srv/gump/public/workspace/pdfbox/lucene]
M2_HOME: /opt/maven2
---------------------------------------------
[INFO] Setting property: classpath.resource.loader.class => 'org.codehaus.plexus.velocity.ContextClassLoaderResourceLoader'.
[INFO] Setting property: velocimacro.messages.on => 'false'.
[INFO] Setting property: resource.loader => 'classpath'.
[INFO] Setting property: resource.manager.logwhenfound => 'false'.
[INFO] [remote-resources:process {execution: default}]
[INFO] [resources:resources {execution: default-resources}]
[INFO] Using 'ISO-8859-1' encoding to copy filtered resources.
[INFO] skip non existing resourceDirectory /srv/gump/public/workspace/pdfbox/lucene/src/main/resources
[INFO] Copying 3 resources
[INFO] [compiler:compile {execution: default-compile}]
[INFO] Compiling 4 source files to /srv/gump/public/workspace/pdfbox/lucene/target/classes
[INFO] ------------------------------------------------------------------------
[ERROR] BUILD FAILURE
[INFO] ------------------------------------------------------------------------
[INFO] Compilation failure

/srv/gump/public/workspace/pdfbox/lucene/src/main/java/org/apache/pdfbox/lucene/IndexFiles.java:[25,42] package org.apache.lucene.analysis.standard does not exist

/srv/gump/public/workspace/pdfbox/lucene/src/main/java/org/apache/pdfbox/lucene/IndexFiles.java:[34,30] cannot find symbol
symbol  : class TermEnum
location: package org.apache.lucene.index

/srv/gump/public/workspace/pdfbox/lucene/src/main/java/org/apache/pdfbox/lucene/IndexFiles.java:[59,12] cannot find symbol
symbol  : class TermEnum
location: class org.apache.pdfbox.lucene.IndexFiles

/srv/gump/public/workspace/pdfbox/lucene/src/main/java/org/apache/pdfbox/lucene/IndexFiles.java:[120,48] cannot find symbol
symbol  : class StandardAnalyzer
location: class org.apache.pdfbox.lucene.IndexFiles

/srv/gump/public/workspace/pdfbox/lucene/src/main/java/org/apache/pdfbox/lucene/IndexFiles.java:[120,87] cannot find symbol
symbol  : variable MaxFieldLength
location: class org.apache.lucene.index.IndexWriter

/srv/gump/public/workspace/pdfbox/lucene/src/main/java/org/apache/pdfbox/lucene/IndexFiles.java:[120,21] internal error; cannot instantiate org.apache.lucene.index.IndexWriter.<init> at org.apache.lucene.index.IndexWriter to ()

/srv/gump/public/workspace/pdfbox/lucene/src/main/java/org/apache/pdfbox/lucene/IndexFiles.java:[163,32] cannot find symbol
symbol  : method open(java.lang.String)
location: class org.apache.lucene.index.IndexReader

/srv/gump/public/workspace/pdfbox/lucene/src/main/java/org/apache/pdfbox/lucene/IndexFiles.java:[164,28] terms(java.lang.String) in org.apache.lucene.index.IndexReader cannot be applied to (org.apache.lucene.index.Term)


[INFO] ------------------------------------------------------------------------
[INFO] For more information, run Maven with the -e switch
[INFO] ------------------------------------------------------------------------
[INFO] Total time: 9 seconds
[INFO] Finished at: Sat Jul 23 08:58:07 UTC 2011
[INFO] Final Memory: 22M/58M
[INFO] ------------------------------------------------------------------------
---------------------------------------------

To subscribe to this information via syndicated feeds:
- RSS: http://vmgump.apache.org/gump/public/pdfbox/pdfbox-lucene/rss.xml
- Atom: http://vmgump.apache.org/gump/public/pdfbox/pdfbox-lucene/atom.xml

============================== Gump Tracking Only ===
Produced by Apache Gump(TM) version 2.3.
Gump Run 07000623072011, vmgump.apache.org:vmgump:07000623072011
Gump E-mail Identifier (unique within run) #15.

*********************************************************** G U M P
[GUMP@vmgump]: Project cocoon-monitoring (in module cocoon3) failed
To whom it may engage...
        
This is an automated request, but not an unsolicited one. For 
more information please visit http://gump.apache.org/nagged.html, 
and/or contact the folk at general@gump.apache.org.

Project cocoon-monitoring has an issue affecting its community integration.
This issue affects 2 projects.
The current state of this project is 'Failed', with reason 'Build Failed'.
For reference only, the following projects are affected by this:
    - cocoon-monitoring :  Java XML Framework
    - cocoon-monitoring-test :  Java XML Framework


Full details are available at:
    http://vmgump.apache.org/gump/public/cocoon3/cocoon-monitoring/index.html

That said, some information snippets are provided here.

The following annotations (debug/informational/warning/error messages) were provided:
 -DEBUG- Sole jar output [cocoon-monitoring-*[0-9T].jar] identifier set to project name
 -INFO- Optional dependency cocoon-pipeline failed with reason build failed
 -DEBUG- (Apache Gump generated) Apache Maven Settings in: /srv/gump/public/workspace/cocoon3/cocoon-monitoring/gump_mvn_settings.xml
 -INFO- Failed with reason build failed
 -DEBUG- Maven POM in: /srv/gump/public/workspace/cocoon3/cocoon-monitoring/pom.xml
 -DEBUG- Extracted fallback artifacts from Gump Repository



The following work was performed:
http://vmgump.apache.org/gump/public/cocoon3/cocoon-monitoring/gump_work/build_cocoon3_cocoon-monitoring.html
Work Name: build_cocoon3_cocoon-monitoring (Type: Build)
Work ended in a state of : Failed
Elapsed: 15 secs
Command Line: /opt/maven2/bin/mvn --batch-mode -DskipTests=true --settings /srv/gump/public/workspace/cocoon3/cocoon-monitoring/gump_mvn_settings.xml install 
[Working Directory: /srv/gump/public/workspace/cocoon3/cocoon-monitoring]
M2_HOME: /opt/maven2
---------------------------------------------

Downloading: http://localhost:8192/maven/2/org/springframework/spring-expression/3.0.5.RELEASE/spring-expression-3.0.5.RELEASE.jar
[INFO] Unable to find resource 'org.springframework:spring-expression:jar:3.0.5.RELEASE' in repository maven2-repository.dev.java.net (http://download.java.net/maven/2/)
Downloading: http://localhost:8192/maven2/org/springframework/spring-expression/3.0.5.RELEASE/spring-expression-3.0.5.RELEASE.jar

Downloading: http://localhost:8192/maven/2/org/springframework/spring-web/3.0.5.RELEASE/spring-web-3.0.5.RELEASE.jar
[INFO] Unable to find resource 'org.springframework:spring-web:jar:3.0.5.RELEASE' in repository maven2-repository.dev.java.net (http://download.java.net/maven/2/)
Downloading: http://localhost:8192/maven2/org/springframework/spring-web/3.0.5.RELEASE/spring-web-3.0.5.RELEASE.jar

[INFO] ------------------------------------------------------------------------
[ERROR] BUILD ERROR
[INFO] ------------------------------------------------------------------------
[INFO] Failed to resolve artifact.

Missing:
----------
1) org.apache.cocoon.pipeline:cocoon-pipeline:jar:3.0.0-beta-1-SNAPSHOT

  Try downloading the file manually from the project website.

  Then, install it using the command: 
      mvn install:install-file -DgroupId=org.apache.cocoon.pipeline -DartifactId=cocoon-pipeline -Dversion=3.0.0-beta-1-SNAPSHOT -Dpackaging=jar -Dfile=/path/to/file

  Alternatively, if you host your own repository you can deploy the file there: 
      mvn deploy:deploy-file -DgroupId=org.apache.cocoon.pipeline -DartifactId=cocoon-pipeline -Dversion=3.0.0-beta-1-SNAPSHOT -Dpackaging=jar -Dfile=/path/to/file -Durl=[url] -DrepositoryId=[id]

  Path to dependency: 
  	1) org.apache.cocoon.monitoring:cocoon-monitoring:jar:3.0.0-beta-1-SNAPSHOT
  	2) org.apache.cocoon.pipeline:cocoon-pipeline:jar:3.0.0-beta-1-SNAPSHOT

----------
1 required artifact is missing.

for artifact: 
  org.apache.cocoon.monitoring:cocoon-monitoring:jar:3.0.0-beta-1-SNAPSHOT

from the specified remote repositories:
  gump-maven2-repository.dev.java.net (http://localhost:8192/maven/2),
  gump-central (http://localhost:8192/maven2),
  gump-apache.snapshots (http://localhost:8192/repo/m2-snapshot-repository)



[INFO] ------------------------------------------------------------------------
[INFO] For more information, run Maven with the -e switch
[INFO] ------------------------------------------------------------------------
[INFO] Total time: 15 seconds
[INFO] Finished at: Sat Jul 23 09:27:05 UTC 2011
[INFO] Final Memory: 17M/42M
[INFO] ------------------------------------------------------------------------
---------------------------------------------

To subscribe to this information via syndicated feeds:
- RSS: http://vmgump.apache.org/gump/public/cocoon3/cocoon-monitoring/rss.xml
- Atom: http://vmgump.apache.org/gump/public/cocoon3/cocoon-monitoring/atom.xml

============================== Gump Tracking Only ===
Produced by Apache Gump(TM) version 2.3.
Gump Run 07000623072011, vmgump.apache.org:vmgump:07000623072011
Gump E-mail Identifier (unique within run) #16.

*********************************************************** G U M P
[GUMP@vmgump]: Project castor-reactor (in module castor) failed
To whom it may engage...
        
This is an automated request, but not an unsolicited one. For 
more information please visit http://gump.apache.org/nagged.html, 
and/or contact the folk at general@gump.apache.org.

Project castor-reactor has an issue affecting its community integration.
This issue affects 16 projects,
 and has been outstanding for 455 runs.
The current state of this project is 'Failed', with reason 'Build Failed'.
For reference only, the following projects are affected by this:
    - castor :  Java to XML, SQL, LDAP bindings
    - castor-reactor :  Java to XML, SQL, LDAP bindings
    - castor-test :  Java to XML, SQL, LDAP bindings
    - commons-chain :  GoF "Chain of Responsibility" pattern
    - commons-fileupload :  Commons File Upload Package
    - jakarta-tomcat-4.0 :  Servlet 2.3 and JSP 1.2 Reference Implementation
    - jakarta-tomcat-catalina :  Servlet 2.4 Reference Implementation
    - jakarta-tomcat-coyote-tomcat4 :  Connectors to various web servers
    - jakarta-tomcat-jk :  Connectors to various web servers
    - portals-pluto-api-1.0 :  JSR168 Container
    - portals-pluto-container-1.0 :  JSR168 Container
    - portals-pluto-deploy-1.0 :  JSR168 Container
    - portals-pluto-descriptors-1.0 :  JSR168 Container
    - portals-pluto-portal-1.0 :  JSR168 Container
    - tomcat-catalina :  Servlet 2.3 and JSP 1.2 Reference Implementation
    - xml-xindice :  native XML database


Full details are available at:
    http://vmgump.apache.org/gump/public/castor/castor-reactor/index.html

That said, some information snippets are provided here.

The following annotations (debug/informational/warning/error messages) were provided:
 -DEBUG- (Apache Gump generated) Apache Maven Settings in: /srv/gump/public/workspace/castor/gump_mvn_settings.xml
 -INFO- Failed with reason build failed
 -DEBUG- Maven POM in: /srv/gump/public/workspace/castor/pom.xml



The following work was performed:
http://vmgump.apache.org/gump/public/castor/castor-reactor/gump_work/build_castor_castor-reactor.html
Work Name: build_castor_castor-reactor (Type: Build)
Work ended in a state of : Failed
Elapsed: 47 secs
Command Line: /opt/maven2/bin/mvn --batch-mode -DskipTests=true --settings /srv/gump/public/workspace/castor/gump_mvn_settings.xml package 
[Working Directory: /srv/gump/public/workspace/castor]
M2_HOME: /opt/maven2
---------------------------------------------
[INFO] ------------------------------------------------------------------------
[INFO] Building Castor XML - XML diff
[INFO]    task-segment: [package]
[INFO] ------------------------------------------------------------------------
[INFO] [enforcer:enforce {execution: enforce-maven}]
[debug] execute contextualize
[INFO] [resources:resources {execution: default-resources}]
[INFO] Using 'UTF-8' encoding to copy filtered resources.
[INFO] Copying 3 resources
[INFO] [compiler:compile {execution: default-compile}]
[INFO] Compiling 12 source files to /srv/gump/public/workspace/castor/diff/target/classes
[debug] execute contextualize
[INFO] [resources:testResources {execution: default-testResources}]
[INFO] Using 'UTF-8' encoding to copy filtered resources.
[INFO] skip non existing resourceDirectory /srv/gump/public/workspace/castor/diff/src/test/resources
[INFO] [compiler:testCompile {execution: default-testCompile}]
[INFO] No sources to compile
[WARNING] DEPRECATED [systemProperties]: Use systemPropertyVariables instead.
[INFO] [surefire:test {execution: default-test}]
[INFO] Tests are skipped.
[INFO] [jar:jar {execution: default-jar}]
[INFO] Building jar: /srv/gump/public/workspace/castor/diff/target/castor-xml-diff-1.3.3-SNAPSHOT.jar
[INFO] Preparing source:jar
[WARNING] Removing: jar from forked lifecycle, to prevent recursive invocation.
[INFO] [enforcer:enforce {execution: enforce-maven}]
[INFO] [source:jar {execution: default}]
[INFO] Building jar: /srv/gump/public/workspace/castor/diff/target/castor-xml-diff-1.3.3-SNAPSHOT-sources.jar
[INFO] ------------------------------------------------------------------------
[INFO] Building Castor XML - schema
[INFO]    task-segment: [package]
[INFO] ------------------------------------------------------------------------
[INFO] [enforcer:enforce {execution: enforce-maven}]
[INFO] [castor:generate {execution: default}]
[INFO] Successfully created an instance of the Castor XML source generator, release 1.3.1
[INFO] About to invoke method >setResourceDestination< on Castor's SourceGenerator class using reflection.
[INFO] Processing /srv/gump/public/workspace/castor/schema/src/main/resources/org/exolab/castor/xml/schema/annotations/jdo-extensions.xsd
[INFO] ------------------------------------------------------------------------
[ERROR] BUILD ERROR
[INFO] ------------------------------------------------------------------------
[INFO] Castor execution failed

Embedded error: org/apache/commons/lang/StringUtils
org.apache.commons.lang.StringUtils
[INFO] ------------------------------------------------------------------------
[INFO] For more information, run Maven with the -e switch
[INFO] ------------------------------------------------------------------------
[INFO] Total time: 46 seconds
[INFO] Finished at: Sat Jul 23 09:37:30 UTC 2011
[INFO] Final Memory: 34M/83M
[INFO] ------------------------------------------------------------------------
---------------------------------------------

To subscribe to this information via syndicated feeds:
- RSS: http://vmgump.apache.org/gump/public/castor/castor-reactor/rss.xml
- Atom: http://vmgump.apache.org/gump/public/castor/castor-reactor/atom.xml

============================== Gump Tracking Only ===
Produced by Apache Gump(TM) version 2.3.
Gump Run 07000623072011, vmgump.apache.org:vmgump:07000623072011
Gump E-mail Identifier (unique within run) #17.

*********************************************************** G U M P
[GUMP@vmgump]: Project cocoon-sax (in module cocoon3) failed
To whom it may engage...
        
This is an automated request, but not an unsolicited one. For 
more information please visit http://gump.apache.org/nagged.html, 
and/or contact the folk at general@gump.apache.org.

Project cocoon-sax has an issue affecting its community integration.
This issue affects 13 projects.
The current state of this project is 'Failed', with reason 'Build Failed'.
For reference only, the following projects are affected by this:
    - cocoon-controller :  Java XML Framework
    - cocoon-optional :  Java XML Framework
    - cocoon-optional-test :  Java XML Framework
    - cocoon-profiling :  Java XML Framework
    - cocoon-rest :  Java XML Framework
    - cocoon-sax :  Java XML Framework
    - cocoon-sax-test :  Java XML Framework
    - cocoon-servlet :  Java XML Framework
    - cocoon-sitemap :  Java XML Framework
    - cocoon-stax :  Java XML Framework
    - cocoon-stax-test :  Java XML Framework
    - cocoon-stringtemplate :  Java XML Framework
    - cocoon-wicket :  Java XML Framework


Full details are available at:
    http://vmgump.apache.org/gump/public/cocoon3/cocoon-sax/index.html

That said, some information snippets are provided here.

The following annotations (debug/informational/warning/error messages) were provided:
 -DEBUG- Sole jar output [cocoon-sax-*[0-9T].jar] identifier set to project name
 -INFO- Optional dependency cocoon-pipeline failed with reason build failed
 -DEBUG- (Apache Gump generated) Apache Maven Settings in: /srv/gump/public/workspace/cocoon3/cocoon-sax/gump_mvn_settings.xml
 -INFO- Failed with reason build failed
 -DEBUG- Maven POM in: /srv/gump/public/workspace/cocoon3/cocoon-sax/pom.xml
 -DEBUG- Extracted fallback artifacts from Gump Repository



The following work was performed:
http://vmgump.apache.org/gump/public/cocoon3/cocoon-sax/gump_work/build_cocoon3_cocoon-sax.html
Work Name: build_cocoon3_cocoon-sax (Type: Build)
Work ended in a state of : Failed
Elapsed: 8 secs
Command Line: /opt/maven2/bin/mvn --batch-mode -DskipTests=true --settings /srv/gump/public/workspace/cocoon3/cocoon-sax/gump_mvn_settings.xml install 
[Working Directory: /srv/gump/public/workspace/cocoon3/cocoon-sax]
M2_HOME: /opt/maven2
---------------------------------------------
Downloading: http://localhost:8192/maven/2/xalan/xalan/2.7.1/xalan-2.7.1.jar
[INFO] Unable to find resource 'org.apache.cocoon.pipeline:cocoon-pipeline:jar:3.0.0-beta-1-SNAPSHOT' in repository maven2-repository.dev.java.net (http://download.java.net/maven/2/)
Downloading: http://localhost:8192/repo/m2-snapshot-repository/org/apache/cocoon/pipeline/cocoon-pipeline/3.0.0-beta-1-SNAPSHOT/cocoon-pipeline-3.0.0-beta-1-SNAPSHOT.jar
51K downloaded  (cocoon-xml-2.0.2.jar)
[INFO] Unable to find resource 'org.apache.cocoon.pipeline:cocoon-pipeline:jar:3.0.0-beta-1-SNAPSHOT' in repository apache.snapshots (http://repository.apache.org/snapshots)
587K downloaded  (bcel-5.2.jar)
3155K downloaded  (xalan-2.7.1.jar)
Downloading: http://localhost:8192/maven/2/xalan/serializer/2.7.1/serializer-2.7.1.jar
277K downloaded  (serializer-2.7.1.jar)
[INFO] ------------------------------------------------------------------------
[ERROR] BUILD ERROR
[INFO] ------------------------------------------------------------------------
[INFO] Failed to resolve artifact.

Missing:
----------
1) org.apache.cocoon.pipeline:cocoon-pipeline:jar:3.0.0-beta-1-SNAPSHOT

  Try downloading the file manually from the project website.

  Then, install it using the command: 
      mvn install:install-file -DgroupId=org.apache.cocoon.pipeline -DartifactId=cocoon-pipeline -Dversion=3.0.0-beta-1-SNAPSHOT -Dpackaging=jar -Dfile=/path/to/file

  Alternatively, if you host your own repository you can deploy the file there: 
      mvn deploy:deploy-file -DgroupId=org.apache.cocoon.pipeline -DartifactId=cocoon-pipeline -Dversion=3.0.0-beta-1-SNAPSHOT -Dpackaging=jar -Dfile=/path/to/file -Durl=[url] -DrepositoryId=[id]

  Path to dependency: 
  	1) org.apache.cocoon.sax:cocoon-sax:jar:3.0.0-beta-1-SNAPSHOT
  	2) org.apache.cocoon.pipeline:cocoon-pipeline:jar:3.0.0-beta-1-SNAPSHOT

----------
1 required artifact is missing.

for artifact: 
  org.apache.cocoon.sax:cocoon-sax:jar:3.0.0-beta-1-SNAPSHOT

from the specified remote repositories:
  gump-maven2-repository.dev.java.net (http://localhost:8192/maven/2),
  gump-central (http://localhost:8192/maven2),
  gump-apache.snapshots (http://localhost:8192/repo/m2-snapshot-repository)



[INFO] ------------------------------------------------------------------------
[INFO] For more information, run Maven with the -e switch
[INFO] ------------------------------------------------------------------------
[INFO] Total time: 7 seconds
[INFO] Finished at: Sat Jul 23 09:41:14 UTC 2011
[INFO] Final Memory: 16M/39M
[INFO] ------------------------------------------------------------------------
---------------------------------------------

To subscribe to this information via syndicated feeds:
- RSS: http://vmgump.apache.org/gump/public/cocoon3/cocoon-sax/rss.xml
- Atom: http://vmgump.apache.org/gump/public/cocoon3/cocoon-sax/atom.xml

============================== Gump Tracking Only ===
Produced by Apache Gump(TM) version 2.3.
Gump Run 07000623072011, vmgump.apache.org:vmgump:07000623072011
Gump E-mail Identifier (unique within run) #18.

*********************************************************** G U M P
[GUMP@vmgump]: Project httpcomponents-client (in module httpcomponents) failed
To whom it may engage...
        
This is an automated request, but not an unsolicited one. For 
more information please visit http://gump.apache.org/nagged.html, 
and/or contact the folk at general@gump.apache.org.

Project httpcomponents-client has an issue affecting its community integration.
This issue affects 4 projects,
 and has been outstanding for 2 runs.
The current state of this project is 'Failed', with reason 'Build Failed'.
For reference only, the following projects are affected by this:
    - httpcomponents-client :  HttpComponents Client
    - httpcomponents-client-test :  HttpComponents Client
    - jakarta-jmeter-svn :  Pure Java load testing and performance measurement tool.
   ...
    - jakarta-jmeter-test :  Pure Java load testing and performance measurement tool.
   ...


Full details are available at:
    http://vmgump.apache.org/gump/public/httpcomponents/httpcomponents-client/index.html

That said, some information snippets are provided here.

The following annotations (debug/informational/warning/error messages) were provided:
 -DEBUG- (Apache Gump generated) Apache Maven Settings in: /srv/gump/public/workspace/httpcomponents/httpclient/gump_mvn_settings.xml
 -INFO- Failed with reason build failed
 -DEBUG- Maven POM in: /srv/gump/public/workspace/httpcomponents/httpclient/pom.xml
 -INFO- Failed to extract fallback artifacts from Gump Repository



The following work was performed:
http://vmgump.apache.org/gump/public/httpcomponents/httpcomponents-client/gump_work/build_httpcomponents_httpcomponents-client.html
Work Name: build_httpcomponents_httpcomponents-client (Type: Build)
Work ended in a state of : Failed
Elapsed: 28 secs
Command Line: /opt/maven2/bin/mvn --batch-mode -DskipTests=true --settings /srv/gump/public/workspace/httpcomponents/httpclient/gump_mvn_settings.xml package 
[Working Directory: /srv/gump/public/workspace/httpcomponents/httpclient]
M2_HOME: /opt/maven2
---------------------------------------------
Downloading: http://files.couchbase.com/maven2//org/apache/httpcomponents/httpcomponents-core/4.1.1/httpcomponents-core-4.1.1.pom
[INFO] Unable to find resource 'org.apache.httpcomponents:httpcomponents-core:pom:4.1.1' in repository spy (http://files.couchbase.com/maven2/)
Downloading: http://localhost:8192/maven2/org/apache/httpcomponents/httpcomponents-core/4.1.1/httpcomponents-core-4.1.1.pom

Downloading: http://files.couchbase.com/maven2//commons-codec/commons-codec/1.4/commons-codec-1.4.pom
[INFO] Unable to find resource 'commons-codec:commons-codec:pom:1.4' in repository spy (http://files.couchbase.com/maven2/)
Downloading: http://localhost:8192/maven2/commons-codec/commons-codec/1.4/commons-codec-1.4.pom

Downloading: http://files.couchbase.com/maven2//org/apache/httpcomponents/httpcore/4.1.1/httpcore-4.1.1.jar
Downloading: http://files.couchbase.com/maven2//commons-codec/commons-codec/1.4/commons-codec-1.4.jar
[INFO] Unable to find resource 'commons-codec:commons-codec:jar:1.4' in repository spy (http://files.couchbase.com/maven2/)
[INFO] Unable to find resource 'org.apache.httpcomponents:httpcore:jar:4.1.1' in repository spy (http://files.couchbase.com/maven2/)
Downloading: http://localhost:8192/maven2/org/apache/httpcomponents/httpcore/4.1.1/httpcore-4.1.1.jar
Downloading: http://localhost:8192/maven2/commons-codec/commons-codec/1.4/commons-codec-1.4.jar
189K downloaded  (httpcore-4.1.1.jar)
74K downloaded  (commons-codec-1.4.jar)
[INFO] [compiler:compile {execution: default-compile}]
[INFO] Compiling 263 source files to /srv/gump/public/workspace/httpcomponents/httpclient/httpclient/target/classes
[INFO] [resources:testResources {execution: default-testResources}]
[INFO] Using 'UTF-8' encoding to copy filtered resources.
[INFO] Copying 3 resources
[INFO] Copying 2 resources to META-INF
[INFO] [compiler:testCompile {execution: default-testCompile}]
[INFO] Compiling 99 source files to /srv/gump/public/workspace/httpcomponents/httpclient/httpclient/target/test-classes
[INFO] -------------------------------------------------------------
[ERROR] COMPILATION ERROR : 
[INFO] -------------------------------------------------------------
[ERROR] /srv/gump/public/workspace/httpcomponents/httpclient/httpclient/src/test/java/org/apache/http/client/utils/TestURLEncodedUtils.java:[92,36] reference to StringEntity is ambiguous, both method StringEntity(java.lang.String,org.apache.http.entity.ContentType) in org.apache.http.entity.StringEntity and method StringEntity(java.lang.String,java.lang.String) in org.apache.http.entity.StringEntity match

[ERROR] /srv/gump/public/workspace/httpcomponents/httpclient/httpclient/src/test/java/org/apache/http/client/utils/TestURLEncodedUtils.java:[145,36] reference to StringEntity is ambiguous, both method StringEntity(java.lang.String,org.apache.http.entity.ContentType) in org.apache.http.entity.StringEntity and method StringEntity(java.lang.String,java.lang.String) in org.apache.http.entity.StringEntity match

[INFO] 2 errors 
[INFO] -------------------------------------------------------------
[INFO] ------------------------------------------------------------------------
[ERROR] BUILD FAILURE
[INFO] ------------------------------------------------------------------------
[INFO] Compilation failure

/srv/gump/public/workspace/httpcomponents/httpclient/httpclient/src/test/java/org/apache/http/client/utils/TestURLEncodedUtils.java:[92,36] reference to StringEntity is ambiguous, both method StringEntity(java.lang.String,org.apache.http.entity.ContentType) in org.apache.http.entity.StringEntity and method StringEntity(java.lang.String,java.lang.String) in org.apache.http.entity.StringEntity match

/srv/gump/public/workspace/httpcomponents/httpclient/httpclient/src/test/java/org/apache/http/client/utils/TestURLEncodedUtils.java:[145,36] reference to StringEntity is ambiguous, both method StringEntity(java.lang.String,org.apache.http.entity.ContentType) in org.apache.http.entity.StringEntity and method StringEntity(java.lang.String,java.lang.String) in org.apache.http.entity.StringEntity match


[INFO] ------------------------------------------------------------------------
[INFO] For more information, run Maven with the -e switch
[INFO] ------------------------------------------------------------------------
[INFO] Total time: 27 seconds
[INFO] Finished at: Sat Jul 23 10:02:39 UTC 2011
[INFO] Final Memory: 53M/126M
[INFO] ------------------------------------------------------------------------
---------------------------------------------

To subscribe to this information via syndicated feeds:
- RSS: http://vmgump.apache.org/gump/public/httpcomponents/httpcomponents-client/rss.xml
- Atom: http://vmgump.apache.org/gump/public/httpcomponents/httpcomponents-client/atom.xml

============================== Gump Tracking Only ===
Produced by Apache Gump(TM) version 2.3.
Gump Run 07000623072011, vmgump.apache.org:vmgump:07000623072011
Gump E-mail Identifier (unique within run) #19.

*********************************************************** G U M P
[GUMP@vmgump]: Project jtidy-svn (in module jtidy) failed
To whom it may engage...
        
This is an automated request, but not an unsolicited one. For 
more information please visit http://gump.apache.org/nagged.html, 
and/or contact the folk at general@gump.apache.org.

Project jtidy-svn has an issue affecting its community integration.
This issue affects 2 projects,
 and has been outstanding for 445 runs.
The current state of this project is 'Failed', with reason 'Build Failed'.
For reference only, the following projects are affected by this:
    - forrest-test :  Apache Forrest software is a publishing framework that trans...
    - jtidy-svn :  HTML Templates


Full details are available at:
    http://vmgump.apache.org/gump/public/jtidy/jtidy-svn/index.html

That said, some information snippets are provided here.

The following annotations (debug/informational/warning/error messages) were provided:
 -DEBUG- Sole jar output [jtidy-8.0-SNAPSHOT.jar] identifier set to project name
 -DEBUG- (Apache Gump generated) Apache Maven Settings in: /srv/gump/public/workspace/jtidy/gump_mvn_settings.xml
 -INFO- Failed with reason build failed
 -DEBUG- Maven POM in: /srv/gump/public/workspace/jtidy/pom.xml
 -INFO- Failed to extract fallback artifacts from Gump Repository



The following work was performed:
http://vmgump.apache.org/gump/public/jtidy/jtidy-svn/gump_work/build_jtidy_jtidy-svn.html
Work Name: build_jtidy_jtidy-svn (Type: Build)
Work ended in a state of : Failed
Elapsed: 16 secs
Command Line: /opt/maven2/bin/mvn --batch-mode --settings /srv/gump/public/workspace/jtidy/gump_mvn_settings.xml package 
[Working Directory: /srv/gump/public/workspace/jtidy]
M2_HOME: /opt/maven2
---------------------------------------------
1) com.sun.jmx:jmxri:jar:1.2.1

  Try downloading the file manually from the project website.

  Then, install it using the command: 
      mvn install:install-file -DgroupId=com.sun.jmx -DartifactId=jmxri -Dversion=1.2.1 -Dpackaging=jar -Dfile=/path/to/file

  Alternatively, if you host your own repository you can deploy the file there: 
      mvn deploy:deploy-file -DgroupId=com.sun.jmx -DartifactId=jmxri -Dversion=1.2.1 -Dpackaging=jar -Dfile=/path/to/file -Durl=[url] -DrepositoryId=[id]

  Path to dependency: 
  	1) net.sf.jtidy:jtidy:jar:8.0-SNAPSHOT
  	2) log4j:log4j:jar:1.2.15
  	3) com.sun.jmx:jmxri:jar:1.2.1

2) com.sun.jdmk:jmxtools:jar:1.2.1

  Try downloading the file manually from: 
      http://java.sun.com/products/JavaManagement/download.html

  Then, install it using the command: 
      mvn install:install-file -DgroupId=com.sun.jdmk -DartifactId=jmxtools -Dversion=1.2.1 -Dpackaging=jar -Dfile=/path/to/file

  Alternatively, if you host your own repository you can deploy the file there: 
      mvn deploy:deploy-file -DgroupId=com.sun.jdmk -DartifactId=jmxtools -Dversion=1.2.1 -Dpackaging=jar -Dfile=/path/to/file -Durl=[url] -DrepositoryId=[id]

  Path to dependency: 
  	1) net.sf.jtidy:jtidy:jar:8.0-SNAPSHOT
  	2) log4j:log4j:jar:1.2.15
  	3) com.sun.jdmk:jmxtools:jar:1.2.1

----------
2 required artifacts are missing.

for artifact: 
  net.sf.jtidy:jtidy:jar:8.0-SNAPSHOT

from the specified remote repositories:
  gump-central (http://localhost:8192/maven2),
  jtidy (http://jtidy.sourceforge.net/maven2/)



[INFO] ------------------------------------------------------------------------
[INFO] For more information, run Maven with the -e switch
[INFO] ------------------------------------------------------------------------
[INFO] Total time: 15 seconds
[INFO] Finished at: Sat Jul 23 10:06:22 UTC 2011
[INFO] Final Memory: 20M/57M
[INFO] ------------------------------------------------------------------------
---------------------------------------------

To subscribe to this information via syndicated feeds:
- RSS: http://vmgump.apache.org/gump/public/jtidy/jtidy-svn/rss.xml
- Atom: http://vmgump.apache.org/gump/public/jtidy/jtidy-svn/atom.xml

============================== Gump Tracking Only ===
Produced by Apache Gump(TM) version 2.3.
Gump Run 07000623072011, vmgump.apache.org:vmgump:07000623072011
Gump E-mail Identifier (unique within run) #20.

*********************************************************** G U M P
[GUMP@vmgump]: Module opensaml-xmltooling failed
To whom it may engage...
        
This is an automated request, but not an unsolicited one. For 
more information please visit http://gump.apache.org/nagged.html, 
and/or contact the folk at general@gump.apache.org.

Module opensaml-xmltooling has an issue affecting its community integration,
 and has been outstanding for 15 runs.
The current state of this module is 'Failed', with reason 'Update Failed'.

Full details are available at:
    http://vmgump.apache.org/gump/public/opensaml-xmltooling/index.html

That said, some information snippets are provided here.

The following annotations (debug/informational/warning/error messages) were provided:
 -INFO- Failed with reason update failed



The following work was performed:
http://vmgump.apache.org/gump/public/opensaml-xmltooling/gump_work/update_opensaml-xmltooling.html
Work Name: update_opensaml-xmltooling (Type: Update)
Work ended in a state of : Failed
Elapsed: 1 sec
Command Line: svn --quiet checkout https://svn.shibboleth.net/java-xmltooling/branches/REL_1 --non-interactive opensaml-xmltooling 
[Working Directory: /srv/gump/public/workspace/cvs]
---------------------------------------------
svn: OPTIONS of 'https://svn.shibboleth.net/java-xmltooling/branches/REL_1': Server certificate verification failed: issuer is not trusted (https://svn.shibboleth.net)
---------------------------------------------

To subscribe to this information via syndicated feeds:
- RSS: http://vmgump.apache.org/gump/public/opensaml-xmltooling/rss.xml
- Atom: http://vmgump.apache.org/gump/public/opensaml-xmltooling/atom.xml

============================== Gump Tracking Only ===
Produced by Apache Gump(TM) version 2.3.
Gump Run 07000623072011, vmgump.apache.org:vmgump:07000623072011
Gump E-mail Identifier (unique within run) #21.

*********************************************************** G U M P
[GUMP@vmgump]: Project opensaml-xmltooling (in module opensaml-xmltooling) failed
To whom it may engage...
        
This is an automated request, but not an unsolicited one. For 
more information please visit http://gump.apache.org/nagged.html, 
and/or contact the folk at general@gump.apache.org.

Project opensaml-xmltooling has an issue affecting its community integration,
 and has been outstanding for 15 runs.
The current state of this project is 'Failed', with reason 'Update Failed'.

Full details are available at:
    http://vmgump.apache.org/gump/public/opensaml-xmltooling/opensaml-xmltooling/index.html

That said, some information snippets are provided here.

The following annotations (debug/informational/warning/error messages) were provided:
 -INFO- Failed with reason update failed
 -INFO- Failed to extract fallback artifacts from Gump Repository

To subscribe to this information via syndicated feeds:
- RSS: http://vmgump.apache.org/gump/public/opensaml-xmltooling/opensaml-xmltooling/rss.xml
- Atom: http://vmgump.apache.org/gump/public/opensaml-xmltooling/opensaml-xmltooling/atom.xml

============================== Gump Tracking Only ===
Produced by Apache Gump(TM) version 2.3.
Gump Run 07000623072011, vmgump.apache.org:vmgump:07000623072011
Gump E-mail Identifier (unique within run) #22.

*********************************************************** G U M P
[GUMP@vmgump]: Project camel-spring-test (in module camel) failed
To whom it may engage...
        
This is an automated request, but not an unsolicited one. For 
more information please visit http://gump.apache.org/nagged.html, 
and/or contact the folk at general@gump.apache.org.

Project camel-spring-test has an issue affecting its community integration.
This issue affects 1 projects,
 and has been outstanding for 67 runs.
The current state of this project is 'Failed', with reason 'Build Failed'.
For reference only, the following projects are affected by this:
    - camel-spring-test :  Integration framework based on known Enterprise Integration
...


Full details are available at:
    http://vmgump.apache.org/gump/public/camel/camel-spring-test/index.html

That said, some information snippets are provided here.

The following annotations (debug/informational/warning/error messages) were provided:
 -WARNING- Overriding Maven settings: [/srv/gump/public/workspace/camel/components/camel-spring/gump_mvn_settings.xml]
 -DEBUG- (Apache Gump generated) Apache Maven Settings in: /srv/gump/public/workspace/camel/components/camel-spring/gump_mvn_settings.xml
 -INFO- Failed with reason build failed
 -DEBUG- Maven POM in: /srv/gump/public/workspace/camel/components/camel-spring/pom.xml
 -INFO- Project Reports in: /srv/gump/public/workspace/camel/components/camel-spring/target/surefire-reports



The following work was performed:
http://vmgump.apache.org/gump/public/camel/camel-spring-test/gump_work/build_camel_camel-spring-test.html
Work Name: build_camel_camel-spring-test (Type: Build)
Work ended in a state of : Failed
Elapsed: 2 mins 40 secs
Command Line: /opt/maven2/bin/mvn --batch-mode --settings /srv/gump/public/workspace/camel/components/camel-spring/gump_mvn_settings.xml test 
[Working Directory: /srv/gump/public/workspace/camel/components/camel-spring]
M2_HOME: /opt/maven2
---------------------------------------------
  testChooseMethodUsingBodyType(org.apache.camel.component.bean.BeanRouteTest): org.slf4j.helpers.MessageFormatter.format(Ljava/lang/String;Ljava/lang/Object;Ljava/lang/Object;)Ljava/lang/String;
  testAmbiguousMethodCallFails(org.apache.camel.component.bean.BeanRouteTest): org.slf4j.helpers.MessageFormatter.format(Ljava/lang/String;Ljava/lang/Object;Ljava/lang/Object;)Ljava/lang/String;
  testBeanBindingUsingBeanExpression(org.apache.camel.component.bean.BeanBindingTest): Error creating bean with name 'myConsumer' defined in class path resource [org/apache/camel/component/bean/beanBindingTest.xml]: Initialization of bean failed; nested exception is java.lang.NoSuchMethodError: org.slf4j.helpers.MessageFormatter.format(Ljava/lang/String;Ljava/lang/Object;Ljava/lang/Object;)Ljava/lang/String;
  testBeanBindingUsingConstantExpression(org.apache.camel.component.bean.BeanBindingTest): Error creating bean with name 'myConsumer' defined in class path resource [org/apache/camel/component/bean/beanBindingTest.xml]: Initialization of bean failed; nested exception is java.lang.NoSuchMethodError: org.slf4j.helpers.MessageFormatter.format(Ljava/lang/String;Ljava/lang/Object;Ljava/lang/Object;)Ljava/lang/String;
  testBeanBindingUsingHeaderExpression(org.apache.camel.component.bean.BeanBindingTest): Error creating bean with name 'myConsumer' defined in class path resource [org/apache/camel/component/bean/beanBindingTest.xml]: Initialization of bean failed; nested exception is java.lang.NoSuchMethodError: org.slf4j.helpers.MessageFormatter.format(Ljava/lang/String;Ljava/lang/Object;Ljava/lang/Object;)Ljava/lang/String;
  testBeanBindingUsingManyExpression(org.apache.camel.component.bean.BeanBindingTest): Error creating bean with name 'myConsumer' defined in class path resource [org/apache/camel/component/bean/beanBindingTest.xml]: Initialization of bean failed; nested exception is java.lang.NoSuchMethodError: org.slf4j.helpers.MessageFormatter.format(Ljava/lang/String;Ljava/lang/Object;Ljava/lang/Object;)Ljava/lang/String;
  testSendBody(org.apache.camel.component.bean.BeanWithRecipientListTest): Failed to load ApplicationContext
  testXsltIncludeRelativeOther(org.apache.camel.component.xslt.XsltIncludeRelativeOtherTest): org.slf4j.helpers.MessageFormatter.format(Ljava/lang/String;Ljava/lang/Object;Ljava/lang/Object;)Ljava/lang/String;
  testXsltOutput(org.apache.camel.component.xslt.XsltOutputBytesTest): org.slf4j.helpers.MessageFormatter.format(Ljava/lang/String;Ljava/lang/Object;Ljava/lang/Object;)Ljava/lang/String;
  testXsltOutput(org.apache.camel.component.xslt.XsltOutputStringTest): org.slf4j.helpers.MessageFormatter.format(Ljava/lang/String;Ljava/lang/Object;Ljava/lang/Object;)Ljava/lang/String;
  testConverterReference(org.apache.camel.component.xslt.XsltReferenceParameterTest): org.slf4j.helpers.MessageFormatter.format(Ljava/lang/String;Ljava/lang/Object;Ljava/lang/Object;)Ljava/lang/String;
  testTransformerFactoryReference(org.apache.camel.component.xslt.XsltReferenceParameterTest): org.slf4j.helpers.MessageFormatter.format(Ljava/lang/String;Ljava/lang/Object;Ljava/lang/Object;)Ljava/lang/String;
  testXsltIncludeClasspath(org.apache.camel.component.xslt.XsltIncludeClasspathTest): org.slf4j.helpers.MessageFormatter.format(Ljava/lang/String;Ljava/lang/Object;Ljava/lang/Object;)Ljava/lang/String;
  testXsltOutput(org.apache.camel.component.xslt.XsltOutputDOMTest): org.slf4j.helpers.MessageFormatter.format(Ljava/lang/String;Ljava/lang/Object;Ljava/lang/Object;)Ljava/lang/String;
  testNotCached(org.apache.camel.component.xslt.XsltContentCacheTest): org.slf4j.helpers.MessageFormatter.format(Ljava/lang/String;Ljava/lang/Object;Ljava/lang/Object;)Ljava/lang/String;
  testCached(org.apache.camel.component.xslt.XsltContentCacheTest): org.slf4j.helpers.MessageFormatter.format(Ljava/lang/String;Ljava/lang/Object;Ljava/lang/Object;)Ljava/lang/String;
  testCachedIsDefault(org.apache.camel.component.xslt.XsltContentCacheTest): org.slf4j.helpers.MessageFormatter.format(Ljava/lang/String;Ljava/lang/Object;Ljava/lang/Object;)Ljava/lang/String;
  testXsltOutput(org.apache.camel.component.xslt.XsltOutputFileTest): org.slf4j.helpers.MessageFormatter.format(Ljava/lang/String;Ljava/lang/Object;Ljava/lang/Object;)Ljava/lang/String;
  testXsltOutputFileMissingHeader(org.apache.camel.component.xslt.XsltOutputFileTest): org.slf4j.helpers.MessageFormatter.format(Ljava/lang/String;Ljava/lang/Object;Ljava/lang/Object;)Ljava/lang/String;
  testInvalidStylesheet(org.apache.camel.component.xslt.InvalidXsltFileTest): org.slf4j.helpers.MessageFormatter.format(Ljava/lang/String;Ljava/lang/Object;Ljava/lang/Object;)Ljava/lang/String;
  testXsltInclude(org.apache.camel.component.xslt.XsltIncludeTest): org.slf4j.helpers.MessageFormatter.format(Ljava/lang/String;Ljava/lang/Object;Ljava/lang/Object;)Ljava/lang/String;
  testSendMessageAndHaveItTransformed(org.apache.camel.component.xslt.XsltRouteTest): org.slf4j.helpers.MessageFormatter.format(Ljava/lang/String;Ljava/lang/Object;Ljava/lang/Object;)Ljava/lang/String;
  testXsltIncludeRelative(org.apache.camel.component.xslt.XsltIncludeRelativeTest): org.slf4j.helpers.MessageFormatter.format(Ljava/lang/String;Ljava/lang/Object;Ljava/lang/Object;)Ljava/lang/String;
  testXsltOutputDeleteFile(org.apache.camel.component.xslt.XsltOutputFileDeleteTest): org.slf4j.helpers.MessageFormatter.format(Ljava/lang/String;Ljava/lang/Object;Ljava/lang/Object;)Ljava/lang/String;
  testNoXsltFile(org.apache.camel.component.xslt.XsltFileNotFoundTest): org.slf4j.helpers.MessageFormatter.format(Ljava/lang/String;Ljava/lang/Object;Ljava/lang/Object;)Ljava/lang/String;
  testXsltException(org.apache.camel.component.xslt.XsltTransformingExceptionTest): org.slf4j.helpers.MessageFormatter.format(Ljava/lang/String;Ljava/lang/Object;Ljava/lang/Object;)Ljava/lang/String;
  testXsltWithoutException(org.apache.camel.component.xslt.XsltTransformingExceptionTest): org.slf4j.helpers.MessageFormatter.format(Ljava/lang/String;Ljava/lang/Object;Ljava/lang/Object;)Ljava/lang/String;
  testFragmentPassedToXslt(org.apache.camel.component.xslt.XsltXmlFragmentTest): org.slf4j.helpers.MessageFormatter.format(Ljava/lang/String;Ljava/lang/Object;Ljava/lang/Object;)Ljava/lang/String;
  testSendingCamelExchangeToEndpointResultsInValidApplicationEventAfterTheRefreshEvent(org.apache.camel.component.log.SpringLogTest): org.slf4j.helpers.MessageFormatter.format(Ljava/lang/String;Ljava/lang/Object;Ljava/lang/Object;)Ljava/lang/String;
  testSendingCamelExchangeToEndpointResultsInValidApplicationEventAfterTheRefreshEvent(org.apache.camel.component.event.MistypedPackageTest): org.slf4j.helpers.MessageFormatter.format(Ljava/lang/String;Ljava/lang/Object;Ljava/lang/Object;)Ljava/lang/String;
  testSendingCamelExchangeToEndpointResultsInValidApplicationEventAfterTheRefreshEvent(org.apache.camel.component.event.EventRouteTest): org.slf4j.helpers.MessageFormatter.format(Ljava/lang/String;Ljava/lang/Object;Ljava/lang/Object;)Ljava/lang/String;
  testValidMessage(org.apache.camel.component.validator.ValidatorRouteTest): org.slf4j.helpers.MessageFormatter.format(Ljava/lang/String;Ljava/lang/Object;Ljava/lang/Object;)Ljava/lang/String;
  testInvalidMessage(org.apache.camel.component.validator.ValidatorRouteTest): org.slf4j.helpers.MessageFormatter.format(Ljava/lang/String;Ljava/lang/Object;Ljava/lang/Object;)Ljava/lang/String;
  testRun(org.apache.camel.component.dataset.SpringDataSetTest): org.slf4j.helpers.MessageFormatter.format(Ljava/lang/String;Ljava/lang/Object;Ljava/lang/Object;)Ljava/lang/String;

Tests run: 885, Failures: 0, Errors: 847, Skipped: 1

[INFO] ------------------------------------------------------------------------
[ERROR] BUILD FAILURE
[INFO] ------------------------------------------------------------------------
[INFO] There are test failures.

Please refer to /srv/gump/public/workspace/camel/components/camel-spring/target/surefire-reports for the individual test results.
[INFO] ------------------------------------------------------------------------
[INFO] For more information, run Maven with the -e switch
[INFO] ------------------------------------------------------------------------
[INFO] Total time: 2 minutes 39 seconds
[INFO] Finished at: Sat Jul 23 10:23:09 UTC 2011
[INFO] Final Memory: 45M/107M
[INFO] ------------------------------------------------------------------------
---------------------------------------------

To subscribe to this information via syndicated feeds:
- RSS: http://vmgump.apache.org/gump/public/camel/camel-spring-test/rss.xml
- Atom: http://vmgump.apache.org/gump/public/camel/camel-spring-test/atom.xml

============================== Gump Tracking Only ===
Produced by Apache Gump(TM) version 2.3.
Gump Run 07000623072011, vmgump.apache.org:vmgump:07000623072011
Gump E-mail Identifier (unique within run) #23.

*********************************************************** G U M P
[GUMP@vmgump]: Project commons-jci-reactor (in module apache-commons) failed
To whom it may engage...
        
This is an automated request, but not an unsolicited one. For 
more information please visit http://gump.apache.org/nagged.html, 
and/or contact the folk at general@gump.apache.org.

Project commons-jci-reactor has an issue affecting its community integration.
This issue affects 1 projects,
 and has been outstanding for 123 runs.
The current state of this project is 'Failed', with reason 'Build Failed'.
For reference only, the following projects are affected by this:
    - commons-jci-reactor :  Apache Commons


Full details are available at:
    http://vmgump.apache.org/gump/public/apache-commons/commons-jci-reactor/index.html

That said, some information snippets are provided here.

The following annotations (debug/informational/warning/error messages) were provided:
 -WARNING- Overriding Maven settings: [/srv/gump/public/workspace/apache-commons/jci/gump_mvn_settings.xml]
 -DEBUG- (Apache Gump generated) Apache Maven Settings in: /srv/gump/public/workspace/apache-commons/jci/gump_mvn_settings.xml
 -INFO- Failed with reason build failed
 -DEBUG- Maven POM in: /srv/gump/public/workspace/apache-commons/jci/pom.xml
 -INFO- Project Reports in: /srv/gump/public/workspace/apache-commons/jci/compilers/groovy/target/surefire-reports
 -WARNING- No directory [/srv/gump/public/workspace/apache-commons/jci/compilers/groovy/target/surefire-reports]



The following work was performed:
http://vmgump.apache.org/gump/public/apache-commons/commons-jci-reactor/gump_work/build_apache-commons_commons-jci-reactor.html
Work Name: build_apache-commons_commons-jci-reactor (Type: Build)
Work ended in a state of : Failed
Elapsed: 1 min 29 secs
Command Line: /opt/maven2/bin/mvn --batch-mode --settings /srv/gump/public/workspace/apache-commons/jci/gump_mvn_settings.xml package 
[Working Directory: /srv/gump/public/workspace/apache-commons/jci]
M2_HOME: /opt/maven2
---------------------------------------------
[INFO] ------------------------------------------------------------------------
[INFO] Building compiler-eclipse
[INFO]    task-segment: [package]
[INFO] ------------------------------------------------------------------------
[INFO] [antrun:run {execution: javadoc.resources}]
[INFO] Executing tasks
[INFO] Executed tasks
[INFO] [remote-resources:process {execution: default}]
[INFO] [resources:resources {execution: default-resources}]
[INFO] Using 'iso-8859-1' encoding to copy filtered resources.
[INFO] Copying 0 resource to META-INF
[INFO] [compiler:compile {execution: default-compile}]
[INFO] Compiling 3 source files to /srv/gump/public/workspace/apache-commons/jci/compilers/eclipse/target/classes
[INFO] [bundle:manifest {execution: bundle-manifest}]
[INFO] [resources:testResources {execution: default-testResources}]
[INFO] Using 'iso-8859-1' encoding to copy filtered resources.
[INFO] Copying 1 resource
[INFO] [compiler:testCompile {execution: default-testCompile}]
[INFO] Compiling 2 source files to /srv/gump/public/workspace/apache-commons/jci/compilers/eclipse/target/test-classes
[INFO] [surefire:test {execution: default-test}]
[INFO] Surefire report directory: /srv/gump/public/workspace/apache-commons/jci/compilers/eclipse/target/surefire-reports

-------------------------------------------------------
 T E S T S
-------------------------------------------------------
Running org.apache.commons.jci.compilers.EclipseJavaCompilerSettingsTestCase
Tests run: 6, Failures: 0, Errors: 0, Skipped: 0, Time elapsed: 0.074 sec
Running org.apache.commons.jci.compilers.EclipseJavaCompilerTestCase
Tests run: 7, Failures: 1, Errors: 0, Skipped: 0, Time elapsed: 1.315 sec <<< FAILURE!

Results :

Failed tests: 
  testAdditionalTopLevelClassCompile(org.apache.commons.jci.compilers.EclipseJavaCompilerTestCase)

Tests run: 13, Failures: 1, Errors: 0, Skipped: 0

[INFO] ------------------------------------------------------------------------
[ERROR] BUILD FAILURE
[INFO] ------------------------------------------------------------------------
[INFO] There are test failures.

Please refer to /srv/gump/public/workspace/apache-commons/jci/compilers/eclipse/target/surefire-reports for the individual test results.
[INFO] ------------------------------------------------------------------------
[INFO] For more information, run Maven with the -e switch
[INFO] ------------------------------------------------------------------------
[INFO] Total time: 1 minute 28 seconds
[INFO] Finished at: Sat Jul 23 10:32:33 UTC 2011
[INFO] Final Memory: 39M/93M
[INFO] ------------------------------------------------------------------------
---------------------------------------------

To subscribe to this information via syndicated feeds:
- RSS: http://vmgump.apache.org/gump/public/apache-commons/commons-jci-reactor/rss.xml
- Atom: http://vmgump.apache.org/gump/public/apache-commons/commons-jci-reactor/atom.xml

============================== Gump Tracking Only ===
Produced by Apache Gump(TM) version 2.3.
Gump Run 07000623072011, vmgump.apache.org:vmgump:07000623072011
Gump E-mail Identifier (unique within run) #24.

*********************************************************** G U M P
[GUMP@vmgump]: Module opensaml-openws failed
To whom it may engage...
        
This is an automated request, but not an unsolicited one. For 
more information please visit http://gump.apache.org/nagged.html, 
and/or contact the folk at general@gump.apache.org.

Module opensaml-openws has an issue affecting its community integration,
 and has been outstanding for 15 runs.
The current state of this module is 'Failed', with reason 'Update Failed'.

Full details are available at:
    http://vmgump.apache.org/gump/public/opensaml-openws/index.html

That said, some information snippets are provided here.

The following annotations (debug/informational/warning/error messages) were provided:
 -INFO- Failed with reason update failed



The following work was performed:
http://vmgump.apache.org/gump/public/opensaml-openws/gump_work/update_opensaml-openws.html
Work Name: update_opensaml-openws (Type: Update)
Work ended in a state of : Failed
Elapsed: 1 sec
Command Line: svn --quiet checkout https://svn.shibboleth.net/java-openws/branches/REL_1 --non-interactive opensaml-openws 
[Working Directory: /srv/gump/public/workspace/cvs]
---------------------------------------------
svn: OPTIONS of 'https://svn.shibboleth.net/java-openws/branches/REL_1': Server certificate verification failed: issuer is not trusted (https://svn.shibboleth.net)
---------------------------------------------

To subscribe to this information via syndicated feeds:
- RSS: http://vmgump.apache.org/gump/public/opensaml-openws/rss.xml
- Atom: http://vmgump.apache.org/gump/public/opensaml-openws/atom.xml

============================== Gump Tracking Only ===
Produced by Apache Gump(TM) version 2.3.
Gump Run 07000623072011, vmgump.apache.org:vmgump:07000623072011
Gump E-mail Identifier (unique within run) #26.

*********************************************************** G U M P
[GUMP@vmgump]: Project apache-standard-mailets-test (in module apache-mailet) failed
To whom it may engage...
        
This is an automated request, but not an unsolicited one. For 
more information please visit http://gump.apache.org/nagged.html, 
and/or contact the folk at general@gump.apache.org.

Project apache-standard-mailets-test has an issue affecting its community integration.
This issue affects 1 projects,
 and has been outstanding for 123 runs.
The current state of this project is 'Failed', with reason 'Build Failed'.
For reference only, the following projects are affected by this:
    - apache-standard-mailets-test :  Apache Mailet API


Full details are available at:
    http://vmgump.apache.org/gump/public/apache-mailet/apache-standard-mailets-test/index.html

That said, some information snippets are provided here.

The following annotations (debug/informational/warning/error messages) were provided:
 -WARNING- Overriding Maven settings: [/srv/gump/public/workspace/apache-mailet/standard/trunk/gump_mvn_settings.xml]
 -DEBUG- (Apache Gump generated) Apache Maven Settings in: /srv/gump/public/workspace/apache-mailet/standard/trunk/gump_mvn_settings.xml
 -INFO- Failed with reason build failed
 -DEBUG- Maven POM in: /srv/gump/public/workspace/apache-mailet/standard/trunk/pom.xml
 -INFO- Project Reports in: /srv/gump/public/workspace/apache-mailet/standard/trunk/target/surefire-reports
 -WARNING- No directory [/srv/gump/public/workspace/apache-mailet/standard/trunk/target/surefire-reports]
 -DEBUG- Extracted fallback artifacts from Gump Repository



The following work was performed:
http://vmgump.apache.org/gump/public/apache-mailet/apache-standard-mailets-test/gump_work/build_apache-mailet_apache-standard-mailets-test.html
Work Name: build_apache-mailet_apache-standard-mailets-test (Type: Build)
Work ended in a state of : Failed
Elapsed: 11 secs
Command Line: /opt/maven3/bin/mvn --batch-mode --settings /srv/gump/public/workspace/apache-mailet/standard/trunk/gump_mvn_settings.xml package 
[Working Directory: /srv/gump/public/workspace/apache-mailet/standard/trunk]
M2_HOME: /opt/maven3
---------------------------------------------
[INFO] Setting property: velocimacro.messages.on => 'false'.
[INFO] Setting property: resource.loader => 'classpath'.
[INFO] Setting property: resource.manager.logwhenfound => 'false'.
Downloading: http://localhost:8192/maven2/javax/mail/mail/1.4.3/mail-1.4.3.pom
[WARNING] Missing POM for javax.mail:mail:jar:1.4.3
Downloading: http://localhost:8192/maven2/javax/mail/mail/1.4.3/mail-1.4.3.pom
[WARNING] Missing POM for javax.mail:mail:jar:1.4.3
Downloading: http://localhost:8192/maven2/javax/mail/mail/1.4.3/mail-1.4.3.pom
[INFO] 
[INFO] --- maven-resources-plugin:2.4.3:resources (default-resources) @ apache-standard-mailets ---
[INFO] Using 'UTF-8' encoding to copy filtered resources.
[INFO] skip non existing resourceDirectory /srv/gump/public/workspace/apache-mailet/standard/trunk/src/main/resources
[INFO] Copying 3 resources
[INFO] 
[INFO] --- maven-compiler-plugin:2.3.2:compile (default-compile) @ apache-standard-mailets ---
[INFO] Nothing to compile - all classes are up to date
[INFO] 
[INFO] --- maven-bundle-plugin:2.2.0:manifest (bundle-manifest) @ apache-standard-mailets ---
[WARNING] Embed-Dependency: clause "*;scope=runtime" did not match any dependencies
[WARNING] Warning in manifest for org.apache.james:apache-standard-mailets:jar:1.2-SNAPSHOT : Superfluous export-package instructions: [org.apache.james.mailet.standard.*]
[INFO] 
[INFO] --- maven-resources-plugin:2.4.3:testResources (default-testResources) @ apache-standard-mailets ---
[INFO] Using 'UTF-8' encoding to copy filtered resources.
[INFO] Copying 1 resource
[INFO] Copying 3 resources
[INFO] 
[INFO] --- maven-compiler-plugin:2.3.2:testCompile (default-testCompile) @ apache-standard-mailets ---
[INFO] Compiling 40 source files to /srv/gump/public/workspace/apache-mailet/standard/trunk/target/test-classes
[INFO] -------------------------------------------------------------
[ERROR] COMPILATION ERROR : 
[INFO] -------------------------------------------------------------
[ERROR] /srv/gump/public/workspace/apache-mailet/standard/trunk/src/test/java/org/apache/james/transport/matchers/HostIsLocalTest.java:[68,60] <anonymous org.apache.james.transport.matchers.HostIsLocalTest$1> is not abstract and does not override abstract method dnsLookup(java.lang.String,org.apache.mailet.MailetContext.RecordType) in org.apache.mailet.MailetContext
[INFO] 1 error
[INFO] -------------------------------------------------------------
[INFO] ------------------------------------------------------------------------
[INFO] BUILD FAILURE
[INFO] ------------------------------------------------------------------------
[INFO] Total time: 9.957s
[INFO] Finished at: Sat Jul 23 10:41:59 UTC 2011
[INFO] Final Memory: 13M/36M
[INFO] ------------------------------------------------------------------------
[ERROR] Failed to execute goal org.apache.maven.plugins:maven-compiler-plugin:2.3.2:testCompile (default-testCompile) on project apache-standard-mailets: Compilation failure
[ERROR] /srv/gump/public/workspace/apache-mailet/standard/trunk/src/test/java/org/apache/james/transport/matchers/HostIsLocalTest.java:[68,60] <anonymous org.apache.james.transport.matchers.HostIsLocalTest$1> is not abstract and does not override abstract method dnsLookup(java.lang.String,org.apache.mailet.MailetContext.RecordType) in org.apache.mailet.MailetContext
[ERROR] -> [Help 1]
[ERROR] 
[ERROR] To see the full stack trace of the errors, re-run Maven with the -e switch.
[ERROR] Re-run Maven using the -X switch to enable full debug logging.
[ERROR] 
[ERROR] For more information about the errors and possible solutions, please read the following articles:
[ERROR] [Help 1] http://cwiki.apache.org/confluence/display/MAVEN/MojoFailureException
---------------------------------------------

To subscribe to this information via syndicated feeds:
- RSS: http://vmgump.apache.org/gump/public/apache-mailet/apache-standard-mailets-test/rss.xml
- Atom: http://vmgump.apache.org/gump/public/apache-mailet/apache-standard-mailets-test/atom.xml

============================== Gump Tracking Only ===
Produced by Apache Gump(TM) version 2.3.
Gump Run 07000623072011, vmgump.apache.org:vmgump:07000623072011
Gump E-mail Identifier (unique within run) #27.

*********************************************************** G U M P
[GUMP@vmgump]: Project camel-test (in module camel) failed
To whom it may engage...
        
This is an automated request, but not an unsolicited one. For 
more information please visit http://gump.apache.org/nagged.html, 
and/or contact the folk at general@gump.apache.org.

Project camel-test has an issue affecting its community integration.
This issue affects 3 projects,
 and has been outstanding for 67 runs.
The current state of this project is 'Failed', with reason 'Build Failed'.
For reference only, the following projects are affected by this:
    - camel-jms :  Camel :: JMS
    - camel-jms-test :  Integration framework based on known Enterprise Integration
...
    - camel-test :  Camel :: Test


Full details are available at:
    http://vmgump.apache.org/gump/public/camel/camel-test/index.html

That said, some information snippets are provided here.

The following annotations (debug/informational/warning/error messages) were provided:
 -DEBUG- Sole jar output [camel-test-*[0-9T].jar] identifier set to project name
 -DEBUG- (Apache Gump generated) Apache Maven Settings in: /srv/gump/public/workspace/camel/components/camel-test/gump_mvn_settings.xml
 -INFO- Failed with reason build failed
 -DEBUG- Maven POM in: /srv/gump/public/workspace/camel/components/camel-test/pom.xml
 -INFO- Failed to extract fallback artifacts from Gump Repository



The following work was performed:
http://vmgump.apache.org/gump/public/camel/camel-test/gump_work/build_camel_camel-test.html
Work Name: build_camel_camel-test (Type: Build)
Work ended in a state of : Failed
Elapsed: 18 secs
Command Line: /opt/maven2/bin/mvn --batch-mode --settings /srv/gump/public/workspace/camel/components/camel-test/gump_mvn_settings.xml install 
[Working Directory: /srv/gump/public/workspace/camel/components/camel-test]
M2_HOME: /opt/maven2
---------------------------------------------
Tests run: 2, Failures: 0, Errors: 2, Skipped: 0, Time elapsed: 0.131 sec <<< FAILURE!
Running org.apache.camel.test.patterns.DebugTest
Tests run: 2, Failures: 0, Errors: 2, Skipped: 0, Time elapsed: 0.056 sec <<< FAILURE!
Running org.apache.camel.test.patterns.FilterJUnit4Test
Tests run: 2, Failures: 0, Errors: 2, Skipped: 0, Time elapsed: 0.127 sec <<< FAILURE!
Running org.apache.camel.test.patterns.FilterCreateCamelContextPerClassTest
Tests run: 2, Failures: 0, Errors: 2, Skipped: 0, Time elapsed: 0.051 sec <<< FAILURE!
Running org.apache.camel.test.patterns.IsMockEndpointsJUnit4Test
Tests run: 1, Failures: 0, Errors: 1, Skipped: 0, Time elapsed: 0.039 sec <<< FAILURE!
Running org.apache.camel.test.patterns.DebugNoLazyTypeConverterTest
Tests run: 2, Failures: 0, Errors: 2, Skipped: 0, Time elapsed: 0.05 sec <<< FAILURE!
Running org.apache.camel.test.patterns.IsMockEndpointsTest
Tests run: 1, Failures: 0, Errors: 1, Skipped: 0, Time elapsed: 0.028 sec <<< FAILURE!
Running org.apache.camel.test.patterns.FilterTest
Tests run: 2, Failures: 0, Errors: 2, Skipped: 0, Time elapsed: 0.062 sec <<< FAILURE!

Results :

Tests in error: 
  testMockFileEndpoints(org.apache.camel.test.patterns.IsMockEndpointsFileTest): org.slf4j.helpers.MessageFormatter.format(Ljava/lang/String;Ljava/lang/Object;Ljava/lang/Object;)Ljava/lang/String;
  testDebugger(org.apache.camel.test.patterns.DebugJUnit4Test): org.slf4j.helpers.MessageFormatter.format(Ljava/lang/String;Ljava/lang/Object;Ljava/lang/Object;)Ljava/lang/String;
  testTwo(org.apache.camel.test.patterns.DebugJUnit4Test): org.slf4j.helpers.MessageFormatter.format(Ljava/lang/String;Ljava/lang/Object;Ljava/lang/Object;)Ljava/lang/String;
  testDebugger(org.apache.camel.test.patterns.DebugTest): org.slf4j.helpers.MessageFormatter.format(Ljava/lang/String;Ljava/lang/Object;Ljava/lang/Object;)Ljava/lang/String;
  testTwo(org.apache.camel.test.patterns.DebugTest): org.slf4j.helpers.MessageFormatter.format(Ljava/lang/String;Ljava/lang/Object;Ljava/lang/Object;)Ljava/lang/String;
  testSendMatchingMessage(org.apache.camel.test.patterns.FilterJUnit4Test): org.slf4j.helpers.MessageFormatter.format(Ljava/lang/String;Ljava/lang/Object;Ljava/lang/Object;)Ljava/lang/String;
  testSendNotMatchingMessage(org.apache.camel.test.patterns.FilterJUnit4Test): org.slf4j.helpers.MessageFormatter.format(Ljava/lang/String;Ljava/lang/Object;Ljava/lang/Object;)Ljava/lang/String;
  testSendMatchingMessage(org.apache.camel.test.patterns.FilterCreateCamelContextPerClassTest): org.slf4j.helpers.MessageFormatter.format(Ljava/lang/String;Ljava/lang/Object;Ljava/lang/Object;)Ljava/lang/String;
  testSendNotMatchingMessage(org.apache.camel.test.patterns.FilterCreateCamelContextPerClassTest): Exception occurred during execution on the exchange: Exchange[Message: <notMatched/>]
  testMockAllEndpoints(org.apache.camel.test.patterns.IsMockEndpointsJUnit4Test): org.slf4j.helpers.MessageFormatter.format(Ljava/lang/String;Ljava/lang/Object;Ljava/lang/Object;)Ljava/lang/String;
  testDebugger(org.apache.camel.test.patterns.DebugNoLazyTypeConverterTest): org.slf4j.helpers.MessageFormatter.format(Ljava/lang/String;Ljava/lang/Object;Ljava/lang/Object;)Ljava/lang/String;
  testTwo(org.apache.camel.test.patterns.DebugNoLazyTypeConverterTest): org.slf4j.helpers.MessageFormatter.format(Ljava/lang/String;Ljava/lang/Object;Ljava/lang/Object;)Ljava/lang/String;
  testMockAllEndpoints(org.apache.camel.test.patterns.IsMockEndpointsTest): org.slf4j.helpers.MessageFormatter.format(Ljava/lang/String;Ljava/lang/Object;Ljava/lang/Object;)Ljava/lang/String;
  testSendMatchingMessage(org.apache.camel.test.patterns.FilterTest): org.slf4j.helpers.MessageFormatter.format(Ljava/lang/String;Ljava/lang/Object;Ljava/lang/Object;)Ljava/lang/String;
  testSendNotMatchingMessage(org.apache.camel.test.patterns.FilterTest): org.slf4j.helpers.MessageFormatter.format(Ljava/lang/String;Ljava/lang/Object;Ljava/lang/Object;)Ljava/lang/String;

Tests run: 20, Failures: 0, Errors: 15, Skipped: 0

[INFO] ------------------------------------------------------------------------
[ERROR] BUILD FAILURE
[INFO] ------------------------------------------------------------------------
[INFO] There are test failures.

Please refer to /srv/gump/public/workspace/camel/components/camel-test/target/surefire-reports for the individual test results.
[INFO] ------------------------------------------------------------------------
[INFO] For more information, run Maven with the -e switch
[INFO] ------------------------------------------------------------------------
[INFO] Total time: 17 seconds
[INFO] Finished at: Sat Jul 23 10:43:16 UTC 2011
[INFO] Final Memory: 26M/62M
[INFO] ------------------------------------------------------------------------
---------------------------------------------

To subscribe to this information via syndicated feeds:
- RSS: http://vmgump.apache.org/gump/public/camel/camel-test/rss.xml
- Atom: http://vmgump.apache.org/gump/public/camel/camel-test/atom.xml

============================== Gump Tracking Only ===
Produced by Apache Gump(TM) version 2.3.
Gump Run 07000623072011, vmgump.apache.org:vmgump:07000623072011
Gump E-mail Identifier (unique within run) #28.

*********************************************************** G U M P
[GUMP@vmgump]: Project velocity-tools-generic (in module velocity-tools) failed
To whom it may engage...
        
This is an automated request, but not an unsolicited one. For 
more information please visit http://gump.apache.org/nagged.html, 
and/or contact the folk at general@gump.apache.org.

Project velocity-tools-generic has an issue affecting its community integration.
This issue affects 3 projects,
 and has been outstanding for 123 runs.
The current state of this project is 'Failed', with reason 'Build Failed'.
For reference only, the following projects are affected by this:
    - velocity-tools-generic :  VelocityTools project
    - velocity-tools-reactor :  VelocityTools project
    - velocity-tools-view :  VelocityTools project


Full details are available at:
    http://vmgump.apache.org/gump/public/velocity-tools/velocity-tools-generic/index.html

That said, some information snippets are provided here.

The following annotations (debug/informational/warning/error messages) were provided:
 -DEBUG- Sole jar output [velocity-tools-generic-*[0-9T].jar] identifier set to project name
 -DEBUG- (Apache Gump generated) Apache Maven Settings in: /srv/gump/public/workspace/velocity-tools/velocity-tools-generic/gump_mvn_settings.xml
 -INFO- Failed with reason build failed
 -DEBUG- Maven POM in: /srv/gump/public/workspace/velocity-tools/velocity-tools-generic/pom.xml
 -INFO- Failed to extract fallback artifacts from Gump Repository



The following work was performed:
http://vmgump.apache.org/gump/public/velocity-tools/velocity-tools-generic/gump_work/build_velocity-tools_velocity-tools-generic.html
Work Name: build_velocity-tools_velocity-tools-generic (Type: Build)
Work ended in a state of : Failed
Elapsed: 19 secs
Command Line: /opt/maven2/bin/mvn --batch-mode --settings /srv/gump/public/workspace/velocity-tools/velocity-tools-generic/gump_mvn_settings.xml install 
[Working Directory: /srv/gump/public/workspace/velocity-tools/velocity-tools-generic]
M2_HOME: /opt/maven2
---------------------------------------------
[INFO] Using 'UTF-8' encoding to copy filtered resources.
[INFO] Copying 9 resources
[INFO] Copying 3 resources
[INFO] [compiler:testCompile {execution: default-testCompile}]
[INFO] Compiling 11 source files to /srv/gump/public/workspace/velocity-tools/velocity-tools-generic/target/test-classes
[INFO] [surefire:test {execution: default-test}]
[INFO] Surefire report directory: /srv/gump/public/workspace/velocity-tools/velocity-tools-generic/target/surefire-reports

-------------------------------------------------------
 T E S T S
-------------------------------------------------------
Running org.apache.velocity.tools.generic.DisplayToolTests
Tests run: 36, Failures: 0, Errors: 0, Skipped: 0, Time elapsed: 0.221 sec
Running org.apache.velocity.tools.generic.ClassToolTests
Tests run: 26, Failures: 0, Errors: 0, Skipped: 0, Time elapsed: 0.057 sec
Running org.apache.velocity.tools.generic.LoopToolTests
Tests run: 21, Failures: 0, Errors: 0, Skipped: 0, Time elapsed: 0.061 sec
Running org.apache.velocity.tools.test.whitebox.ConfigTests
Jul 23, 2011 10:43:41 AM org.apache.commons.beanutils.converters.NumberConverter toNumber
WARNING:     IntegerConverter cannot handle conversion from 'String' to 'Number'
Tests run: 14, Failures: 0, Errors: 0, Skipped: 0, Time elapsed: 0.324 sec
Running org.apache.velocity.tools.test.whitebox.GenericToolsTests
Tests run: 7, Failures: 0, Errors: 1, Skipped: 0, Time elapsed: 0.196 sec <<< FAILURE!
Running org.apache.velocity.tools.generic.Veltools128Tests
Tests run: 2, Failures: 0, Errors: 0, Skipped: 0, Time elapsed: 0.145 sec
Running org.apache.velocity.tools.generic.AlternatorToolTests
Tests run: 7, Failures: 0, Errors: 0, Skipped: 0, Time elapsed: 0.007 sec
Running org.apache.velocity.tools.generic.LinkToolTests
Tests run: 69, Failures: 0, Errors: 0, Skipped: 0, Time elapsed: 0.162 sec

Results :

Tests in error: 
  testEscapeTool(org.apache.velocity.tools.test.whitebox.GenericToolsTests)

Tests run: 182, Failures: 0, Errors: 1, Skipped: 0

[INFO] ------------------------------------------------------------------------
[ERROR] BUILD FAILURE
[INFO] ------------------------------------------------------------------------
[INFO] There are test failures.

Please refer to /srv/gump/public/workspace/velocity-tools/velocity-tools-generic/target/surefire-reports for the individual test results.
[INFO] ------------------------------------------------------------------------
[INFO] For more information, run Maven with the -e switch
[INFO] ------------------------------------------------------------------------
[INFO] Total time: 18 seconds
[INFO] Finished at: Sat Jul 23 10:43:41 UTC 2011
[INFO] Final Memory: 23M/57M
[INFO] ------------------------------------------------------------------------
---------------------------------------------

To subscribe to this information via syndicated feeds:
- RSS: http://vmgump.apache.org/gump/public/velocity-tools/velocity-tools-generic/rss.xml
- Atom: http://vmgump.apache.org/gump/public/velocity-tools/velocity-tools-generic/atom.xml

============================== Gump Tracking Only ===
Produced by Apache Gump(TM) version 2.3.
Gump Run 07000623072011, vmgump.apache.org:vmgump:07000623072011
Gump E-mail Identifier (unique within run) #29.

*********************************************************** G U M P
[GUMP@vmgump]: Project htmlunit (in module htmlunit) failed
To whom it may engage...
        
This is an automated request, but not an unsolicited one. For 
more information please visit http://gump.apache.org/nagged.html, 
and/or contact the folk at general@gump.apache.org.

Project htmlunit has an issue affecting its community integration.
This issue affects 1 projects,
 and has been outstanding for 682 runs.
The current state of this project is 'Failed', with reason 'Build Failed'.
For reference only, the following projects are affected by this:
    - htmlunit :  A tool for testing web based applications


Full details are available at:
    http://vmgump.apache.org/gump/public/htmlunit/htmlunit/index.html

That said, some information snippets are provided here.

The following annotations (debug/informational/warning/error messages) were provided:
 -DEBUG- Sole jar output [htmlunit-*[0-9T].jar] identifier set to project name
 -INFO- Optional dependency commons-fileupload prerequisite failed with reason build failed
 -INFO- Optional dependency httpcomponents-client failed with reason build failed
 -DEBUG- (Apache Gump generated) Apache Maven Settings in: /srv/gump/public/workspace/htmlunit/htmlunit/gump_mvn_settings.xml
 -INFO- Failed with reason build failed
 -DEBUG- Maven POM in: /srv/gump/public/workspace/htmlunit/htmlunit/pom.xml
 -INFO- Failed to extract fallback artifacts from Gump Repository



The following work was performed:
http://vmgump.apache.org/gump/public/htmlunit/htmlunit/gump_work/build_htmlunit_htmlunit.html
Work Name: build_htmlunit_htmlunit (Type: Build)
Work ended in a state of : Failed
Elapsed: 28 mins 12 secs
Command Line: /opt/maven2/bin/mvn --batch-mode --settings /srv/gump/public/workspace/htmlunit/htmlunit/gump_mvn_settings.xml package 
[Working Directory: /srv/gump/public/workspace/htmlunit/htmlunit]
M2_HOME: /opt/maven2
---------------------------------------------
  HtmlPage2Test.save_css_empty_href [IE6](com.gargoylesoftware.htmlunit.html.HtmlPage2Test)
  HtmlPage2Test.save_css_without_href [IE6](com.gargoylesoftware.htmlunit.html.HtmlPage2Test)
  HtmlPage2Test.save_frames [IE6](com.gargoylesoftware.htmlunit.html.HtmlPage2Test)
  HtmlPage2Test.save_image [IE6](com.gargoylesoftware.htmlunit.html.HtmlPage2Test)
  HtmlPage2Test.save_imageNotImage [IE6](com.gargoylesoftware.htmlunit.html.HtmlPage2Test)
  HtmlPage2Test.save_image_empty_src [IE6](com.gargoylesoftware.htmlunit.html.HtmlPage2Test)
  HtmlPage2Test.save_image_without_src [IE6](com.gargoylesoftware.htmlunit.html.HtmlPage2Test)
  HtmlPage2Test.save [IE7](com.gargoylesoftware.htmlunit.html.HtmlPage2Test)
  HtmlPage2Test.save_css [IE7](com.gargoylesoftware.htmlunit.html.HtmlPage2Test)
  HtmlPage2Test.save_css_empty_href [IE7](com.gargoylesoftware.htmlunit.html.HtmlPage2Test)
  HtmlPage2Test.save_css_without_href [IE7](com.gargoylesoftware.htmlunit.html.HtmlPage2Test)
  HtmlPage2Test.save_frames [IE7](com.gargoylesoftware.htmlunit.html.HtmlPage2Test)
  HtmlPage2Test.save_image [IE7](com.gargoylesoftware.htmlunit.html.HtmlPage2Test)
  HtmlPage2Test.save_imageNotImage [IE7](com.gargoylesoftware.htmlunit.html.HtmlPage2Test)
  HtmlPage2Test.save_image_empty_src [IE7](com.gargoylesoftware.htmlunit.html.HtmlPage2Test)
  HtmlPage2Test.save_image_without_src [IE7](com.gargoylesoftware.htmlunit.html.HtmlPage2Test)
  HtmlPage2Test.save [IE8](com.gargoylesoftware.htmlunit.html.HtmlPage2Test)
  HtmlPage2Test.save_css [IE8](com.gargoylesoftware.htmlunit.html.HtmlPage2Test)
  HtmlPage2Test.save_css_empty_href [IE8](com.gargoylesoftware.htmlunit.html.HtmlPage2Test)
  HtmlPage2Test.save_css_without_href [IE8](com.gargoylesoftware.htmlunit.html.HtmlPage2Test)
  HtmlPage2Test.save_frames [IE8](com.gargoylesoftware.htmlunit.html.HtmlPage2Test)
  HtmlPage2Test.save_image [IE8](com.gargoylesoftware.htmlunit.html.HtmlPage2Test)
  HtmlPage2Test.save_imageNotImage [IE8](com.gargoylesoftware.htmlunit.html.HtmlPage2Test)
  HtmlPage2Test.save_image_empty_src [IE8](com.gargoylesoftware.htmlunit.html.HtmlPage2Test)
  HtmlPage2Test.save_image_without_src [IE8](com.gargoylesoftware.htmlunit.html.HtmlPage2Test)
  HtmlAppletTest.simpleInstantiation [FF3](com.gargoylesoftware.htmlunit.html.HtmlAppletTest)
  HtmlAppletTest.simpleInstantiation [FF3.6](com.gargoylesoftware.htmlunit.html.HtmlAppletTest)
  HtmlAppletTest.simpleInstantiation [IE6](com.gargoylesoftware.htmlunit.html.HtmlAppletTest)
  HtmlAppletTest.simpleInstantiation [IE7](com.gargoylesoftware.htmlunit.html.HtmlAppletTest)
  HtmlAppletTest.simpleInstantiation [IE8](com.gargoylesoftware.htmlunit.html.HtmlAppletTest)
  HtmlSelectTest.savePageSavesSelectedOption [FF3.6](com.gargoylesoftware.htmlunit.html.HtmlSelectTest)
  HtmlSelectTest.savePageSavesSelectedOption [IE6](com.gargoylesoftware.htmlunit.html.HtmlSelectTest)
  HtmlSelectTest.savePageSavesSelectedOption [IE7](com.gargoylesoftware.htmlunit.html.HtmlSelectTest)
  HtmlSelectTest.savePageSavesSelectedOption [IE8](com.gargoylesoftware.htmlunit.html.HtmlSelectTest)

Tests run: 19109, Failures: 2, Errors: 52, Skipped: 0

[INFO] ------------------------------------------------------------------------
[ERROR] BUILD FAILURE
[INFO] ------------------------------------------------------------------------
[INFO] There are test failures.

Please refer to /srv/gump/public/workspace/htmlunit/htmlunit/target/surefire-reports for the individual test results.
[INFO] ------------------------------------------------------------------------
[INFO] For more information, run Maven with the -e switch
[INFO] ------------------------------------------------------------------------
[INFO] Total time: 28 minutes 2 seconds
[INFO] Finished at: Sat Jul 23 11:11:55 UTC 2011
[INFO] Final Memory: 41M/125M
[INFO] ------------------------------------------------------------------------
---------------------------------------------

To subscribe to this information via syndicated feeds:
- RSS: http://vmgump.apache.org/gump/public/htmlunit/htmlunit/rss.xml
- Atom: http://vmgump.apache.org/gump/public/htmlunit/htmlunit/atom.xml

============================== Gump Tracking Only ===
Produced by Apache Gump(TM) version 2.3.
Gump Run 07000623072011, vmgump.apache.org:vmgump:07000623072011
Gump E-mail Identifier (unique within run) #30.

*********************************************************** G U M P
[GUMP@vmgump]: Module opensaml failed
To whom it may engage...
        
This is an automated request, but not an unsolicited one. For 
more information please visit http://gump.apache.org/nagged.html, 
and/or contact the folk at general@gump.apache.org.

Module opensaml has an issue affecting its community integration,
 and has been outstanding for 15 runs.
The current state of this module is 'Failed', with reason 'Update Failed'.

Full details are available at:
    http://vmgump.apache.org/gump/public/opensaml/index.html

That said, some information snippets are provided here.

The following annotations (debug/informational/warning/error messages) were provided:
 -INFO- Failed with reason update failed



The following work was performed:
http://vmgump.apache.org/gump/public/opensaml/gump_work/update_opensaml.html
Work Name: update_opensaml (Type: Update)
Work ended in a state of : Failed
Elapsed: 1 sec
Command Line: svn --quiet checkout https://svn.shibboleth.net/java-opensaml2/branches/REL_2 --non-interactive opensaml 
[Working Directory: /srv/gump/public/workspace/cvs]
---------------------------------------------
svn: OPTIONS of 'https://svn.shibboleth.net/java-opensaml2/branches/REL_2': Server certificate verification failed: issuer is not trusted (https://svn.shibboleth.net)
---------------------------------------------

To subscribe to this information via syndicated feeds:
- RSS: http://vmgump.apache.org/gump/public/opensaml/rss.xml
- Atom: http://vmgump.apache.org/gump/public/opensaml/atom.xml

============================== Gump Tracking Only ===
Produced by Apache Gump(TM) version 2.3.
Gump Run 07000623072011, vmgump.apache.org:vmgump:07000623072011
Gump E-mail Identifier (unique within run) #32.

*********************************************************** G U M P
[GUMP@vmgump]: Project cocoon22-blocks-modules (in module cocoon) failed
To whom it may engage...
        
This is an automated request, but not an unsolicited one. For 
more information please visit http://gump.apache.org/nagged.html, 
and/or contact the folk at general@gump.apache.org.

Project cocoon22-blocks-modules has an issue affecting its community integration.
This issue affects 8 projects,
 and has been outstanding for 123 runs.
The current state of this project is 'Failed', with reason 'Build Failed'.
For reference only, the following projects are affected by this:
    - cocoon22-blocks-modules :  Java XML Framework
    - cocoon22-chaperon-impl :  Java XML Framework
    - cocoon22-chaperon-impl-test :  Java XML Framework
    - cocoon22-flowscript-impl :  Java XML Framework
    - cocoon22-validation-impl :  Java XML Framework
    - cocoon22-validation-parent :  Java XML Framework
    - lenya-core-api :  Content Management System
    - lenya-reactor :  Content Management System


Full details are available at:
    http://vmgump.apache.org/gump/public/cocoon/cocoon22-blocks-modules/index.html

That said, some information snippets are provided here.

The following annotations (debug/informational/warning/error messages) were provided:
 -DEBUG- (Apache Gump generated) Apache Maven Settings in: /srv/gump/public/workspace/cocoon/blocks/gump_mvn_settings.xml
 -INFO- Failed with reason build failed
 -DEBUG- Maven POM in: /srv/gump/public/workspace/cocoon/blocks/pom.xml
 -INFO- Failed to extract fallback artifacts from Gump Repository



The following work was performed:
http://vmgump.apache.org/gump/public/cocoon/cocoon22-blocks-modules/gump_work/build_cocoon_cocoon22-blocks-modules.html
Work Name: build_cocoon_cocoon22-blocks-modules (Type: Build)
Work ended in a state of : Failed
Elapsed: 7 secs
Command Line: /opt/maven2/bin/mvn --batch-mode -Dpackaging=pom -DgroupId=org.apache.cocoon -Dfile=pom.xml -DartifactId=cocoon-blocks-modules -Dversion=6-SNAPSHOT --settings /srv/gump/public/workspace/cocoon/blocks/gump_mvn_settings.xml install:install-file 
[Working Directory: /srv/gump/public/workspace/cocoon/blocks]
M2_HOME: /opt/maven2
---------------------------------------------
Downloading: http://localhost:8192/maven2/org/apache/maven/plugins/maven-jar-plugin/2.1/maven-jar-plugin-2.1.pom

Downloading: http://localhost:8192/maven2/org/apache/maven/plugins/maven-jar-plugin/2.1/maven-jar-plugin-2.1.jar

[INFO] snapshot org.apache.cocoon:cocoon-maven-plugin:1.0.0-RC1-SNAPSHOT: checking for updates from gkossakowski-maven2
[INFO] snapshot org.apache.cocoon:cocoon-maven-plugin:1.0.0-RC1-SNAPSHOT: checking for updates from apache.snapshots
Downloading: http://people.apache.org/~gkossakowski/maven2/repository/org/apache/cocoon/cocoon-maven-plugin/1.0.0-RC1-SNAPSHOT/cocoon-maven-plugin-1.0.0-RC1-SNAPSHOT.pom
[INFO] Unable to find resource 'org.apache.cocoon:cocoon-maven-plugin:pom:1.0.0-RC1-SNAPSHOT' in repository gkossakowski-maven2 (http://people.apache.org/~gkossakowski/maven2/repository)
Downloading: http://localhost:8192/repo/m2-snapshot-repository/org/apache/cocoon/cocoon-maven-plugin/1.0.0-RC1-SNAPSHOT/cocoon-maven-plugin-1.0.0-RC1-SNAPSHOT.pom
4K downloaded  (cocoon-maven-plugin-1.0.0-RC1-SNAPSHOT.pom)
[INFO] snapshot org.apache.cocoon:cocoon-tools-modules:5-SNAPSHOT: checking for updates from gkossakowski-maven2
[INFO] snapshot org.apache.cocoon:cocoon-tools-modules:5-SNAPSHOT: checking for updates from apache.snapshots
[INFO] Cannot find mojo descriptor for: 'install:install-file' - Treating as non-aggregator.
[INFO] ------------------------------------------------------------------------
[INFO] Building Cocoon Blocks [modules]
[INFO]    task-segment: [install:install-file]
[INFO] ------------------------------------------------------------------------
[INFO] ------------------------------------------------------------------------
[ERROR] BUILD FAILURE
[INFO] ------------------------------------------------------------------------
[INFO] A required plugin was not found: Plugin could not be found - check that the goal name is correct: Unable to download the artifact from any repository

Try downloading the file manually from the project website.

Then, install it using the command: 
    mvn install:install-file -DgroupId=org.apache.cocoon -DartifactId=cocoon-maven-plugin -Dversion=1.0.0-RC1-SNAPSHOT -Dpackaging=maven-plugin -Dfile=/path/to/file

Alternatively, if you host your own repository you can deploy the file there: 
    mvn deploy:deploy-file -DgroupId=org.apache.cocoon -DartifactId=cocoon-maven-plugin -Dversion=1.0.0-RC1-SNAPSHOT -Dpackaging=maven-plugin -Dfile=/path/to/file -Durl=[url] -DrepositoryId=[id]


  org.apache.cocoon:cocoon-maven-plugin:maven-plugin:1.0.0-RC1-SNAPSHOT

from the specified remote repositories:
  gump-central (http://localhost:8192/maven2)


  org.apache.cocoon:cocoon-maven-plugin:maven-plugin:1.0.0-RC1-SNAPSHOT

from the specified remote repositories:
  gump-central (http://localhost:8192/maven2)


[INFO] ------------------------------------------------------------------------
[INFO] For more information, run Maven with the -e switch
[INFO] ------------------------------------------------------------------------
[INFO] Total time: 6 seconds
[INFO] Finished at: Sat Jul 23 11:26:05 UTC 2011
[INFO] Final Memory: 15M/36M
[INFO] ------------------------------------------------------------------------
---------------------------------------------

To subscribe to this information via syndicated feeds:
- RSS: http://vmgump.apache.org/gump/public/cocoon/cocoon22-blocks-modules/rss.xml
- Atom: http://vmgump.apache.org/gump/public/cocoon/cocoon22-blocks-modules/atom.xml

============================== Gump Tracking Only ===
Produced by Apache Gump(TM) version 2.3.
Gump Run 07000623072011, vmgump.apache.org:vmgump:07000623072011
Gump E-mail Identifier (unique within run) #33.

*********************************************************** G U M P
[GUMP@vmgump]: Project james-jsieve (in module james-jsieve) failed
To whom it may engage...
        
This is an automated request, but not an unsolicited one. For 
more information please visit http://gump.apache.org/nagged.html, 
and/or contact the folk at general@gump.apache.org.

Project james-jsieve has an issue affecting its community integration.
This issue affects 1 projects,
 and has been outstanding for 123 runs.
The current state of this project is 'Failed', with reason 'Build Failed'.
For reference only, the following projects are affected by this:
    - james-jsieve :  Implements JSIEVE Mail Filtering Language


Full details are available at:
    http://vmgump.apache.org/gump/public/james-jsieve/james-jsieve/index.html

That said, some information snippets are provided here.

The following annotations (debug/informational/warning/error messages) were provided:
 -WARNING- Overriding Maven settings: [/srv/gump/public/workspace/james-jsieve/gump_mvn_settings.xml]
 -DEBUG- (Apache Gump generated) Apache Maven Settings in: /srv/gump/public/workspace/james-jsieve/gump_mvn_settings.xml
 -INFO- Failed with reason build failed
 -DEBUG- Maven POM in: /srv/gump/public/workspace/james-jsieve/pom.xml



The following work was performed:
http://vmgump.apache.org/gump/public/james-jsieve/james-jsieve/gump_work/build_james-jsieve_james-jsieve.html
Work Name: build_james-jsieve_james-jsieve (Type: Build)
Work ended in a state of : Failed
Elapsed: 14 secs
Command Line: /opt/maven3/bin/mvn --batch-mode --settings /srv/gump/public/workspace/james-jsieve/gump_mvn_settings.xml install 
[Working Directory: /srv/gump/public/workspace/james-jsieve]
M2_HOME: /opt/maven3
---------------------------------------------
[INFO] Using 'UTF-8' encoding to copy filtered resources.
[INFO] Copying 3 resources
[INFO] Copying 3 resources
[INFO] 
[INFO] --- maven-compiler-plugin:2.3.2:compile (default-compile) @ apache-jsieve ---
[INFO] Nothing to compile - all classes are up to date
[INFO] 
[INFO] --- maven-bundle-plugin:2.2.0:manifest (bundle-manifest) @ apache-jsieve ---
[WARNING] Embed-Dependency: clause "*;scope=runtime" did not match any dependencies
[INFO] 
[INFO] --- maven-resources-plugin:2.4.3:testResources (default-testResources) @ apache-jsieve ---
[INFO] Using 'UTF-8' encoding to copy filtered resources.
[INFO] Copying 2 resources
[INFO] Copying 3 resources
[INFO] 
[INFO] --- maven-compiler-plugin:2.3.2:testCompile (default-testCompile) @ apache-jsieve ---
[INFO] Compiling 50 source files to /srv/gump/public/workspace/james-jsieve/main/target/test-classes
[INFO] -------------------------------------------------------------
[ERROR] COMPILATION ERROR : 
[INFO] -------------------------------------------------------------
[ERROR] /srv/gump/public/workspace/james-jsieve/main/src/test/java/org/apache/jsieve/AllTests.java:[31,21] package junit.swingui does not exist
[INFO] 1 error
[INFO] -------------------------------------------------------------
[INFO] ------------------------------------------------------------------------
[INFO] Reactor Summary:
[INFO] 
[INFO] Apache JAMES JSieve Project ....................... SUCCESS [4.524s]
[INFO] Apache JAMES jSieve ............................... FAILURE [6.401s]
[INFO] Apache JAMES jSieve Mailet ........................ SKIPPED
[INFO] Apache JAMES jSieve Utilities ..................... SKIPPED
[INFO] Apache JAMES jSieve Assembly ...................... SKIPPED
[INFO] ------------------------------------------------------------------------
[INFO] BUILD FAILURE
[INFO] ------------------------------------------------------------------------
[INFO] Total time: 13.055s
[INFO] Finished at: Sat Jul 23 11:29:03 UTC 2011
[INFO] Final Memory: 19M/45M
[INFO] ------------------------------------------------------------------------
[ERROR] Failed to execute goal org.apache.maven.plugins:maven-compiler-plugin:2.3.2:testCompile (default-testCompile) on project apache-jsieve: Compilation failure
[ERROR] /srv/gump/public/workspace/james-jsieve/main/src/test/java/org/apache/jsieve/AllTests.java:[31,21] package junit.swingui does not exist
[ERROR] -> [Help 1]
[ERROR] 
[ERROR] To see the full stack trace of the errors, re-run Maven with the -e switch.
[ERROR] Re-run Maven using the -X switch to enable full debug logging.
[ERROR] 
[ERROR] For more information about the errors and possible solutions, please read the following articles:
[ERROR] [Help 1] http://cwiki.apache.org/confluence/display/MAVEN/MojoFailureException
[ERROR] 
[ERROR] After correcting the problems, you can resume the build with the command
[ERROR]   mvn <goals> -rf :apache-jsieve
---------------------------------------------

To subscribe to this information via syndicated feeds:
- RSS: http://vmgump.apache.org/gump/public/james-jsieve/james-jsieve/rss.xml
- Atom: http://vmgump.apache.org/gump/public/james-jsieve/james-jsieve/atom.xml

============================== Gump Tracking Only ===
Produced by Apache Gump(TM) version 2.3.
Gump Run 07000623072011, vmgump.apache.org:vmgump:07000623072011
Gump E-mail Identifier (unique within run) #34.

*********************************************************** G U M P
[GUMP@vmgump]: Project commons-jelly-tags-ant-test (in module commons-jelly) failed
To whom it may engage...
        
This is an automated request, but not an unsolicited one. For 
more information please visit http://gump.apache.org/nagged.html, 
and/or contact the folk at general@gump.apache.org.

Project commons-jelly-tags-ant-test has an issue affecting its community integration.
This issue affects 1 projects.
The current state of this project is 'Failed', with reason 'Build Failed'.
For reference only, the following projects are affected by this:
    - commons-jelly-tags-ant-test :  Commons Jelly


Full details are available at:
    http://vmgump.apache.org/gump/public/commons-jelly/commons-jelly-tags-ant-test/index.html

That said, some information snippets are provided here.

The following annotations (debug/informational/warning/error messages) were provided:
 -DEBUG- Dependency on ant exists, no need to add for property maven.jar.ant-optional.
 -DEBUG- Dependency on xml-xerces exists, no need to add for property maven.jar.xerces.
 -DEBUG- Dependency on commons-jexl-1.x exists, no need to add for property maven.jar.commons-jexl.
 -WARNING- Overriding Maven properties: [/srv/gump/public/workspace/commons-jelly/jelly-tags/ant/build.properties]
 -DEBUG- (Apache Gump generated) Apache Maven Properties in: /srv/gump/public/workspace/commons-jelly/jelly-tags/ant/build.properties
 -INFO- Failed with reason build failed
 -DEBUG- Maven POM in: /srv/gump/public/workspace/commons-jelly/jelly-tags/ant/project.xml
 -DEBUG- Maven project properties in: /srv/gump/public/workspace/commons-jelly/jelly-tags/ant/project.properties
 -INFO- Project Reports in: /srv/gump/public/workspace/commons-jelly/jelly-tags/ant/target/test-reports



The following work was performed:
http://vmgump.apache.org/gump/public/commons-jelly/commons-jelly-tags-ant-test/gump_work/build_commons-jelly_commons-jelly-tags-ant-test.html
Work Name: build_commons-jelly_commons-jelly-tags-ant-test (Type: Build)
Work ended in a state of : Failed
Elapsed: 9 secs
Command Line: maven --offline jar 
[Working Directory: /srv/gump/public/workspace/commons-jelly/jelly-tags/ant]
---------------------------------------------
    [junit] Actual expression: (${foo4.1})=(null)
    [junit] 	at org.apache.commons.jelly.tags.junit.AssertTagSupport.fail(AssertTagSupport.java:44)
    [junit] 	at org.apache.commons.jelly.tags.junit.AssertTagSupport.failNotEquals(AssertTagSupport.java:77)
    [junit] 	at org.apache.commons.jelly.tags.junit.AssertEqualsTag.doTag(AssertEqualsTag.java:56)
    [junit] 	at org.apache.commons.jelly.impl.TagScript.run(TagScript.java:267)
    [junit] 	at org.apache.commons.jelly.impl.ScriptBlock.run(ScriptBlock.java:96)
    [junit] 	at org.apache.commons.jelly.tags.junit.CaseTag$1.runTest(CaseTag.java:60)
    [junit] 
    [junit] 
    [junit] Testcase: startUpReadWrite(org.apache.commons.jelly.tags.junit.CaseTag$1):	Caused an ERROR
    [junit] file:/srv/gump/public/workspace/commons-jelly/jelly-tags/ant/target/test-classes/org/apache/commons/jelly/ant/suite.jelly:98:5: <test:assertEquals> file:/srv/gump/public/workspace/commons-jelly/jelly-tags/ant/target/test-classes/org/apache/commons/jelly/ant/suite.jelly:98:5: <test:assertEquals>  expected:[bar5] but was:[null]
    [junit] Expected expression: (bar5)=(bar5)
    [junit] Actual expression: (${foo5.1})=(null)
    [junit] org.apache.commons.jelly.JellyTagException: file:/srv/gump/public/workspace/commons-jelly/jelly-tags/ant/target/test-classes/org/apache/commons/jelly/ant/suite.jelly:98:5: <test:assertEquals> file:/srv/gump/public/workspace/commons-jelly/jelly-tags/ant/target/test-classes/org/apache/commons/jelly/ant/suite.jelly:98:5: <test:assertEquals>  expected:[bar5] but was:[null]
    [junit] Expected expression: (bar5)=(bar5)
    [junit] Actual expression: (${foo5.1})=(null)
    [junit] 	at org.apache.commons.jelly.impl.TagScript.handleException(TagScript.java:732)
    [junit] 	at org.apache.commons.jelly.impl.TagScript.run(TagScript.java:287)
    [junit] 	at org.apache.commons.jelly.impl.ScriptBlock.run(ScriptBlock.java:96)
    [junit] 	at org.apache.commons.jelly.tags.junit.CaseTag$1.runTest(CaseTag.java:60)
    [junit] Caused by: org.apache.commons.jelly.tags.junit.JellyAssertionFailedError: file:/srv/gump/public/workspace/commons-jelly/jelly-tags/ant/target/test-classes/org/apache/commons/jelly/ant/suite.jelly:98:5: <test:assertEquals>  expected:[bar5] but was:[null]
    [junit] Expected expression: (bar5)=(bar5)
    [junit] Actual expression: (${foo5.1})=(null)
    [junit] 	at org.apache.commons.jelly.tags.junit.AssertTagSupport.fail(AssertTagSupport.java:44)
    [junit] 	at org.apache.commons.jelly.tags.junit.AssertTagSupport.failNotEquals(AssertTagSupport.java:77)
    [junit] 	at org.apache.commons.jelly.tags.junit.AssertEqualsTag.doTag(AssertEqualsTag.java:56)
    [junit] 	at org.apache.commons.jelly.impl.TagScript.run(TagScript.java:267)
    [junit] Root cause
    [junit] org.apache.commons.jelly.tags.junit.JellyAssertionFailedError: file:/srv/gump/public/workspace/commons-jelly/jelly-tags/ant/target/test-classes/org/apache/commons/jelly/ant/suite.jelly:98:5: <test:assertEquals>  expected:[bar5] but was:[null]
    [junit] Expected expression: (bar5)=(bar5)
    [junit] Actual expression: (${foo5.1})=(null)
    [junit] 	at org.apache.commons.jelly.tags.junit.AssertTagSupport.fail(AssertTagSupport.java:44)
    [junit] 	at org.apache.commons.jelly.tags.junit.AssertTagSupport.failNotEquals(AssertTagSupport.java:77)
    [junit] 	at org.apache.commons.jelly.tags.junit.AssertEqualsTag.doTag(AssertEqualsTag.java:56)
    [junit] 	at org.apache.commons.jelly.impl.TagScript.run(TagScript.java:267)
    [junit] 	at org.apache.commons.jelly.impl.ScriptBlock.run(ScriptBlock.java:96)
    [junit] 	at org.apache.commons.jelly.tags.junit.CaseTag$1.runTest(CaseTag.java:60)
    [junit] 
    [junit] 
    [junit] [ERROR] TEST org.apache.commons.jelly.ant.TestJelly FAILED

BUILD FAILED
File...... /home/gump/.maven/cache/maven-test-plugin-1.6.2/plugin.jelly
Element... fail
Line...... 181
Column.... 54
There were test failures.
Total time: 9 seconds
Finished at: Sat Jul 23 11:36:45 UTC 2011

---------------------------------------------

To subscribe to this information via syndicated feeds:
- RSS: http://vmgump.apache.org/gump/public/commons-jelly/commons-jelly-tags-ant-test/rss.xml
- Atom: http://vmgump.apache.org/gump/public/commons-jelly/commons-jelly-tags-ant-test/atom.xml

============================== Gump Tracking Only ===
Produced by Apache Gump(TM) version 2.3.
Gump Run 07000623072011, vmgump.apache.org:vmgump:07000623072011
Gump E-mail Identifier (unique within run) #35.

*********************************************************** G U M P
[GUMP@vmgump]: Project cocoon22-reactor (in module cocoon) failed
To whom it may engage...
        
This is an automated request, but not an unsolicited one. For 
more information please visit http://gump.apache.org/nagged.html, 
and/or contact the folk at general@gump.apache.org.

Project cocoon22-reactor has an issue affecting its community integration.
This issue affects 1 projects,
 and has been outstanding for 644 runs.
The current state of this project is 'Failed', with reason 'Build Failed'.
For reference only, the following projects are affected by this:
    - cocoon22-reactor :  Java XML Framework


Full details are available at:
    http://vmgump.apache.org/gump/public/cocoon/cocoon22-reactor/index.html

That said, some information snippets are provided here.

The following annotations (debug/informational/warning/error messages) were provided:
 -INFO- Optional dependency htmlunit failed with reason build failed
 -INFO- Optional dependency cocoon22-flowscript-impl prerequisite failed with reason build failed
 -INFO- Optional dependency cocoon22-chaperon-impl prerequisite failed with reason build failed
 -INFO- Optional dependency cocoon22-validation-impl prerequisite failed with reason build failed
 -DEBUG- (Apache Gump generated) Apache Maven Settings in: /srv/gump/public/workspace/cocoon/gump_mvn_settings.xml
 -INFO- Failed with reason build failed
 -DEBUG- Maven POM in: /srv/gump/public/workspace/cocoon/pom.xml



The following work was performed:
http://vmgump.apache.org/gump/public/cocoon/cocoon22-reactor/gump_work/build_cocoon_cocoon22-reactor.html
Work Name: build_cocoon_cocoon22-reactor (Type: Build)
Work ended in a state of : Failed
Elapsed: 55 secs
Command Line: /opt/maven2/bin/mvn --batch-mode --settings /srv/gump/public/workspace/cocoon/gump_mvn_settings.xml package 
[Working Directory: /srv/gump/public/workspace/cocoon]
M2_HOME: /opt/maven2
---------------------------------------------
8) daisy:daisy-htmlcleaner:jar:1.5-dev

  Try downloading the file manually from the project website.

  Then, install it using the command: 
      mvn install:install-file -DgroupId=daisy -DartifactId=daisy-htmlcleaner -Dversion=1.5-dev -Dpackaging=jar -Dfile=/path/to/file

  Alternatively, if you host your own repository you can deploy the file there: 
      mvn deploy:deploy-file -DgroupId=daisy -DartifactId=daisy-htmlcleaner -Dversion=1.5-dev -Dpackaging=jar -Dfile=/path/to/file -Durl=[url] -DrepositoryId=[id]

  Path to dependency: 
  	1) org.apache.cocoon:cocoon-sitemaptags2daisy-plugin:maven-plugin:1.0.0-SNAPSHOT
  	2) daisy:daisy-htmlcleaner:jar:1.5-dev

9) daisy:daisy-util:jar:1.5-dev

  Try downloading the file manually from the project website.

  Then, install it using the command: 
      mvn install:install-file -DgroupId=daisy -DartifactId=daisy-util -Dversion=1.5-dev -Dpackaging=jar -Dfile=/path/to/file

  Alternatively, if you host your own repository you can deploy the file there: 
      mvn deploy:deploy-file -DgroupId=daisy -DartifactId=daisy-util -Dversion=1.5-dev -Dpackaging=jar -Dfile=/path/to/file -Durl=[url] -DrepositoryId=[id]

  Path to dependency: 
  	1) org.apache.cocoon:cocoon-sitemaptags2daisy-plugin:maven-plugin:1.0.0-SNAPSHOT
  	2) daisy:daisy-util:jar:1.5-dev

----------
9 required artifacts are missing.

for artifact: 
  org.apache.cocoon:cocoon-sitemaptags2daisy-plugin:maven-plugin:1.0.0-SNAPSHOT

from the specified remote repositories:
  gump-central (http://localhost:8192/maven2),
  maven-snapshot (http://snapshots.maven.codehaus.org/maven2/),
  cocoondev (http://cocoondev.org/repository),
  gump-apache.snapshots (http://localhost:8192/repo/m2-snapshot-repository),
  gkossakowski-maven2 (http://people.apache.org/~gkossakowski/maven2/repository)



[INFO] ------------------------------------------------------------------------
[INFO] For more information, run Maven with the -e switch
[INFO] ------------------------------------------------------------------------
[INFO] Total time: 54 seconds
[INFO] Finished at: Sat Jul 23 11:59:30 UTC 2011
[INFO] Final Memory: 69M/165M
[INFO] ------------------------------------------------------------------------
---------------------------------------------

To subscribe to this information via syndicated feeds:
- RSS: http://vmgump.apache.org/gump/public/cocoon/cocoon22-reactor/rss.xml
- Atom: http://vmgump.apache.org/gump/public/cocoon/cocoon22-reactor/atom.xml

============================== Gump Tracking Only ===
Produced by Apache Gump(TM) version 2.3.
Gump Run 07000623072011, vmgump.apache.org:vmgump:07000623072011
Gump E-mail Identifier (unique within run) #39.

*********************************************************** G U M P
[GUMP@vmgump]: Project ws-commons-axiom (in module ws-axis2-commons) failed
To whom it may engage...
        
This is an automated request, but not an unsolicited one. For 
more information please visit http://gump.apache.org/nagged.html, 
and/or contact the folk at general@gump.apache.org.

Project ws-commons-axiom has an issue affecting its community integration.
This issue affects 1 projects,
 and has been outstanding for 638 runs.
The current state of this project is 'Failed', with reason 'Build Failed'.
For reference only, the following projects are affected by this:
    - ws-commons-axiom :  Common stuff for the WS projects.


Full details are available at:
    http://vmgump.apache.org/gump/public/ws-axis2-commons/ws-commons-axiom/index.html

That said, some information snippets are provided here.

The following annotations (debug/informational/warning/error messages) were provided:
 -DEBUG- (Apache Gump generated) Apache Maven Settings in: /srv/gump/public/workspace/ws-axis2-commons/axiom/gump_mvn_settings.xml
 -INFO- Failed with reason build failed
 -DEBUG- Maven POM in: /srv/gump/public/workspace/ws-axis2-commons/axiom/pom.xml



The following work was performed:
http://vmgump.apache.org/gump/public/ws-axis2-commons/ws-commons-axiom/gump_work/build_ws-axis2-commons_ws-commons-axiom.html
Work Name: build_ws-axis2-commons_ws-commons-axiom (Type: Build)
Work ended in a state of : Failed
Elapsed: 5 mins 8 secs
Command Line: /opt/maven2/bin/mvn --batch-mode --settings /srv/gump/public/workspace/ws-axis2-commons/axiom/gump_mvn_settings.xml install 
[Working Directory: /srv/gump/public/workspace/ws-axis2-commons/axiom]
M2_HOME: /opt/maven2
---------------------------------------------
  test(org.apache.axiom.om.impl.builder.SAXOMBuilderJAXBTest)
  testStylesheet[0](org.apache.axiom.om.impl.dom.jaxp.TransformerTest)
  testIdentity[0](org.apache.axiom.om.impl.dom.jaxp.TransformerTest)
  testStylesheet[1](org.apache.axiom.om.impl.dom.jaxp.TransformerTest)
  testIdentity[1](org.apache.axiom.om.impl.dom.jaxp.TransformerTest)
  processingInstruction.xml - crimson(org.apache.axiom.om.impl.builder.SAXOMBuilderSAXParserTest)
  spaces.xml - crimson(org.apache.axiom.om.impl.builder.SAXOMBuilderSAXParserTest)
  cdata.xml - crimson(org.apache.axiom.om.impl.builder.SAXOMBuilderSAXParserTest)
  namespaces2.xml - crimson(org.apache.axiom.om.impl.builder.SAXOMBuilderSAXParserTest)
  null-namespace.xml - crimson(org.apache.axiom.om.impl.builder.SAXOMBuilderSAXParserTest)
  xml-prefix.xml - crimson(org.apache.axiom.om.impl.builder.SAXOMBuilderSAXParserTest)
  namespaces3.xml - crimson(org.apache.axiom.om.impl.builder.SAXOMBuilderSAXParserTest)
  AXIS2-192.xml - crimson(org.apache.axiom.om.impl.builder.SAXOMBuilderSAXParserTest)
  iso-8859-1.xml - crimson(org.apache.axiom.om.impl.builder.SAXOMBuilderSAXParserTest)
  masked-namespace-declaration.xml - crimson(org.apache.axiom.om.impl.builder.SAXOMBuilderSAXParserTest)
  test.xml - crimson(org.apache.axiom.om.impl.builder.SAXOMBuilderSAXParserTest)
  namespaces.xml - crimson(org.apache.axiom.om.impl.builder.SAXOMBuilderSAXParserTest)
  utf-8.xml - crimson(org.apache.axiom.om.impl.builder.SAXOMBuilderSAXParserTest)
  AXIS2-565.xml - crimson(org.apache.axiom.om.impl.builder.SAXOMBuilderSAXParserTest)
  processingInstruction.xml - xerces(org.apache.axiom.om.impl.builder.SAXOMBuilderSAXParserTest)
  spaces.xml - xerces(org.apache.axiom.om.impl.builder.SAXOMBuilderSAXParserTest)
  cdata.xml - xerces(org.apache.axiom.om.impl.builder.SAXOMBuilderSAXParserTest)
  namespaces2.xml - xerces(org.apache.axiom.om.impl.builder.SAXOMBuilderSAXParserTest)
  null-namespace.xml - xerces(org.apache.axiom.om.impl.builder.SAXOMBuilderSAXParserTest)
  xml-prefix.xml - xerces(org.apache.axiom.om.impl.builder.SAXOMBuilderSAXParserTest)
  namespaces3.xml - xerces(org.apache.axiom.om.impl.builder.SAXOMBuilderSAXParserTest)
  AXIS2-192.xml - xerces(org.apache.axiom.om.impl.builder.SAXOMBuilderSAXParserTest)
  iso-8859-1.xml - xerces(org.apache.axiom.om.impl.builder.SAXOMBuilderSAXParserTest)
  masked-namespace-declaration.xml - xerces(org.apache.axiom.om.impl.builder.SAXOMBuilderSAXParserTest)
  test.xml - xerces(org.apache.axiom.om.impl.builder.SAXOMBuilderSAXParserTest)
  namespaces.xml - xerces(org.apache.axiom.om.impl.builder.SAXOMBuilderSAXParserTest)
  utf-8.xml - xerces(org.apache.axiom.om.impl.builder.SAXOMBuilderSAXParserTest)
  AXIS2-565.xml - xerces(org.apache.axiom.om.impl.builder.SAXOMBuilderSAXParserTest)
  test(org.apache.axiom.om.impl.builder.SAXOMBuilderXMLBeansTest)

Tests run: 42, Failures: 0, Errors: 36, Skipped: 0

[INFO] ------------------------------------------------------------------------
[ERROR] BUILD FAILURE
[INFO] ------------------------------------------------------------------------
[INFO] There are test failures.

Please refer to /srv/gump/public/workspace/ws-axis2-commons/axiom/modules/axiom-integration/target/surefire-reports for the individual test results.
[INFO] ------------------------------------------------------------------------
[INFO] For more information, run Maven with the -e switch
[INFO] ------------------------------------------------------------------------
[INFO] Total time: 5 minutes 6 seconds
[INFO] Finished at: Sat Jul 23 12:05:59 UTC 2011
[INFO] Final Memory: 75M/181M
[INFO] ------------------------------------------------------------------------
---------------------------------------------

To subscribe to this information via syndicated feeds:
- RSS: http://vmgump.apache.org/gump/public/ws-axis2-commons/ws-commons-axiom/rss.xml
- Atom: http://vmgump.apache.org/gump/public/ws-axis2-commons/ws-commons-axiom/atom.xml

============================== Gump Tracking Only ===
Produced by Apache Gump(TM) version 2.3.
Gump Run 07000623072011, vmgump.apache.org:vmgump:07000623072011
Gump E-mail Identifier (unique within run) #40.

*********************************************************** G U M P
[GUMP@vmgump]: Project ws-axis2 (in module ws-axis2) failed
To whom it may engage...
        
This is an automated request, but not an unsolicited one. For 
more information please visit http://gump.apache.org/nagged.html, 
and/or contact the folk at general@gump.apache.org.

Project ws-axis2 has an issue affecting its community integration.
This issue affects 2 projects,
 and has been outstanding for 1028 runs.
The current state of this project is 'Failed', with reason 'Build Failed'.
For reference only, the following projects are affected by this:
    - ws-axis2 :  Apache Axis2 SOAP Stack
    - ws-axis2-test :  Apache Axis2 SOAP Stack


Full details are available at:
    http://vmgump.apache.org/gump/public/ws-axis2/ws-axis2/index.html

That said, some information snippets are provided here.

The following annotations (debug/informational/warning/error messages) were provided:
 -DEBUG- Sole jar output [ws-axis2-23072011] identifier set to project name
 -INFO- Optional dependency ws-commons-axiom failed with reason build failed
 -DEBUG- (Apache Gump generated) Apache Maven Settings in: /srv/gump/public/workspace/ws-axis2/gump_mvn_settings.xml
 -INFO- Failed with reason build failed
 -DEBUG- Maven POM in: /srv/gump/public/workspace/ws-axis2/pom.xml
 -INFO- Failed to extract fallback artifacts from Gump Repository



The following work was performed:
http://vmgump.apache.org/gump/public/ws-axis2/ws-axis2/gump_work/build_ws-axis2_ws-axis2.html
Work Name: build_ws-axis2_ws-axis2 (Type: Build)
Work ended in a state of : Failed
Elapsed: 1 min 8 secs
Command Line: /opt/maven2/bin/mvn --batch-mode -DskipTests=true --settings /srv/gump/public/workspace/ws-axis2/gump_mvn_settings.xml package 
[Working Directory: /srv/gump/public/workspace/ws-axis2]
M2_HOME: /opt/maven2
---------------------------------------------
Downloading: http://localhost:8192/repo/m2-snapshot-repository/org/apache/ws/commons/axiom/axiom-impl/1.2.13-SNAPSHOT/axiom-impl-1.2.13-SNAPSHOT.jar
120K downloaded  (axiom-impl-1.2.13-SNAPSHOT.jar)
Downloading: http://localhost:8192/repo/m2-snapshot-repository/org/apache/woden/woden-impl-commons/1.0-SNAPSHOT/woden-impl-commons-1.0-SNAPSHOT.jar
181K downloaded  (woden-impl-commons-1.0-SNAPSHOT.jar)
Downloading: http://localhost:8192/maven2/org/apache/geronimo/specs/geronimo-javamail_1.4_spec/1.6/geronimo-javamail_1.4_spec-1.6.jar

Downloading: http://localhost:8192/maven2/org/apache/geronimo/specs/geronimo-stax-api_1.0_spec/1.0.1/geronimo-stax-api_1.0_spec-1.0.1.jar

Downloading: http://localhost:8192/maven2/org/apache/geronimo/specs/geronimo-ws-metadata_2.0_spec/1.1.2/geronimo-ws-metadata_2.0_spec-1.1.2.jar

Downloading: http://localhost:8192/maven2/org/apache/geronimo/specs/geronimo-jta_1.1_spec/1.1/geronimo-jta_1.1_spec-1.1.jar

[INFO] ------------------------------------------------------------------------
[ERROR] BUILD ERROR
[INFO] ------------------------------------------------------------------------
[INFO] Failed to resolve dependencies for one or more projects in the reactor. Reason: Missing:
----------
1) org.apache.ws.commons.schema:XmlSchema:jar:1.4.8-SNAPSHOT

  Try downloading the file manually from the project website.

  Then, install it using the command: 
      mvn install:install-file -DgroupId=org.apache.ws.commons.schema -DartifactId=XmlSchema -Dversion=1.4.8-SNAPSHOT -Dpackaging=jar -Dfile=/path/to/file

  Alternatively, if you host your own repository you can deploy the file there: 
      mvn deploy:deploy-file -DgroupId=org.apache.ws.commons.schema -DartifactId=XmlSchema -Dversion=1.4.8-SNAPSHOT -Dpackaging=jar -Dfile=/path/to/file -Durl=[url] -DrepositoryId=[id]

  Path to dependency: 
  	1) org.apache.axis2:axis2-kernel:jar:1.7.0-SNAPSHOT
  	2) org.apache.ws.commons.schema:XmlSchema:jar:1.4.8-SNAPSHOT

----------
1 required artifact is missing.

for artifact: 
  org.apache.axis2:axis2-kernel:jar:1.7.0-SNAPSHOT

from the specified remote repositories:
  gump-central (http://localhost:8192/maven2),
  gump-apache.snapshots (http://localhost:8192/repo/m2-snapshot-repository)



[INFO] ------------------------------------------------------------------------
[INFO] For more information, run Maven with the -e switch
[INFO] ------------------------------------------------------------------------
[INFO] Total time: 1 minute 7 seconds
[INFO] Finished at: Sat Jul 23 12:40:35 UTC 2011
[INFO] Final Memory: 38M/93M
[INFO] ------------------------------------------------------------------------
---------------------------------------------

To subscribe to this information via syndicated feeds:
- RSS: http://vmgump.apache.org/gump/public/ws-axis2/ws-axis2/rss.xml
- Atom: http://vmgump.apache.org/gump/public/ws-axis2/ws-axis2/atom.xml

============================== Gump Tracking Only ===
Produced by Apache Gump(TM) version 2.3.
Gump Run 07000623072011, vmgump.apache.org:vmgump:07000623072011
Gump E-mail Identifier (unique within run) #44.

*********************************************************** G U M P
[GUMP@vmgump]: Project openjpa-kernel (in module openjpa) failed
To whom it may engage...
        
This is an automated request, but not an unsolicited one. For 
more information please visit http://gump.apache.org/nagged.html, 
and/or contact the folk at general@gump.apache.org.

Project openjpa-kernel has an issue affecting its community integration.
This issue affects 8 projects,
 and has been outstanding for 123 runs.
The current state of this project is 'Failed', with reason 'Build Failed'.
For reference only, the following projects are affected by this:
    - openjpa :  Apache OpenJPA is a Java persistence project that can be use...
    - openjpa-jdbc :  Apache OpenJPA is a Java persistence project that can be use...
    - openjpa-kernel :  Apache OpenJPA is a Java persistence project that can be use...
    - openjpa-persistence :  Apache OpenJPA is a Java persistence project that can be use...
    - openjpa-persistence-jdbc :  Apache OpenJPA is a Java persistence project that can be use...
    - openjpa-slice :  Apache OpenJPA is a Java persistence project that can be use...
    - openjpa-testsupport :  Apache OpenJPA is a Java persistence project that can be use...
    - openjpa-xmlstore :  Apache OpenJPA is a Java persistence project that can be use...


Full details are available at:
    http://vmgump.apache.org/gump/public/openjpa/openjpa-kernel/index.html

That said, some information snippets are provided here.

The following annotations (debug/informational/warning/error messages) were provided:
 -DEBUG- Sole jar output [openjpa-kernel-*[0-9T].jar] identifier set to project name
 -DEBUG- (Apache Gump generated) Apache Maven Settings in: /srv/gump/public/workspace/openjpa/openjpa-kernel/gump_mvn_settings.xml
 -INFO- Failed with reason build failed
 -DEBUG- Maven POM in: /srv/gump/public/workspace/openjpa/openjpa-kernel/pom.xml
 -INFO- Failed to extract fallback artifacts from Gump Repository



The following work was performed:
http://vmgump.apache.org/gump/public/openjpa/openjpa-kernel/gump_work/build_openjpa_openjpa-kernel.html
Work Name: build_openjpa_openjpa-kernel (Type: Build)
Work ended in a state of : Failed
Elapsed: 32 secs
Command Line: /opt/maven2/bin/mvn --batch-mode -Dcheckstyle.skip=true --settings /srv/gump/public/workspace/openjpa/openjpa-kernel/gump_mvn_settings.xml package 
[Working Directory: /srv/gump/public/workspace/openjpa/openjpa-kernel]
M2_HOME: /opt/maven2
---------------------------------------------
/srv/gump/public/workspace/openjpa/openjpa-kernel/src/main/java/org/apache/openjpa/enhance/PCDataGenerator.java:[680,12] cannot find symbol
symbol  : class Instruction
location: class org.apache.openjpa.enhance.PCDataGenerator
/srv/gump/public/workspace/openjpa/openjpa-kernel/src/main/java/org/apache/openjpa/enhance/PCDataGenerator.java:[732,44] cannot find symbol
symbol  : class Code
location: class org.apache.openjpa.enhance.PCDataGenerator
/srv/gump/public/workspace/openjpa/openjpa-kernel/src/main/java/org/apache/openjpa/enhance/PCDataGenerator.java:[733,36] cannot find symbol
symbol  : class Instruction
location: class org.apache.openjpa.enhance.PCDataGenerator
/srv/gump/public/workspace/openjpa/openjpa-kernel/src/main/java/org/apache/openjpa/enhance/PCDataGenerator.java:[732,12] cannot find symbol
symbol  : class Instruction
location: class org.apache.openjpa.enhance.PCDataGenerator
/srv/gump/public/workspace/openjpa/openjpa-kernel/src/main/java/org/apache/openjpa/enhance/PCDataGenerator.java:[762,33] cannot find symbol
symbol  : class BCClass
location: class org.apache.openjpa.enhance.PCDataGenerator
/srv/gump/public/workspace/openjpa/openjpa-kernel/src/main/java/org/apache/openjpa/enhance/PCDataGenerator.java:[769,32] cannot find symbol
symbol  : class BCClass
location: class org.apache.openjpa.enhance.PCDataGenerator
/srv/gump/public/workspace/openjpa/openjpa-kernel/src/main/java/org/apache/openjpa/enhance/PCDataGenerator.java:[855,26] cannot find symbol
symbol  : class BCClass
location: class org.apache.openjpa.enhance.PCDataGenerator
/srv/gump/public/workspace/openjpa/openjpa-kernel/src/main/java/org/apache/openjpa/enhance/PCDataGenerator.java:[855,38] cannot find symbol
symbol  : class Code
location: class org.apache.openjpa.enhance.PCDataGenerator
/srv/gump/public/workspace/openjpa/openjpa-kernel/src/main/java/org/apache/openjpa/enhance/PCDataGenerator.java:[944,32] cannot find symbol
symbol  : class BCClass
location: class org.apache.openjpa.enhance.PCDataGenerator
/srv/gump/public/workspace/openjpa/openjpa-kernel/src/main/java/org/apache/openjpa/enhance/PCDataGenerator.java:[967,28] cannot find symbol
symbol  : class BCClass
location: class org.apache.openjpa.enhance.PCDataGenerator
/srv/gump/public/workspace/openjpa/openjpa-kernel/src/main/java/org/apache/openjpa/enhance/PCDataGenerator.java:[1030,38] cannot find symbol
symbol  : class BCClass
location: class org.apache.openjpa.enhance.PCDataGenerator
/srv/gump/public/workspace/openjpa/openjpa-kernel/src/main/java/org/apache/openjpa/enhance/PCDataGenerator.java:[1049,29] cannot find symbol
symbol  : class Instruction
location: class org.apache.openjpa.enhance.PCDataGenerator
/srv/gump/public/workspace/openjpa/openjpa-kernel/src/main/java/org/apache/openjpa/enhance/PCDataGenerator.java:[1049,57] cannot find symbol
symbol  : class Instruction
location: class org.apache.openjpa.enhance.PCDataGenerator
/srv/gump/public/workspace/openjpa/openjpa-kernel/src/main/java/org/apache/openjpa/enhance/DynamicStorageGenerator.java:[98,18] cannot find symbol
symbol  : class Project
location: class org.apache.openjpa.enhance.DynamicStorageGenerator

[INFO] ------------------------------------------------------------------------
[INFO] For more information, run Maven with the -e switch
[INFO] ------------------------------------------------------------------------
[INFO] Total time: 31 seconds
[INFO] Finished at: Sat Jul 23 12:47:33 UTC 2011
[INFO] Final Memory: 43M/150M
[INFO] ------------------------------------------------------------------------
---------------------------------------------

To subscribe to this information via syndicated feeds:
- RSS: http://vmgump.apache.org/gump/public/openjpa/openjpa-kernel/rss.xml
- Atom: http://vmgump.apache.org/gump/public/openjpa/openjpa-kernel/atom.xml

============================== Gump Tracking Only ===
Produced by Apache Gump(TM) version 2.3.
Gump Run 07000623072011, vmgump.apache.org:vmgump:07000623072011
Gump E-mail Identifier (unique within run) #45.

*********************************************************** G U M P
[GUMP@vmgump]: Project tapestry (in module tapestry) failed
To whom it may engage...
        
This is an automated request, but not an unsolicited one. For 
more information please visit http://gump.apache.org/nagged.html, 
and/or contact the folk at general@gump.apache.org.

Project tapestry has an issue affecting its community integration.
This issue affects 1 projects,
 and has been outstanding for 598 runs.
The current state of this project is 'Failed', with reason 'Build Failed'.
For reference only, the following projects are affected by this:
    - tapestry :  Component-based web application framework organized around i...


Full details are available at:
    http://vmgump.apache.org/gump/public/tapestry/tapestry/index.html

That said, some information snippets are provided here.

The following annotations (debug/informational/warning/error messages) were provided:
 -INFO- Optional dependency commons-fileupload prerequisite failed with reason build failed
 -DEBUG- (Apache Gump generated) Apache Maven Settings in: /srv/gump/public/workspace/tapestry/gump_mvn_settings.xml
 -INFO- Failed with reason build failed
 -INFO- Failed to extract fallback artifacts from Gump Repository



The following work was performed:
http://vmgump.apache.org/gump/public/tapestry/tapestry/gump_work/build_tapestry_tapestry.html
Work Name: build_tapestry_tapestry (Type: Build)
Work ended in a state of : Failed
Elapsed: 2 secs
Command Line: /opt/maven2/bin/mvn --batch-mode -DskipTests=true --settings /srv/gump/public/workspace/tapestry/gump_mvn_settings.xml package 
[Working Directory: /srv/gump/public/workspace/tapestry]
M2_HOME: /opt/maven2
---------------------------------------------
[INFO] Scanning for projects...
[INFO] ------------------------------------------------------------------------
[INFO] Building Maven Default Project
[INFO]    task-segment: [package]
[INFO] ------------------------------------------------------------------------
[INFO] ------------------------------------------------------------------------
[ERROR] BUILD ERROR
[INFO] ------------------------------------------------------------------------
[INFO] Cannot execute mojo: resources. It requires a project with an existing pom.xml, but the build is not using one.
[INFO] ------------------------------------------------------------------------
[INFO] For more information, run Maven with the -e switch
[INFO] ------------------------------------------------------------------------
[INFO] Total time: 1 second
[INFO] Finished at: Sat Jul 23 12:52:51 UTC 2011
[INFO] Final Memory: 4M/15M
[INFO] ------------------------------------------------------------------------
---------------------------------------------

To subscribe to this information via syndicated feeds:
- RSS: http://vmgump.apache.org/gump/public/tapestry/tapestry/rss.xml
- Atom: http://vmgump.apache.org/gump/public/tapestry/tapestry/atom.xml

============================== Gump Tracking Only ===
Produced by Apache Gump(TM) version 2.3.
Gump Run 07000623072011, vmgump.apache.org:vmgump:07000623072011
Gump E-mail Identifier (unique within run) #46.

*********************************************************** G U M P
[GUMP@vmgump]: Project cocoon3-reactor (in module cocoon3) failed
To whom it may engage...
        
This is an automated request, but not an unsolicited one. For 
more information please visit http://gump.apache.org/nagged.html, 
and/or contact the folk at general@gump.apache.org.

Project cocoon3-reactor has an issue affecting its community integration.
This issue affects 1 projects,
 and has been outstanding for 218 runs.
The current state of this project is 'Failed', with reason 'Build Failed'.
For reference only, the following projects are affected by this:
    - cocoon3-reactor :  Java XML Framework


Full details are available at:
    http://vmgump.apache.org/gump/public/cocoon3/cocoon3-reactor/index.html

That said, some information snippets are provided here.

The following annotations (debug/informational/warning/error messages) were provided:
 -INFO- Optional dependency cocoon-all prerequisite failed with reason build failed
 -DEBUG- (Apache Gump generated) Apache Maven Settings in: /srv/gump/public/workspace/cocoon3/gump_mvn_settings.xml
 -INFO- Failed with reason build failed
 -DEBUG- Maven POM in: /srv/gump/public/workspace/cocoon3/pom.xml



The following work was performed:
http://vmgump.apache.org/gump/public/cocoon3/cocoon3-reactor/gump_work/build_cocoon3_cocoon3-reactor.html
Work Name: build_cocoon3_cocoon3-reactor (Type: Build)
Work ended in a state of : Failed
Elapsed: 1 min 24 secs
Command Line: /opt/maven2/bin/mvn --batch-mode --settings /srv/gump/public/workspace/cocoon3/gump_mvn_settings.xml package 
[Working Directory: /srv/gump/public/workspace/cocoon3]
M2_HOME: /opt/maven2
---------------------------------------------
[INFO] Copying 3 resources
[INFO] [compiler:compile {execution: default-compile}]
[INFO] Compiling 15 source files to /srv/gump/public/workspace/cocoon3/cocoon-optional/target/classes
[INFO] [resources:testResources {execution: default-testResources}]
[INFO] Using 'UTF-8' encoding to copy filtered resources.
[INFO] Copying 7 resources
[INFO] Copying 3 resources
[INFO] [compiler:testCompile {execution: default-testCompile}]
[INFO] Compiling 11 source files to /srv/gump/public/workspace/cocoon3/cocoon-optional/target/test-classes
[INFO] [surefire:test {execution: default-test}]
[INFO] Surefire report directory: /srv/gump/public/workspace/cocoon3/cocoon-optional/target/surefire-reports

-------------------------------------------------------
 T E S T S
-------------------------------------------------------
Running org.apache.cocoon.optional.pipeline.components.sax.jaxb.JAXBGeneratorTestCase
Tests run: 6, Failures: 0, Errors: 0, Skipped: 0, Time elapsed: 1.087 sec
Running org.apache.cocoon.optional.pipeline.components.sax.directory.DirectoryGeneratorTestCase
Tests run: 1, Failures: 0, Errors: 0, Skipped: 0, Time elapsed: 0.029 sec
Running org.apache.cocoon.optional.pipeline.components.sax.fop.FopSerializerTestCase
Jul 23, 2011 12:55:26 PM org.apache.fop.events.LoggingEventListener processEvent
INFO: Rendered page #1.
Tests run: 1, Failures: 0, Errors: 0, Skipped: 0, Time elapsed: 1.372 sec
Running org.apache.cocoon.optional.pipeline.components.sax.neko.NekoGeneratorTestCase
Tests run: 1, Failures: 0, Errors: 0, Skipped: 0, Time elapsed: 0.139 sec
Running org.apache.cocoon.optional.pipeline.components.sax.betwixt.BetwixtBeanGeneratorTest
Tests run: 2, Failures: 0, Errors: 0, Skipped: 0, Time elapsed: 0.268 sec
Running org.apache.cocoon.optional.pipeline.components.sax.solr.SolrConsumerTestCase
Tests run: 1, Failures: 0, Errors: 1, Skipped: 0, Time elapsed: 0.318 sec <<< FAILURE!

Results :

Tests in error: 
  testPipelineWithSolrConsumer(org.apache.cocoon.optional.pipeline.components.sax.solr.SolrConsumerTestCase): org/apache/lucene/search/Searcher

Tests run: 12, Failures: 0, Errors: 1, Skipped: 0

[INFO] ------------------------------------------------------------------------
[ERROR] BUILD FAILURE
[INFO] ------------------------------------------------------------------------
[INFO] There are test failures.

Please refer to /srv/gump/public/workspace/cocoon3/cocoon-optional/target/surefire-reports for the individual test results.
[INFO] ------------------------------------------------------------------------
[INFO] For more information, run Maven with the -e switch
[INFO] ------------------------------------------------------------------------
[INFO] Total time: 1 minute 23 seconds
[INFO] Finished at: Sat Jul 23 12:55:26 UTC 2011
[INFO] Final Memory: 94M/233M
[INFO] ------------------------------------------------------------------------
---------------------------------------------

To subscribe to this information via syndicated feeds:
- RSS: http://vmgump.apache.org/gump/public/cocoon3/cocoon3-reactor/rss.xml
- Atom: http://vmgump.apache.org/gump/public/cocoon3/cocoon3-reactor/atom.xml

============================== Gump Tracking Only ===
Produced by Apache Gump(TM) version 2.3.
Gump Run 07000623072011, vmgump.apache.org:vmgump:07000623072011
Gump E-mail Identifier (unique within run) #47.

*********************************************************** G U M P
[GUMP@vmgump]: Project portals-bridges-script-test (in module portals-bridges) failed
To whom it may engage...
        
This is an automated request, but not an unsolicited one. For 
more information please visit http://gump.apache.org/nagged.html, 
and/or contact the folk at general@gump.apache.org.

Project portals-bridges-script-test has an issue affecting its community integration.
This issue affects 1 projects,
 and has been outstanding for 78 runs.
The current state of this project is 'Failed', with reason 'Build Failed'.
For reference only, the following projects are affected by this:
    - portals-bridges-script-test :  Support for JSR168 compliant Portlet development


Full details are available at:
    http://vmgump.apache.org/gump/public/portals-bridges/portals-bridges-script-test/index.html

That said, some information snippets are provided here.

The following annotations (debug/informational/warning/error messages) were provided:
 -WARNING- Overriding Maven settings: [/srv/gump/public/workspace/portals-bridges/bridges-script/trunk/portlet/gump_mvn_settings.xml]
 -DEBUG- (Apache Gump generated) Apache Maven Settings in: /srv/gump/public/workspace/portals-bridges/bridges-script/trunk/portlet/gump_mvn_settings.xml
 -INFO- Failed with reason build failed
 -DEBUG- Maven POM in: /srv/gump/public/workspace/portals-bridges/bridges-script/trunk/portlet/pom.xml



The following work was performed:
http://vmgump.apache.org/gump/public/portals-bridges/portals-bridges-script-test/gump_work/build_portals-bridges_portals-bridges-script-test.html
Work Name: build_portals-bridges_portals-bridges-script-test (Type: Build)
Work ended in a state of : Failed
Elapsed: 25 secs
Command Line: /opt/maven2/bin/mvn --batch-mode --settings /srv/gump/public/workspace/portals-bridges/bridges-script/trunk/portlet/gump_mvn_settings.xml package 
[Working Directory: /srv/gump/public/workspace/portals-bridges/bridges-script/trunk/portlet]
M2_HOME: /opt/maven2
---------------------------------------------
-------------------------------------------------------
 T E S T S
-------------------------------------------------------
Running org.apache.portals.bridges.script.TestHelloJythonScriptPortlet
SLF4J: The requested version 1.5.9 by your slf4j binding is not compatible with [1.5.5, 1.5.6]
SLF4J: See http://www.slf4j.org/codes.html#version_mismatch for further details.
Tests run: 5, Failures: 0, Errors: 5, Skipped: 0, Time elapsed: 5.254 sec <<< FAILURE!
Running org.apache.portals.bridges.script.TestHelloJRubyScriptPortlet
Tests run: 5, Failures: 0, Errors: 0, Skipped: 0, Time elapsed: 5.514 sec
Running org.apache.portals.bridges.script.TestHelloRhinoScriptPortlet
[WARNING] Rhino script engine embedded in the default Java 1.6+ has not fully tested yet.
[WARNING] Rhino script engine embedded in the default Java 1.6+ has not fully tested yet.
[WARNING] Rhino script engine embedded in the default Java 1.6+ has not fully tested yet.
[WARNING] Rhino script engine embedded in the default Java 1.6+ has not fully tested yet.
[WARNING] Rhino script engine embedded in the default Java 1.6+ has not fully tested yet.
[WARNING] Rhino script engine embedded in the default Java 1.6+ has not fully tested yet.
[WARNING] Rhino script engine embedded in the default Java 1.6+ has not fully tested yet.
[WARNING] Rhino script engine embedded in the default Java 1.6+ has not fully tested yet.
[WARNING] Rhino script engine embedded in the default Java 1.6+ has not fully tested yet.
[WARNING] Rhino script engine embedded in the default Java 1.6+ has not fully tested yet.
Tests run: 5, Failures: 0, Errors: 0, Skipped: 0, Time elapsed: 0.019 sec
Running org.apache.portals.bridges.script.TestHelloGroovyScriptPortlet
Tests run: 5, Failures: 0, Errors: 0, Skipped: 0, Time elapsed: 5.278 sec
Running org.apache.portals.bridges.script.TestHelloBeanShellScriptPortlet
Tests run: 5, Failures: 0, Errors: 0, Skipped: 0, Time elapsed: 2.903 sec

Results :

Tests in error: 
  testInit(org.apache.portals.bridges.script.TestHelloJythonScriptPortlet)
  testRender(org.apache.portals.bridges.script.TestHelloJythonScriptPortlet)
  testProcessAction(org.apache.portals.bridges.script.TestHelloJythonScriptPortlet)
  testProcessEvent(org.apache.portals.bridges.script.TestHelloJythonScriptPortlet)
  testServeResource(org.apache.portals.bridges.script.TestHelloJythonScriptPortlet)

Tests run: 25, Failures: 0, Errors: 5, Skipped: 0

[INFO] ------------------------------------------------------------------------
[ERROR] BUILD FAILURE
[INFO] ------------------------------------------------------------------------
[INFO] There are test failures.

Please refer to /srv/gump/public/workspace/portals-bridges/bridges-script/trunk/portlet/target/surefire-reports for the individual test results.
[INFO] ------------------------------------------------------------------------
[INFO] For more information, run Maven with the -e switch
[INFO] ------------------------------------------------------------------------
[INFO] Total time: 24 seconds
[INFO] Finished at: Sat Jul 23 13:00:38 UTC 2011
[INFO] Final Memory: 17M/41M
[INFO] ------------------------------------------------------------------------
---------------------------------------------

To subscribe to this information via syndicated feeds:
- RSS: http://vmgump.apache.org/gump/public/portals-bridges/portals-bridges-script-test/rss.xml
- Atom: http://vmgump.apache.org/gump/public/portals-bridges/portals-bridges-script-test/atom.xml

============================== Gump Tracking Only ===
Produced by Apache Gump(TM) version 2.3.
Gump Run 07000623072011, vmgump.apache.org:vmgump:07000623072011
Gump E-mail Identifier (unique within run) #48.

*********************************************************** G U M P
[GUMP@vmgump]: Project portals-pluto-trunk-test (in module portals-pluto-trunk) failed
To whom it may engage...
        
This is an automated request, but not an unsolicited one. For 
more information please visit http://gump.apache.org/nagged.html, 
and/or contact the folk at general@gump.apache.org.

Project portals-pluto-trunk-test has an issue affecting its community integration.
This issue affects 1 projects,
 and has been outstanding for 4 runs.
The current state of this project is 'Failed', with reason 'Build Failed'.
For reference only, the following projects are affected by this:
    - portals-pluto-trunk-test :  JSR168 Container


Full details are available at:
    http://vmgump.apache.org/gump/public/portals-pluto-trunk/portals-pluto-trunk-test/index.html

That said, some information snippets are provided here.

The following annotations (debug/informational/warning/error messages) were provided:
 -WARNING- Overriding Maven settings: [/srv/gump/public/workspace/portals-pluto-trunk/gump_mvn_settings.xml]
 -DEBUG- (Apache Gump generated) Apache Maven Settings in: /srv/gump/public/workspace/portals-pluto-trunk/gump_mvn_settings.xml
 -INFO- Failed with reason build failed
 -DEBUG- Maven POM in: /srv/gump/public/workspace/portals-pluto-trunk/pom.xml



The following work was performed:
http://vmgump.apache.org/gump/public/portals-pluto-trunk/portals-pluto-trunk-test/gump_work/build_portals-pluto-trunk_portals-pluto-trunk-test.html
Work Name: build_portals-pluto-trunk_portals-pluto-trunk-test (Type: Build)
Work ended in a state of : Failed
Elapsed: 19 secs
Command Line: /opt/maven2/bin/mvn --batch-mode --settings /srv/gump/public/workspace/portals-pluto-trunk/gump_mvn_settings.xml package 
[Working Directory: /srv/gump/public/workspace/portals-pluto-trunk]
M2_HOME: /opt/maven2
---------------------------------------------
[ERROR] FATAL ERROR
[INFO] ------------------------------------------------------------------------
[INFO] org/xmlpull/v1/XmlPullParserFactory
org.xmlpull.v1.XmlPullParserFactory
[INFO] ------------------------------------------------------------------------
[INFO] Trace
java.lang.NoClassDefFoundError: org/xmlpull/v1/XmlPullParserFactory
	at com.thoughtworks.xstream.io.xml.XppDriver.createParser(XppDriver.java:57)
	at com.thoughtworks.xstream.io.xml.AbstractXppDriver.createReader(AbstractXppDriver.java:56)
	at com.thoughtworks.xstream.XStream.fromXML(XStream.java:892)
	at org.apache.maven.plugin.war.util.WebappStructureSerializer.fromXml(WebappStructureSerializer.java:73)
	at org.apache.maven.plugin.war.AbstractWarMojo.buildWebapp(AbstractWarMojo.java:423)
	at org.apache.maven.plugin.war.AbstractWarMojo.buildExplodedWebapp(AbstractWarMojo.java:394)
	at org.apache.maven.plugin.war.WarMojo.performPackaging(WarMojo.java:195)
	at org.apache.maven.plugin.war.WarMojo.execute(WarMojo.java:157)
	at org.apache.maven.plugin.DefaultPluginManager.executeMojo(DefaultPluginManager.java:490)
	at org.apache.maven.lifecycle.DefaultLifecycleExecutor.executeGoals(DefaultLifecycleExecutor.java:694)
	at org.apache.maven.lifecycle.DefaultLifecycleExecutor.executeGoalWithLifecycle(DefaultLifecycleExecutor.java:556)
	at org.apache.maven.lifecycle.DefaultLifecycleExecutor.executeGoal(DefaultLifecycleExecutor.java:535)
	at org.apache.maven.lifecycle.DefaultLifecycleExecutor.executeGoalAndHandleFailures(DefaultLifecycleExecutor.java:387)
	at org.apache.maven.lifecycle.DefaultLifecycleExecutor.executeTaskSegments(DefaultLifecycleExecutor.java:348)
	at org.apache.maven.lifecycle.DefaultLifecycleExecutor.execute(DefaultLifecycleExecutor.java:180)
	at org.apache.maven.DefaultMaven.doExecute(DefaultMaven.java:328)
	at org.apache.maven.DefaultMaven.execute(DefaultMaven.java:138)
	at org.apache.maven.cli.MavenCli.main(MavenCli.java:362)
	at org.apache.maven.cli.compat.CompatibleMain.main(CompatibleMain.java:60)
	at sun.reflect.NativeMethodAccessorImpl.invoke0(Native Method)
	at sun.reflect.NativeMethodAccessorImpl.invoke(NativeMethodAccessorImpl.java:57)
	at sun.reflect.DelegatingMethodAccessorImpl.invoke(DelegatingMethodAccessorImpl.java:43)
	at java.lang.reflect.Method.invoke(Method.java:616)
	at org.codehaus.classworlds.Launcher.launchEnhanced(Launcher.java:315)
	at org.codehaus.classworlds.Launcher.launch(Launcher.java:255)
	at org.codehaus.classworlds.Launcher.mainWithExitCode(Launcher.java:430)
	at org.codehaus.classworlds.Launcher.main(Launcher.java:375)
Caused by: java.lang.ClassNotFoundException: org.xmlpull.v1.XmlPullParserFactory
	at java.net.URLClassLoader$1.run(URLClassLoader.java:217)
	at java.security.AccessController.doPrivileged(Native Method)
	at java.net.URLClassLoader.findClass(URLClassLoader.java:205)
	at java.lang.ClassLoader.loadClass(ClassLoader.java:321)
	at org.codehaus.classworlds.RealmClassLoader.loadClassDirect(RealmClassLoader.java:195)
	at org.codehaus.classworlds.DefaultClassRealm.loadClass(DefaultClassRealm.java:255)
	at org.codehaus.classworlds.DefaultClassRealm.loadClass(DefaultClassRealm.java:274)
	at org.codehaus.classworlds.RealmClassLoader.loadClass(RealmClassLoader.java:214)
	at java.lang.ClassLoader.loadClass(ClassLoader.java:266)
	... 27 more
[INFO] ------------------------------------------------------------------------
[INFO] Total time: 17 seconds
[INFO] Finished at: Sat Jul 23 13:05:34 UTC 2011
[INFO] Final Memory: 31M/74M
[INFO] ------------------------------------------------------------------------
---------------------------------------------

To subscribe to this information via syndicated feeds:
- RSS: http://vmgump.apache.org/gump/public/portals-pluto-trunk/portals-pluto-trunk-test/rss.xml
- Atom: http://vmgump.apache.org/gump/public/portals-pluto-trunk/portals-pluto-trunk-test/atom.xml

============================== Gump Tracking Only ===
Produced by Apache Gump(TM) version 2.3.
Gump Run 07000623072011, vmgump.apache.org:vmgump:07000623072011
Gump E-mail Identifier (unique within run) #49.

*********************************************************** G U M P
[GUMP@vmgump]: Project james-mailbox (in module james-mailbox) failed
To whom it may engage...
        
This is an automated request, but not an unsolicited one. For 
more information please visit http://gump.apache.org/nagged.html, 
and/or contact the folk at general@gump.apache.org.

Project james-mailbox has an issue affecting its community integration.
This issue affects 2 projects,
 and has been outstanding for 81 runs.
The current state of this project is 'Failed', with reason 'Build Failed'.
For reference only, the following projects are affected by this:
    - james-mailbox :  A library providing a flexible Mailbox storage accessible by...
    - james-mailbox-test :  A library providing a flexible Mailbox storage accessible by...


Full details are available at:
    http://vmgump.apache.org/gump/public/james-mailbox/james-mailbox/index.html

That said, some information snippets are provided here.

The following annotations (debug/informational/warning/error messages) were provided:
 -INFO- Optional dependency openjpa prerequisite failed with reason build failed
 -WARNING- Overriding Maven settings: [/srv/gump/public/workspace/james-mailbox/gump_mvn_settings.xml]
 -DEBUG- (Apache Gump generated) Apache Maven Settings in: /srv/gump/public/workspace/james-mailbox/gump_mvn_settings.xml
 -INFO- Failed with reason build failed
 -DEBUG- Maven POM in: /srv/gump/public/workspace/james-mailbox/pom.xml
 -INFO- Failed to extract fallback artifacts from Gump Repository



The following work was performed:
http://vmgump.apache.org/gump/public/james-mailbox/james-mailbox/gump_work/build_james-mailbox_james-mailbox.html
Work Name: build_james-mailbox_james-mailbox (Type: Build)
Work ended in a state of : Failed
Elapsed: 32 secs
Command Line: /opt/maven3/bin/mvn --batch-mode -DskipTests=true --settings /srv/gump/public/workspace/james-mailbox/gump_mvn_settings.xml install 
[Working Directory: /srv/gump/public/workspace/james-mailbox]
M2_HOME: /opt/maven3
---------------------------------------------
[ERROR] location: class org.apache.lucene.search.SortField
[ERROR] /srv/gump/public/workspace/james-mailbox/lucene/src/main/java/org/apache/james/mailbox/lucene/search/LuceneMessageSearchIndex.java:[318,125] cannot find symbol
[ERROR] symbol  : variable LONG
[ERROR] location: class org.apache.lucene.search.SortField
[ERROR] /srv/gump/public/workspace/james-mailbox/lucene/src/main/java/org/apache/james/mailbox/lucene/search/LuceneMessageSearchIndex.java:[319,133] cannot find symbol
[ERROR] symbol  : variable LONG
[ERROR] location: class org.apache.lucene.search.SortField
[ERROR] /srv/gump/public/workspace/james-mailbox/lucene/src/main/java/org/apache/james/mailbox/lucene/search/LuceneMessageSearchIndex.java:[321,98] cannot find symbol
[ERROR] symbol  : variable STRING
[ERROR] location: class org.apache.lucene.search.SortField
[ERROR] /srv/gump/public/workspace/james-mailbox/lucene/src/main/java/org/apache/james/mailbox/lucene/search/LuceneMessageSearchIndex.java:[322,106] cannot find symbol
[ERROR] symbol  : variable STRING
[ERROR] location: class org.apache.lucene.search.SortField
[ERROR] /srv/gump/public/workspace/james-mailbox/lucene/src/main/java/org/apache/james/mailbox/lucene/search/LuceneMessageSearchIndex.java:[324,120] cannot find symbol
[ERROR] symbol  : variable LONG
[ERROR] location: class org.apache.lucene.search.SortField
[ERROR] /srv/gump/public/workspace/james-mailbox/lucene/src/main/java/org/apache/james/mailbox/lucene/search/LuceneMessageSearchIndex.java:[325,128] cannot find symbol
[ERROR] symbol  : variable LONG
[ERROR] location: class org.apache.lucene.search.SortField
[ERROR] /srv/gump/public/workspace/james-mailbox/lucene/src/main/java/org/apache/james/mailbox/lucene/search/LuceneMessageSearchIndex.java:[327,122] cannot find symbol
[ERROR] symbol  : variable STRING
[ERROR] location: class org.apache.lucene.search.SortField
[ERROR] /srv/gump/public/workspace/james-mailbox/lucene/src/main/java/org/apache/james/mailbox/lucene/search/LuceneMessageSearchIndex.java:[328,130] cannot find symbol
[ERROR] symbol  : variable STRING
[ERROR] location: class org.apache.lucene.search.SortField
[ERROR] /srv/gump/public/workspace/james-mailbox/lucene/src/main/java/org/apache/james/mailbox/lucene/search/LuceneMessageSearchIndex.java:[330,126] cannot find symbol
[ERROR] symbol  : variable STRING
[ERROR] location: class org.apache.lucene.search.SortField
[ERROR] /srv/gump/public/workspace/james-mailbox/lucene/src/main/java/org/apache/james/mailbox/lucene/search/LuceneMessageSearchIndex.java:[331,134] cannot find symbol
[ERROR] symbol  : variable STRING
[ERROR] location: class org.apache.lucene.search.SortField
[ERROR] /srv/gump/public/workspace/james-mailbox/lucene/src/main/java/org/apache/james/mailbox/lucene/search/LuceneMessageSearchIndex.java:[805,19] cannot find symbol
[ERROR] symbol  : constructor TermRangeQuery(java.lang.String,java.lang.String,java.lang.String,boolean,boolean)
[ERROR] location: class org.apache.lucene.search.TermRangeQuery
[ERROR] /srv/gump/public/workspace/james-mailbox/lucene/src/main/java/org/apache/james/mailbox/lucene/search/LuceneMessageSearchIndex.java:[807,19] cannot find symbol
[ERROR] symbol  : constructor TermRangeQuery(java.lang.String,java.lang.String,java.lang.String,boolean,boolean)
[ERROR] location: class org.apache.lucene.search.TermRangeQuery
[ERROR] /srv/gump/public/workspace/james-mailbox/lucene/src/main/java/org/apache/james/mailbox/lucene/search/LenientImapSearchAnalyzer.java:[52,57] cannot find symbol
[ERROR] symbol  : class WhitespaceTokenizer
[ERROR] location: class org.apache.james.mailbox.lucene.search.LenientImapSearchAnalyzer
[ERROR] -> [Help 1]
[ERROR] 
[ERROR] To see the full stack trace of the errors, re-run Maven with the -e switch.
[ERROR] Re-run Maven using the -X switch to enable full debug logging.
[ERROR] 
[ERROR] For more information about the errors and possible solutions, please read the following articles:
[ERROR] [Help 1] http://cwiki.apache.org/confluence/display/MAVEN/MojoFailureException
[ERROR] 
[ERROR] After correcting the problems, you can resume the build with the command
[ERROR]   mvn <goals> -rf :apache-james-mailbox-lucene
---------------------------------------------

To subscribe to this information via syndicated feeds:
- RSS: http://vmgump.apache.org/gump/public/james-mailbox/james-mailbox/rss.xml
- Atom: http://vmgump.apache.org/gump/public/james-mailbox/james-mailbox/atom.xml

============================== Gump Tracking Only ===
Produced by Apache Gump(TM) version 2.3.
Gump Run 07000623072011, vmgump.apache.org:vmgump:07000623072011
Gump E-mail Identifier (unique within run) #50.

*********************************************************** G U M P
[GUMP@vmgump]: Project apacheds-protocol-changepw (in module apacheds) failed
To whom it may engage...
        
This is an automated request, but not an unsolicited one. For 
more information please visit http://gump.apache.org/nagged.html, 
and/or contact the folk at general@gump.apache.org.

Project apacheds-protocol-changepw has an issue affecting its community integration.
This issue affects 4 projects,
 and has been outstanding for 59 runs.
The current state of this project is 'Failed', with reason 'Build Failed'.
For reference only, the following projects are affected by this:
    - apacheds-protocol-changepw :  Apache Directory Server
    - apacheds-service :  Apache Directory Server
    - apacheds-service-builder :  Apache Directory Server
    - apacheds-wrapper :  Apache Directory Server


Full details are available at:
    http://vmgump.apache.org/gump/public/apacheds/apacheds-protocol-changepw/index.html

That said, some information snippets are provided here.

The following annotations (debug/informational/warning/error messages) were provided:
 -DEBUG- Sole jar output [apacheds-protocol-changepw-*[0-9T].jar] identifier set to project name
 -DEBUG- (Apache Gump generated) Apache Maven Settings in: /srv/gump/public/workspace/apacheds/protocol-changepw/gump_mvn_settings.xml
 -INFO- Failed with reason build failed
 -DEBUG- Maven POM in: /srv/gump/public/workspace/apacheds/protocol-changepw/pom.xml
 -INFO- Failed to extract fallback artifacts from Gump Repository



The following work was performed:
http://vmgump.apache.org/gump/public/apacheds/apacheds-protocol-changepw/gump_work/build_apacheds_apacheds-protocol-changepw.html
Work Name: build_apacheds_apacheds-protocol-changepw (Type: Build)
Work ended in a state of : Failed
Elapsed: 1 sec
Command Line: /opt/maven3/bin/mvn --batch-mode --settings /srv/gump/public/workspace/apacheds/protocol-changepw/gump_mvn_settings.xml install 
[Working Directory: /srv/gump/public/workspace/apacheds/protocol-changepw]
M2_HOME: /opt/maven3
---------------------------------------------
[INFO] Scanning for projects...
[ERROR] The build could not read 1 project -> [Help 1]
[ERROR]   
[ERROR]   The project org.apache.directory.server:apacheds-protocol-changepw:1.5.8-SNAPSHOT (/srv/gump/public/workspace/apacheds/protocol-changepw/pom.xml) has 1 error
[ERROR]     Non-resolvable parent POM: Could not find artifact org.apache.directory.server:apacheds-parent:pom:1.5.8-SNAPSHOT and 'parent.relativePath' points at wrong local POM @ line 22, column 11 -> [Help 2]
[ERROR] 
[ERROR] To see the full stack trace of the errors, re-run Maven with the -e switch.
[ERROR] Re-run Maven using the -X switch to enable full debug logging.
[ERROR] 
[ERROR] For more information about the errors and possible solutions, please read the following articles:
[ERROR] [Help 1] http://cwiki.apache.org/confluence/display/MAVEN/ProjectBuildingException
[ERROR] [Help 2] http://cwiki.apache.org/confluence/display/MAVEN/UnresolvableModelException
---------------------------------------------

To subscribe to this information via syndicated feeds:
- RSS: http://vmgump.apache.org/gump/public/apacheds/apacheds-protocol-changepw/rss.xml
- Atom: http://vmgump.apache.org/gump/public/apacheds/apacheds-protocol-changepw/atom.xml

============================== Gump Tracking Only ===
Produced by Apache Gump(TM) version 2.3.
Gump Run 07000623072011, vmgump.apache.org:vmgump:07000623072011
Gump E-mail Identifier (unique within run) #51.

*********************************************************** G U M P
[GUMP@vmgump]: Project apacheds-protocol-ldap (in module apacheds) failed
To whom it may engage...
        
This is an automated request, but not an unsolicited one. For 
more information please visit http://gump.apache.org/nagged.html, 
and/or contact the folk at general@gump.apache.org.

Project apacheds-protocol-ldap has an issue affecting its community integration.
This issue affects 13 projects,
 and has been outstanding for 59 runs.
The current state of this project is 'Failed', with reason 'Build Failed'.
For reference only, the following projects are affected by this:
    - apacheds-all :  Apache Directory Server
    - apacheds-core-integ :  Apache Directory Server
    - apacheds-core-integ-test :  Apache Directory Server
    - apacheds-kerberos-test :  Apache Directory Server
    - apacheds-ldap-client-test :  Apache Directory Server
    - apacheds-protocol-ldap :  Apache Directory Server
    - apacheds-server-annotations :  Apache Directory Server
    - apacheds-server-integ :  Apache Directory Server
    - apacheds-server-integ-test :  Apache Directory Server
    - apacheds-server-jndi :  Apache Directory Server
    - apacheds-server-tools :  Apache Directory Server
    - apacheds-test-framework :  Apache Directory Server
    - syncrepl :  Apache Directory Server


Full details are available at:
    http://vmgump.apache.org/gump/public/apacheds/apacheds-protocol-ldap/index.html

That said, some information snippets are provided here.

The following annotations (debug/informational/warning/error messages) were provided:
 -DEBUG- Sole jar output [apacheds-protocol-ldap-*[0-9T].jar] identifier set to project name
 -DEBUG- (Apache Gump generated) Apache Maven Settings in: /srv/gump/public/workspace/apacheds/protocol-ldap/gump_mvn_settings.xml
 -INFO- Failed with reason build failed
 -DEBUG- Maven POM in: /srv/gump/public/workspace/apacheds/protocol-ldap/pom.xml
 -INFO- Failed to extract fallback artifacts from Gump Repository



The following work was performed:
http://vmgump.apache.org/gump/public/apacheds/apacheds-protocol-ldap/gump_work/build_apacheds_apacheds-protocol-ldap.html
Work Name: build_apacheds_apacheds-protocol-ldap (Type: Build)
Work ended in a state of : Failed
Elapsed: 1 min 59 secs
Command Line: /opt/maven3/bin/mvn --batch-mode --settings /srv/gump/public/workspace/apacheds/protocol-ldap/gump_mvn_settings.xml install 
[Working Directory: /srv/gump/public/workspace/apacheds/protocol-ldap]
M2_HOME: /opt/maven3
---------------------------------------------
[ERROR] location: class org.apache.directory.server.ldap.replication.SyncReplSearchListener
[ERROR] /srv/gump/public/workspace/apacheds/protocol-ldap/src/main/java/org/apache/directory/server/ldap/replication/SyncReplSearchListener.java:[383,45] cannot find symbol
[ERROR] symbol  : variable SyncStateTypeEnum
[ERROR] location: class org.apache.directory.server.ldap.replication.SyncReplSearchListener
[ERROR] /srv/gump/public/workspace/apacheds/protocol-ldap/src/main/java/org/apache/directory/server/ldap/replication/ReplicaEventMessage.java:[112,12] cannot find symbol
[ERROR] symbol  : class SyncModifyDnType
[ERROR] location: class org.apache.directory.server.ldap.replication.ReplicaEventMessage
[ERROR] /srv/gump/public/workspace/apacheds/protocol-ldap/src/main/java/org/apache/directory/server/ldap/replication/ReplicaEventMessage.java:[112,41] cannot find symbol
[ERROR] symbol  : variable SyncModifyDnType
[ERROR] location: class org.apache.directory.server.ldap.replication.ReplicaEventMessage
[ERROR] /srv/gump/public/workspace/apacheds/protocol-ldap/src/main/java/org/apache/directory/server/ldap/replication/ReplicaEventMessage.java:[114,31] cannot find symbol
[ERROR] symbol  : class SyncModifyDnDecorator
[ERROR] location: class org.apache.directory.server.ldap.replication.ReplicaEventMessage
[ERROR] /srv/gump/public/workspace/apacheds/protocol-ldap/src/main/java/org/apache/directory/server/ldap/replication/ReplicaEventMessage.java:[121,21] cannot find symbol
[ERROR] symbol  : variable MOVE
[ERROR] location: class org.apache.directory.server.ldap.replication.ReplicaEventMessage
[ERROR] /srv/gump/public/workspace/apacheds/protocol-ldap/src/main/java/org/apache/directory/server/ldap/replication/ReplicaEventMessage.java:[125,21] cannot find symbol
[ERROR] symbol  : variable RENAME
[ERROR] location: class org.apache.directory.server.ldap.replication.ReplicaEventMessage
[ERROR] /srv/gump/public/workspace/apacheds/protocol-ldap/src/main/java/org/apache/directory/server/ldap/replication/ReplicaEventMessage.java:[130,21] cannot find symbol
[ERROR] symbol  : variable MOVEANDRENAME
[ERROR] location: class org.apache.directory.server.ldap.replication.ReplicaEventMessage
[ERROR] /srv/gump/public/workspace/apacheds/protocol-ldap/src/main/java/org/apache/directory/server/ldap/replication/ReplicaEventMessage.java:[198,12] cannot find symbol
[ERROR] symbol  : class SyncModifyDnType
[ERROR] location: class org.apache.directory.server.ldap.replication.ReplicaEventMessage
[ERROR] /srv/gump/public/workspace/apacheds/protocol-ldap/src/main/java/org/apache/directory/server/ldap/replication/ReplicaEventMessage.java:[204,21] cannot find symbol
[ERROR] symbol  : variable MOVE
[ERROR] location: class org.apache.directory.server.ldap.replication.ReplicaEventMessage
[ERROR] /srv/gump/public/workspace/apacheds/protocol-ldap/src/main/java/org/apache/directory/server/ldap/replication/ReplicaEventMessage.java:[208,21] cannot find symbol
[ERROR] symbol  : variable RENAME
[ERROR] location: class org.apache.directory.server.ldap.replication.ReplicaEventMessage
[ERROR] /srv/gump/public/workspace/apacheds/protocol-ldap/src/main/java/org/apache/directory/server/ldap/replication/ReplicaEventMessage.java:[213,21] cannot find symbol
[ERROR] symbol  : variable MOVEANDRENAME
[ERROR] location: class org.apache.directory.server.ldap.replication.ReplicaEventMessage
[ERROR] /srv/gump/public/workspace/apacheds/protocol-ldap/src/main/java/org/apache/directory/server/ldap/LdapServer.java:[244,36] cannot find symbol
[ERROR] symbol  : variable SyncDoneValue
[ERROR] location: class org.apache.directory.server.ldap.LdapServer
[ERROR] /srv/gump/public/workspace/apacheds/protocol-ldap/src/main/java/org/apache/directory/server/ldap/LdapServer.java:[245,36] cannot find symbol
[ERROR] symbol  : variable SyncInfoValue
[ERROR] location: class org.apache.directory.server.ldap.LdapServer
[ERROR] /srv/gump/public/workspace/apacheds/protocol-ldap/src/main/java/org/apache/directory/server/ldap/LdapServer.java:[246,36] cannot find symbol
[ERROR] symbol  : variable SyncRequestValue
[ERROR] location: class org.apache.directory.server.ldap.LdapServer
[ERROR] -> [Help 1]
[ERROR] 
[ERROR] To see the full stack trace of the errors, re-run Maven with the -e switch.
[ERROR] Re-run Maven using the -X switch to enable full debug logging.
[ERROR] 
[ERROR] For more information about the errors and possible solutions, please read the following articles:
[ERROR] [Help 1] http://cwiki.apache.org/confluence/display/MAVEN/MojoFailureException
---------------------------------------------

To subscribe to this information via syndicated feeds:
- RSS: http://vmgump.apache.org/gump/public/apacheds/apacheds-protocol-ldap/rss.xml
- Atom: http://vmgump.apache.org/gump/public/apacheds/apacheds-protocol-ldap/atom.xml

============================== Gump Tracking Only ===
Produced by Apache Gump(TM) version 2.3.
Gump Run 07000623072011, vmgump.apache.org:vmgump:07000623072011
Gump E-mail Identifier (unique within run) #52.

*********************************************************** G U M P
[GUMP@vmgump]: Project activemq-jaas-test (in module activemq) failed
To whom it may engage...
        
This is an automated request, but not an unsolicited one. For 
more information please visit http://gump.apache.org/nagged.html, 
and/or contact the folk at general@gump.apache.org.

Project activemq-jaas-test has an issue affecting its community integration.
This issue affects 1 projects,
 and has been outstanding for 123 runs.
The current state of this project is 'Failed', with reason 'Build Failed'.
For reference only, the following projects are affected by this:
    - activemq-jaas-test :  ActiveMQ message broker and enterprise integration patterns ...


Full details are available at:
    http://vmgump.apache.org/gump/public/activemq/activemq-jaas-test/index.html

That said, some information snippets are provided here.

The following annotations (debug/informational/warning/error messages) were provided:
 -WARNING- Overriding Maven settings: [/srv/gump/public/workspace/activemq/activemq-jaas/gump_mvn_settings.xml]
 -DEBUG- (Apache Gump generated) Apache Maven Settings in: /srv/gump/public/workspace/activemq/activemq-jaas/gump_mvn_settings.xml
 -INFO- Failed with reason build failed
 -DEBUG- Maven POM in: /srv/gump/public/workspace/activemq/activemq-jaas/pom.xml



The following work was performed:
http://vmgump.apache.org/gump/public/activemq/activemq-jaas-test/gump_work/build_activemq_activemq-jaas-test.html
Work Name: build_activemq_activemq-jaas-test (Type: Build)
Work ended in a state of : Failed
Elapsed: 17 secs
Command Line: /opt/maven2/bin/mvn --batch-mode --settings /srv/gump/public/workspace/activemq/activemq-jaas/gump_mvn_settings.xml package 
[Working Directory: /srv/gump/public/workspace/activemq/activemq-jaas]
M2_HOME: /opt/maven2
---------------------------------------------
[INFO] [enforcer:enforce {execution: default}]
[INFO] [bundle:cleanVersions {execution: cleanVersions}]
[INFO] Setting property: classpath.resource.loader.class => 'org.codehaus.plexus.velocity.ContextClassLoaderResourceLoader'.
[INFO] Setting property: velocimacro.messages.on => 'false'.
[INFO] Setting property: resource.loader => 'classpath'.
[INFO] Setting property: resource.manager.logwhenfound => 'false'.
[INFO] [remote-resources:process {execution: default}]
[INFO] [resources:resources {execution: default-resources}]
[INFO] Using 'UTF-8' encoding to copy filtered resources.
[INFO] skip non existing resourceDirectory /srv/gump/public/workspace/activemq/activemq-jaas/src/main/resources
[INFO] Copying 3 resources
[INFO] [compiler:compile {execution: default-compile}]
[INFO] Nothing to compile - all classes are up to date
[INFO] [resources:testResources {execution: default-testResources}]
[INFO] Using 'UTF-8' encoding to copy filtered resources.
[INFO] Copying 6 resources
[INFO] Copying 3 resources
[INFO] [compiler:testCompile {execution: default-testCompile}]
[INFO] Nothing to compile - all classes are up to date
[WARNING] DEPRECATED [systemProperties]: Use systemPropertyVariables instead.
[INFO] [surefire:test {execution: default-test}]
[INFO] Surefire report directory: /srv/gump/public/workspace/activemq/activemq-jaas/target/surefire-reports

-------------------------------------------------------
 T E S T S
-------------------------------------------------------
Running org.apache.activemq.jaas.GroupPrincipalTest
Tests run: 3, Failures: 0, Errors: 0, Skipped: 0, Time elapsed: 0.169 sec
Running org.apache.activemq.jaas.CertificateLoginModuleTest
Tests run: 3, Failures: 0, Errors: 0, Skipped: 0, Time elapsed: 0.147 sec
Running org.apache.activemq.jaas.PropertiesLoginModuleTest
Tests run: 3, Failures: 0, Errors: 0, Skipped: 0, Time elapsed: 0.067 sec
Running org.apache.activemq.jaas.UserPrincipalTest
Tests run: 3, Failures: 0, Errors: 0, Skipped: 0, Time elapsed: 0.01 sec
Running org.apache.activemq.jaas.GuestLoginModuleTest
Tests run: 2, Failures: 0, Errors: 0, Skipped: 0, Time elapsed: 0.024 sec
Running org.apache.activemq.jaas.LDAPLoginModuleTest
[INFO] ------------------------------------------------------------------------
[ERROR] BUILD FAILURE
[INFO] ------------------------------------------------------------------------
[INFO] There are test failures.

Please refer to /srv/gump/public/workspace/activemq/activemq-jaas/target/surefire-reports for the individual test results.
[INFO] ------------------------------------------------------------------------
[INFO] For more information, run Maven with the -e switch
[INFO] ------------------------------------------------------------------------
[INFO] Total time: 16 seconds
[INFO] Finished at: Sat Jul 23 13:25:55 UTC 2011
[INFO] Final Memory: 38M/90M
[INFO] ------------------------------------------------------------------------
---------------------------------------------

To subscribe to this information via syndicated feeds:
- RSS: http://vmgump.apache.org/gump/public/activemq/activemq-jaas-test/rss.xml
- Atom: http://vmgump.apache.org/gump/public/activemq/activemq-jaas-test/atom.xml

============================== Gump Tracking Only ===
Produced by Apache Gump(TM) version 2.3.
Gump Run 07000623072011, vmgump.apache.org:vmgump:07000623072011
Gump E-mail Identifier (unique within run) #54.

*********************************************************** G U M P
[GUMP@vmgump]: Project james-server (in module james-server) failed
To whom it may engage...
        
This is an automated request, but not an unsolicited one. For 
more information please visit http://gump.apache.org/nagged.html, 
and/or contact the folk at general@gump.apache.org.

Project james-server has an issue affecting its community integration.
This issue affects 2 projects,
 and has been outstanding for 123 runs.
The current state of this project is 'Failed', with reason 'Build Failed'.
For reference only, the following projects are affected by this:
    - james-server :  James Server
    - james-server-test :  James Server


Full details are available at:
    http://vmgump.apache.org/gump/public/james-server/james-server/index.html

That said, some information snippets are provided here.

The following annotations (debug/informational/warning/error messages) were provided:
 -INFO- Optional dependency apache-standard-mailets-test failed with reason build failed
 -INFO- Optional dependency camel-jms prerequisite failed with reason build failed
 -INFO- Optional dependency james-jsieve failed with reason build failed
 -INFO- Optional dependency openjpa prerequisite failed with reason build failed
 -INFO- Optional dependency activemq-pool prerequisite failed with reason build failed
 -INFO- Optional dependency activemq-core failed with reason build failed
 -DEBUG- (Apache Gump generated) Apache Maven Settings in: /srv/gump/public/workspace/james-server/gump_mvn_settings.xml
 -INFO- Failed with reason build failed
 -DEBUG- Maven POM in: /srv/gump/public/workspace/james-server/pom.xml
 -INFO- Failed to extract fallback artifacts from Gump Repository



The following work was performed:
http://vmgump.apache.org/gump/public/james-server/james-server/gump_work/build_james-server_james-server.html
Work Name: build_james-server_james-server (Type: Build)
Work ended in a state of : Failed
Elapsed: 1 min 8 secs
Command Line: /opt/maven3/bin/mvn --batch-mode -Dmaven.test.skip=true --settings /srv/gump/public/workspace/james-server/gump_mvn_settings.xml install 
[Working Directory: /srv/gump/public/workspace/james-server]
MAVEN_OPTS: -Xmx768m 
M2_HOME: /opt/maven3
---------------------------------------------
[INFO] Reactor Summary:
[INFO] 
[INFO] Apache James Server ............................... SUCCESS [4.947s]
[INFO] Apache James Server Lifecycle API ................. SUCCESS [3.515s]
[INFO] Apache James Server Filesystem API ................ SUCCESS [1.964s]
[INFO] Apache James Server Data API ...................... SUCCESS [2.762s]
[INFO] Apache James Server Lifecycle Spring .............. SUCCESS [26.896s]
[INFO] Apache James Server Mailetcontainer API ........... SUCCESS [1.878s]
[INFO] Apache James Server Core .......................... SUCCESS [2.348s]
[INFO] Apache James Server Container Spring .............. SUCCESS [12.583s]
[INFO] Apache James Server DNS Server API ................ SUCCESS [1.658s]
[INFO] Apache James Server DNSService Implementation ..... SUCCESS [2.640s]
[INFO] Apache James Server DNSService Library ............ FAILURE [0.488s]
[INFO] Apache James Server Queue API ..................... SKIPPED
[INFO] Apache James Server Common Utilities .............. SKIPPED
[INFO] Apache James Server FetchMail ..................... SKIPPED
[INFO] Apache James Server Protocols Library ............. SKIPPED
[INFO] Apache James Server IMAP .......................... SKIPPED
[INFO] Apache James Server Data Library .................. SKIPPED
[INFO] Apache James Server SMTP .......................... SKIPPED
[INFO] Apache James Server LMTP .......................... SKIPPED
[INFO] Apache James Server JPA Data Persistence .......... SKIPPED
[INFO] Apache James Server JCR Data Persistence .......... SKIPPED
[INFO] Apache James Server JDBC Data Persistence ......... SKIPPED
[INFO] Apache James Server File Data Persistence ......... SKIPPED
[INFO] Apache James Server Mailbox Adapter ............... SKIPPED
[INFO] Apache James Server Mailetcontainer Camel implementation  SKIPPED
[INFO] Apache James Server Mailets ....................... SKIPPED
[INFO] Apache James Server POP3 .......................... SKIPPED
[INFO] Apache James Server JMS Mail Queue ................ SKIPPED
[INFO] Apache James Server ActiveMQ Queue ................ SKIPPED
[INFO] Apache James Server LDAP Data Implementation ...... SKIPPED
[INFO] Apache James Server Client ........................ SKIPPED
[INFO] ------------------------------------------------------------------------
[INFO] BUILD FAILURE
[INFO] ------------------------------------------------------------------------
[INFO] Total time: 1:06.747s
[INFO] Finished at: Sat Jul 23 13:27:28 UTC 2011
[INFO] Final Memory: 53M/128M
[INFO] ------------------------------------------------------------------------
[ERROR] Failed to execute goal on project james-server-dnsservice-library: Could not resolve dependencies for project org.apache.james:james-server-dnsservice-library:jar:3.0-beta4-SNAPSHOT: Could not find artifact org.apache.james:james-server-dnsservice-api:jar:tests:3.0-beta4-SNAPSHOT in gump-maven2-repository.dev.java.net (http://localhost:8192/maven/2) -> [Help 1]
[ERROR] 
[ERROR] To see the full stack trace of the errors, re-run Maven with the -e switch.
[ERROR] Re-run Maven using the -X switch to enable full debug logging.
[ERROR] 
[ERROR] For more information about the errors and possible solutions, please read the following articles:
[ERROR] [Help 1] http://cwiki.apache.org/confluence/display/MAVEN/DependencyResolutionException
[ERROR] 
[ERROR] After correcting the problems, you can resume the build with the command
[ERROR]   mvn <goals> -rf :james-server-dnsservice-library
---------------------------------------------

To subscribe to this information via syndicated feeds:
- RSS: http://vmgump.apache.org/gump/public/james-server/james-server/rss.xml
- Atom: http://vmgump.apache.org/gump/public/james-server/james-server/atom.xml

============================== Gump Tracking Only ===
Produced by Apache Gump(TM) version 2.3.
Gump Run 07000623072011, vmgump.apache.org:vmgump:07000623072011
Gump E-mail Identifier (unique within run) #55.


--
Apache Gump
http://gump.apache.org/ [Instance: vmgump]

---------------------------------------------------------------------
To unsubscribe, e-mail: general-unsubscribe@gump.apache.org
For additional commands, e-mail: general-help@gump.apache.org


Mime
View raw message