gump-general mailing list archives

Site index · List index
Message view « Date » · « Thread »
Top « Date » · « Thread »
From g...@vmgump.apache.org
Subject BATCH: All dressed up, with nowhere to go...
Date Mon, 20 Jun 2011 01:49:39 GMT
Dear Gumpmeisters,
            
The following 2 notifys should have been sent

*********************************************************** G U M P
[GUMP@vmgump]: Project camel-spring-test (in module camel) failed
[GUMP@vmgump]: Project camel-test (in module camel) failed
*********************************************************** G U M P
[GUMP@vmgump]: Project camel-spring-test (in module camel) failed
To whom it may engage...
        
This is an automated request, but not an unsolicited one. For 
more information please visit http://gump.apache.org/nagged.html, 
and/or contact the folk at general@gump.apache.org.

Project camel-spring-test has an issue affecting its community integration.
This issue affects 1 projects.
The current state of this project is 'Failed', with reason 'Build Failed'.
For reference only, the following projects are affected by this:
    - camel-spring-test :  Integration framework based on known Enterprise Integration
...


Full details are available at:
    http://vmgump.apache.org/gump/public/camel/camel-spring-test/index.html

That said, some information snippets are provided here.

The following annotations (debug/informational/warning/error messages) were provided:
 -WARNING- Overriding Maven settings: [/srv/gump/public/workspace/camel/components/camel-spring/gump_mvn_settings.xml]
 -DEBUG- (Apache Gump generated) Apache Maven Settings in: /srv/gump/public/workspace/camel/components/camel-spring/gump_mvn_settings.xml
 -INFO- Failed with reason build failed
 -DEBUG- Maven POM in: /srv/gump/public/workspace/camel/components/camel-spring/pom.xml
 -INFO- Project Reports in: /srv/gump/public/workspace/camel/components/camel-spring/target/surefire-reports



The following work was performed:
http://vmgump.apache.org/gump/public/camel/camel-spring-test/gump_work/build_camel_camel-spring-test.html
Work Name: build_camel_camel-spring-test (Type: Build)
Work ended in a state of : Failed
Elapsed: 2 mins 39 secs
Command Line: /opt/maven2/bin/mvn --batch-mode --settings /srv/gump/public/workspace/camel/components/camel-spring/gump_mvn_settings.xml
test 
[Working Directory: /srv/gump/public/workspace/camel/components/camel-spring]
M2_HOME: /opt/maven2
---------------------------------------------
  testChooseMethodUsingBodyType(org.apache.camel.component.bean.BeanRouteTest)
  testAmbiguousMethodCallFails(org.apache.camel.component.bean.BeanRouteTest)
  testBeanBindingUsingBeanExpression(org.apache.camel.component.bean.BeanBindingTest)
  testBeanBindingUsingConstantExpression(org.apache.camel.component.bean.BeanBindingTest)
  testBeanBindingUsingHeaderExpression(org.apache.camel.component.bean.BeanBindingTest)
  testBeanBindingUsingManyExpression(org.apache.camel.component.bean.BeanBindingTest)
  testSendBody(org.apache.camel.component.bean.BeanWithRecipientListTest)
  testXsltIncludeRelativeOther(org.apache.camel.component.xslt.XsltIncludeRelativeOtherTest)
  testXsltOutput(org.apache.camel.component.xslt.XsltOutputBytesTest)
  testXsltOutput(org.apache.camel.component.xslt.XsltOutputStringTest)
  testConverterReference(org.apache.camel.component.xslt.XsltReferenceParameterTest)
  testTransformerFactoryReference(org.apache.camel.component.xslt.XsltReferenceParameterTest)
  testXsltIncludeClasspath(org.apache.camel.component.xslt.XsltIncludeClasspathTest)
  testXsltOutput(org.apache.camel.component.xslt.XsltOutputDOMTest)
  testNotCached(org.apache.camel.component.xslt.XsltContentCacheTest)
  testCached(org.apache.camel.component.xslt.XsltContentCacheTest)
  testCachedIsDefault(org.apache.camel.component.xslt.XsltContentCacheTest)
  testXsltOutput(org.apache.camel.component.xslt.XsltOutputFileTest)
  testXsltOutputFileMissingHeader(org.apache.camel.component.xslt.XsltOutputFileTest)
  testInvalidStylesheet(org.apache.camel.component.xslt.InvalidXsltFileTest)
  testXsltInclude(org.apache.camel.component.xslt.XsltIncludeTest)
  testSendMessageAndHaveItTransformed(org.apache.camel.component.xslt.XsltRouteTest)
  testXsltIncludeRelative(org.apache.camel.component.xslt.XsltIncludeRelativeTest)
  testXsltOutputDeleteFile(org.apache.camel.component.xslt.XsltOutputFileDeleteTest)
  testNoXsltFile(org.apache.camel.component.xslt.XsltFileNotFoundTest)
  testXsltException(org.apache.camel.component.xslt.XsltTransformingExceptionTest)
  testXsltWithoutException(org.apache.camel.component.xslt.XsltTransformingExceptionTest)
  testFragmentPassedToXslt(org.apache.camel.component.xslt.XsltXmlFragmentTest)
  testSendingCamelExchangeToEndpointResultsInValidApplicationEventAfterTheRefreshEvent(org.apache.camel.component.log.SpringLogTest)
  testSendingCamelExchangeToEndpointResultsInValidApplicationEventAfterTheRefreshEvent(org.apache.camel.component.event.MistypedPackageTest)
  testSendingCamelExchangeToEndpointResultsInValidApplicationEventAfterTheRefreshEvent(org.apache.camel.component.event.EventRouteTest)
  testValidMessage(org.apache.camel.component.validator.ValidatorRouteTest)
  testInvalidMessage(org.apache.camel.component.validator.ValidatorRouteTest)
  testRun(org.apache.camel.component.dataset.SpringDataSetTest)

Tests run: 871, Failures: 0, Errors: 833, Skipped: 1

[INFO] ------------------------------------------------------------------------
[ERROR] BUILD FAILURE
[INFO] ------------------------------------------------------------------------
[INFO] There are test failures.

Please refer to /srv/gump/public/workspace/camel/components/camel-spring/target/surefire-reports
for the individual test results.
[INFO] ------------------------------------------------------------------------
[INFO] For more information, run Maven with the -e switch
[INFO] ------------------------------------------------------------------------
[INFO] Total time: 2 minutes 38 seconds
[INFO] Finished at: Sun Jun 19 22:14:51 UTC 2011
[INFO] Final Memory: 44M/107M
[INFO] ------------------------------------------------------------------------
---------------------------------------------

To subscribe to this information via syndicated feeds:
- RSS: http://vmgump.apache.org/gump/public/camel/camel-spring-test/rss.xml
- Atom: http://vmgump.apache.org/gump/public/camel/camel-spring-test/atom.xml

============================== Gump Tracking Only ===
Produced by Apache Gump(TM) version 2.3.
Gump Run 05001819062011, vmgump.apache.org:vmgump:05001819062011
Gump E-mail Identifier (unique within run) #1.

*********************************************************** G U M P
[GUMP@vmgump]: Project camel-test (in module camel) failed
To whom it may engage...
        
This is an automated request, but not an unsolicited one. For 
more information please visit http://gump.apache.org/nagged.html, 
and/or contact the folk at general@gump.apache.org.

Project camel-test has an issue affecting its community integration.
This issue affects 3 projects.
The current state of this project is 'Failed', with reason 'Build Failed'.
For reference only, the following projects are affected by this:
    - camel-jms :  Camel :: JMS
    - camel-jms-test :  Integration framework based on known Enterprise Integration
...
    - camel-test :  Camel :: Test


Full details are available at:
    http://vmgump.apache.org/gump/public/camel/camel-test/index.html

That said, some information snippets are provided here.

The following annotations (debug/informational/warning/error messages) were provided:
 -DEBUG- Sole jar output [camel-test-*[0-9T].jar] identifier set to project name
 -DEBUG- (Apache Gump generated) Apache Maven Settings in: /srv/gump/public/workspace/camel/components/camel-test/gump_mvn_settings.xml
 -INFO- Failed with reason build failed
 -DEBUG- Maven POM in: /srv/gump/public/workspace/camel/components/camel-test/pom.xml
 -INFO- Failed to extract fallback artifacts from Gump Repository



The following work was performed:
http://vmgump.apache.org/gump/public/camel/camel-test/gump_work/build_camel_camel-test.html
Work Name: build_camel_camel-test (Type: Build)
Work ended in a state of : Failed
Elapsed: 17 secs
Command Line: /opt/maven2/bin/mvn --batch-mode --settings /srv/gump/public/workspace/camel/components/camel-test/gump_mvn_settings.xml
install 
[Working Directory: /srv/gump/public/workspace/camel/components/camel-test]
M2_HOME: /opt/maven2
---------------------------------------------
Tests run: 2, Failures: 0, Errors: 2, Skipped: 0, Time elapsed: 0.151 sec <<< FAILURE!
Running org.apache.camel.test.patterns.DebugTest
Tests run: 2, Failures: 0, Errors: 2, Skipped: 0, Time elapsed: 0.065 sec <<< FAILURE!
Running org.apache.camel.test.patterns.FilterJUnit4Test
Tests run: 2, Failures: 0, Errors: 2, Skipped: 0, Time elapsed: 0.122 sec <<< FAILURE!
Running org.apache.camel.test.patterns.FilterCreateCamelContextPerClassTest
Tests run: 2, Failures: 0, Errors: 2, Skipped: 0, Time elapsed: 0.061 sec <<< FAILURE!
Running org.apache.camel.test.patterns.IsMockEndpointsJUnit4Test
Tests run: 1, Failures: 0, Errors: 1, Skipped: 0, Time elapsed: 0.032 sec <<< FAILURE!
Running org.apache.camel.test.patterns.DebugNoLazyTypeConverterTest
Tests run: 2, Failures: 0, Errors: 2, Skipped: 0, Time elapsed: 0.047 sec <<< FAILURE!
Running org.apache.camel.test.patterns.IsMockEndpointsTest
Tests run: 1, Failures: 0, Errors: 1, Skipped: 0, Time elapsed: 0.027 sec <<< FAILURE!
Running org.apache.camel.test.patterns.FilterTest
Tests run: 2, Failures: 0, Errors: 2, Skipped: 0, Time elapsed: 0.075 sec <<< FAILURE!

Results :

Tests in error: 
  testMockFileEndpoints(org.apache.camel.test.patterns.IsMockEndpointsFileTest)
  testDebugger(org.apache.camel.test.patterns.DebugJUnit4Test)
  testTwo(org.apache.camel.test.patterns.DebugJUnit4Test)
  testDebugger(org.apache.camel.test.patterns.DebugTest)
  testTwo(org.apache.camel.test.patterns.DebugTest)
  testSendMatchingMessage(org.apache.camel.test.patterns.FilterJUnit4Test)
  testSendNotMatchingMessage(org.apache.camel.test.patterns.FilterJUnit4Test)
  testSendMatchingMessage(org.apache.camel.test.patterns.FilterCreateCamelContextPerClassTest)
  testSendNotMatchingMessage(org.apache.camel.test.patterns.FilterCreateCamelContextPerClassTest)
  testMockAllEndpoints(org.apache.camel.test.patterns.IsMockEndpointsJUnit4Test)
  testDebugger(org.apache.camel.test.patterns.DebugNoLazyTypeConverterTest)
  testTwo(org.apache.camel.test.patterns.DebugNoLazyTypeConverterTest)
  testMockAllEndpoints(org.apache.camel.test.patterns.IsMockEndpointsTest)
  testSendMatchingMessage(org.apache.camel.test.patterns.FilterTest)
  testSendNotMatchingMessage(org.apache.camel.test.patterns.FilterTest)

Tests run: 20, Failures: 0, Errors: 15, Skipped: 0

[INFO] ------------------------------------------------------------------------
[ERROR] BUILD FAILURE
[INFO] ------------------------------------------------------------------------
[INFO] There are test failures.

Please refer to /srv/gump/public/workspace/camel/components/camel-test/target/surefire-reports
for the individual test results.
[INFO] ------------------------------------------------------------------------
[INFO] For more information, run Maven with the -e switch
[INFO] ------------------------------------------------------------------------
[INFO] Total time: 16 seconds
[INFO] Finished at: Sun Jun 19 22:36:17 UTC 2011
[INFO] Final Memory: 26M/62M
[INFO] ------------------------------------------------------------------------
---------------------------------------------

To subscribe to this information via syndicated feeds:
- RSS: http://vmgump.apache.org/gump/public/camel/camel-test/rss.xml
- Atom: http://vmgump.apache.org/gump/public/camel/camel-test/atom.xml

============================== Gump Tracking Only ===
Produced by Apache Gump(TM) version 2.3.
Gump Run 05001819062011, vmgump.apache.org:vmgump:05001819062011
Gump E-mail Identifier (unique within run) #2.


--
Apache Gump
http://gump.apache.org/ [Instance: vmgump]

---------------------------------------------------------------------
To unsubscribe, e-mail: general-unsubscribe@gump.apache.org
For additional commands, e-mail: general-help@gump.apache.org


Mime
View raw message