gump-general mailing list archives

Site index · List index
Message view « Date » · « Thread »
Top « Date » · « Thread »
From g...@vmgump.apache.org
Subject BATCH: All dressed up, with nowhere to go...
Date Fri, 29 Apr 2011 21:26:31 GMT
Dear Gumpmeisters,
            
The following 5 notifys should have been sent

*********************************************************** G U M P
[GUMP@vmgump]: Project camel-core-osgi (in module camel) failed
[GUMP@vmgump]: Project apache-james-mailbox-store (in module james-mailbox) failed
[GUMP@vmgump]: Project camel-spring (in module camel) failed
[GUMP@vmgump]: Project commons-jelly-tags-ant-test (in module commons-jelly) failed
[GUMP@vmgump]: Project cocoon-optional-test (in module cocoon3) failed
*********************************************************** G U M P
[GUMP@vmgump]: Project camel-core-osgi (in module camel) failed
To whom it may engage...
        
This is an automated request, but not an unsolicited one. For 
more information please visit http://gump.apache.org/nagged.html, 
and/or contact the folk at general@gump.apache.org.

Project camel-core-osgi has an issue affecting its community integration.
This issue affects 1 projects.
The current state of this project is 'Failed', with reason 'Build Failed'.
For reference only, the following projects are affected by this:
    - camel-core-osgi :  Camel :: Core OSGI


Full details are available at:
    http://vmgump.apache.org/gump/public/camel/camel-core-osgi/index.html

That said, some information snippets are provided here.

The following annotations (debug/informational/warning/error messages) were provided:
 -DEBUG- Sole jar output [camel-core-osgi-*[0-9T].jar] identifier set to project name
 -DEBUG- (Apache Gump generated) Apache Maven Settings in: /srv/gump/public/workspace/camel/components/camel-core-osgi/gump_mvn_settings.xml
 -INFO- Failed with reason build failed
 -DEBUG- Maven POM in: /srv/gump/public/workspace/camel/components/camel-core-osgi/pom.xml
 -INFO- Failed to extract fallback artifacts from Gump Repository



The following work was performed:
http://vmgump.apache.org/gump/public/camel/camel-core-osgi/gump_work/build_camel_camel-core-osgi.html
Work Name: build_camel_camel-core-osgi (Type: Build)
Work ended in a state of : Failed
Elapsed: 19 secs
Command Line: /opt/maven2/bin/mvn --batch-mode --settings /srv/gump/public/workspace/camel/components/camel-core-osgi/gump_mvn_settings.xml
install 
[Working Directory: /srv/gump/public/workspace/camel/components/camel-core-osgi]
M2_HOME: /opt/maven2
---------------------------------------------
[INFO] Copying 3 resources
[INFO] [compiler:compile {execution: default-compile}]
[INFO] Compiling 16 source files to /srv/gump/public/workspace/camel/components/camel-core-osgi/target/classes
[INFO] [resources:testResources {execution: default-testResources}]
[INFO] Using 'UTF-8' encoding to copy filtered resources.
[INFO] Copying 10 resources
[INFO] Copying 3 resources
[INFO] [compiler:testCompile {execution: default-testCompile}]
[INFO] Compiling 16 source files to /srv/gump/public/workspace/camel/components/camel-core-osgi/target/test-classes
[INFO] [surefire:test {execution: default-test}]
[INFO] Surefire report directory: /srv/gump/public/workspace/camel/components/camel-core-osgi/target/surefire-reports

-------------------------------------------------------
 T E S T S
-------------------------------------------------------
Running org.apache.camel.core.osgi.OsgiClassResolverTest
SLF4J: The requested version 1.5.9 by your slf4j binding is not compatible with [1.6]
SLF4J: See http://www.slf4j.org/codes.html#version_mismatch for further details.
Tests run: 2, Failures: 0, Errors: 0, Skipped: 0, Time elapsed: 0.188 sec
Running org.apache.camel.core.osgi.OsgiComponentResolverTest
Tests run: 1, Failures: 0, Errors: 1, Skipped: 0, Time elapsed: 0.211 sec <<< FAILURE!
Running org.apache.camel.core.osgi.OsgiFactoryFinderTest
Tests run: 1, Failures: 0, Errors: 0, Skipped: 0, Time elapsed: 0.02 sec
Running org.apache.camel.core.osgi.OsgiPackageScanClassResolverTest
Tests run: 4, Failures: 0, Errors: 0, Skipped: 0, Time elapsed: 0.027 sec
Running org.apache.camel.core.osgi.ServiceRegistryTest
Tests run: 1, Failures: 0, Errors: 0, Skipped: 0, Time elapsed: 1.11 sec
Running org.apache.camel.core.osgi.OsgiLanguageResolverTest
Tests run: 1, Failures: 0, Errors: 0, Skipped: 0, Time elapsed: 0.018 sec

Results :

Tests in error: 
  testOsgiResolverFindLanguageTest(org.apache.camel.core.osgi.OsgiComponentResolverTest)

Tests run: 10, Failures: 0, Errors: 1, Skipped: 0

[INFO] ------------------------------------------------------------------------
[ERROR] BUILD FAILURE
[INFO] ------------------------------------------------------------------------
[INFO] There are test failures.

Please refer to /srv/gump/public/workspace/camel/components/camel-core-osgi/target/surefire-reports
for the individual test results.
[INFO] ------------------------------------------------------------------------
[INFO] For more information, run Maven with the -e switch
[INFO] ------------------------------------------------------------------------
[INFO] Total time: 18 seconds
[INFO] Finished at: Fri Apr 29 17:25:26 UTC 2011
[INFO] Final Memory: 34M/81M
[INFO] ------------------------------------------------------------------------
---------------------------------------------

To subscribe to this information via syndicated feeds:
- RSS: http://vmgump.apache.org/gump/public/camel/camel-core-osgi/rss.xml
- Atom: http://vmgump.apache.org/gump/public/camel/camel-core-osgi/atom.xml

============================== Gump Tracking Only ===
Produced by Apache Gump(TM) version 2.3.
Gump Run 05001229042011, vmgump.apache.org:vmgump:05001229042011
Gump E-mail Identifier (unique within run) #2.

*********************************************************** G U M P
[GUMP@vmgump]: Project apache-james-mailbox-store (in module james-mailbox) failed
To whom it may engage...
        
This is an automated request, but not an unsolicited one. For 
more information please visit http://gump.apache.org/nagged.html, 
and/or contact the folk at general@gump.apache.org.

Project apache-james-mailbox-store has an issue affecting its community integration.
This issue affects 3 projects.
The current state of this project is 'Failed', with reason 'Build Failed'.
For reference only, the following projects are affected by this:
    - apache-james-mailbox-store :  A library providing a flexible Mailbox storage accessible
by...
    - james-mailbox :  A library providing a flexible Mailbox storage accessible by...
    - james-mailbox-test :  A library providing a flexible Mailbox storage accessible by...


Full details are available at:
    http://vmgump.apache.org/gump/public/james-mailbox/apache-james-mailbox-store/index.html

That said, some information snippets are provided here.

The following annotations (debug/informational/warning/error messages) were provided:
 -DEBUG- (Apache Gump generated) Apache Maven Settings in: /srv/gump/public/workspace/james-mailbox/store/gump_mvn_settings.xml
 -INFO- Failed with reason build failed
 -DEBUG- Maven POM in: /srv/gump/public/workspace/james-mailbox/store/pom.xml
 -INFO- Failed to extract fallback artifacts from Gump Repository



The following work was performed:
http://vmgump.apache.org/gump/public/james-mailbox/apache-james-mailbox-store/gump_work/build_james-mailbox_apache-james-mailbox-store.html
Work Name: build_james-mailbox_apache-james-mailbox-store (Type: Build)
Work ended in a state of : Failed
Elapsed: 28 secs
Command Line: /opt/maven3/bin/mvn --batch-mode --settings /srv/gump/public/workspace/james-mailbox/store/gump_mvn_settings.xml
install 
[Working Directory: /srv/gump/public/workspace/james-mailbox/store]
M2_HOME: /opt/maven3
---------------------------------------------
[ERROR] /srv/gump/public/workspace/james-mailbox/store/src/main/java/org/apache/james/mailbox/store/lucene/LuceneMessageSearchIndex.java:[189,47]
cannot find symbol
symbol  : method getReader()
location: class org.apache.lucene.index.IndexWriter
[ERROR] /srv/gump/public/workspace/james-mailbox/store/src/main/java/org/apache/james/mailbox/store/lucene/LuceneMessageSearchIndex.java:[576,61]
cannot find symbol
symbol  : method getReader()
location: class org.apache.lucene.index.IndexWriter
[ERROR] /srv/gump/public/workspace/james-mailbox/store/src/main/java/org/apache/james/mailbox/store/lucene/LuceneMessageSearchIndex.java:[153,11]
recursive constructor invocation
[INFO] 10 errors 
[INFO] -------------------------------------------------------------
[INFO] ------------------------------------------------------------------------
[INFO] BUILD FAILURE
[INFO] ------------------------------------------------------------------------
[INFO] Total time: 26.400s
[INFO] Finished at: Fri Apr 29 17:45:02 UTC 2011
[INFO] Final Memory: 13M/37M
[INFO] ------------------------------------------------------------------------
[ERROR] Failed to execute goal org.apache.maven.plugins:maven-compiler-plugin:2.3.2:compile
(default-compile) on project apache-james-mailbox-store: Compilation failure: Compilation
failure:
[ERROR] /srv/gump/public/workspace/james-mailbox/store/src/main/java/org/apache/james/mailbox/store/lucene/ImapSearchAnalyzer.java:[25,33]
cannot find symbol
[ERROR] symbol  : class WhitespaceTokenizer
[ERROR] location: package org.apache.lucene.analysis
[ERROR] /srv/gump/public/workspace/james-mailbox/store/src/main/java/org/apache/james/mailbox/store/lucene/LuceneMessageSearchIndex.java:[59,33]
cannot find symbol
[ERROR] symbol  : class PerFieldAnalyzerWrapper
[ERROR] location: package org.apache.lucene.analysis
[ERROR] /srv/gump/public/workspace/james-mailbox/store/src/main/java/org/apache/james/mailbox/store/lucene/ImapSearchAnalyzer.java:[46,39]
cannot find symbol
[ERROR] symbol  : class WhitespaceTokenizer
[ERROR] location: class org.apache.james.mailbox.store.lucene.ImapSearchAnalyzer
[ERROR] /srv/gump/public/workspace/james-mailbox/store/src/main/java/org/apache/james/mailbox/store/lucene/LuceneMessageSearchIndex.java:[154,75]
cannot find symbol
[ERROR] symbol  : variable MaxFieldLength
[ERROR] location: class org.apache.lucene.index.IndexWriter
[ERROR] /srv/gump/public/workspace/james-mailbox/store/src/main/java/org/apache/james/mailbox/store/lucene/LuceneMessageSearchIndex.java:[154,13]
internal error; cannot instantiate org.apache.lucene.index.IndexWriter.<init> at org.apache.lucene.index.IndexWriter
to ()
[ERROR] /srv/gump/public/workspace/james-mailbox/store/src/main/java/org/apache/james/mailbox/store/lucene/LuceneMessageSearchIndex.java:[176,8]
cannot find symbol
[ERROR] symbol  : class PerFieldAnalyzerWrapper
[ERROR] location: class org.apache.james.mailbox.store.lucene.LuceneMessageSearchIndex<Id>
[ERROR] /srv/gump/public/workspace/james-mailbox/store/src/main/java/org/apache/james/mailbox/store/lucene/LuceneMessageSearchIndex.java:[176,46]
cannot find symbol
[ERROR] symbol  : class PerFieldAnalyzerWrapper
[ERROR] location: class org.apache.james.mailbox.store.lucene.LuceneMessageSearchIndex<Id>
[ERROR] /srv/gump/public/workspace/james-mailbox/store/src/main/java/org/apache/james/mailbox/store/lucene/LuceneMessageSearchIndex.java:[189,47]
cannot find symbol
[ERROR] symbol  : method getReader()
[ERROR] location: class org.apache.lucene.index.IndexWriter
[ERROR] /srv/gump/public/workspace/james-mailbox/store/src/main/java/org/apache/james/mailbox/store/lucene/LuceneMessageSearchIndex.java:[576,61]
cannot find symbol
[ERROR] symbol  : method getReader()
[ERROR] location: class org.apache.lucene.index.IndexWriter
[ERROR] /srv/gump/public/workspace/james-mailbox/store/src/main/java/org/apache/james/mailbox/store/lucene/LuceneMessageSearchIndex.java:[153,11]
recursive constructor invocation
[ERROR] -> [Help 1]
[ERROR] 
[ERROR] To see the full stack trace of the errors, re-run Maven with the -e switch.
[ERROR] Re-run Maven using the -X switch to enable full debug logging.
[ERROR] 
[ERROR] For more information about the errors and possible solutions, please read the following
articles:
[ERROR] [Help 1] http://cwiki.apache.org/confluence/display/MAVEN/MojoFailureException
---------------------------------------------

To subscribe to this information via syndicated feeds:
- RSS: http://vmgump.apache.org/gump/public/james-mailbox/apache-james-mailbox-store/rss.xml
- Atom: http://vmgump.apache.org/gump/public/james-mailbox/apache-james-mailbox-store/atom.xml

============================== Gump Tracking Only ===
Produced by Apache Gump(TM) version 2.3.
Gump Run 05001229042011, vmgump.apache.org:vmgump:05001229042011
Gump E-mail Identifier (unique within run) #3.

*********************************************************** G U M P
[GUMP@vmgump]: Project camel-spring (in module camel) failed
To whom it may engage...
        
This is an automated request, but not an unsolicited one. For 
more information please visit http://gump.apache.org/nagged.html, 
and/or contact the folk at general@gump.apache.org.

Project camel-spring has an issue affecting its community integration.
This issue affects 5 projects.
The current state of this project is 'Failed', with reason 'Build Failed'.
For reference only, the following projects are affected by this:
    - camel-jms :  Camel :: JMS
    - camel-jms-test :  Integration framework based on known Enterprise Integration
...
    - camel-spring :  Camel :: Spring
    - camel-spring-test :  Integration framework based on known Enterprise Integration
...
    - camel-test :  Camel :: Test


Full details are available at:
    http://vmgump.apache.org/gump/public/camel/camel-spring/index.html

That said, some information snippets are provided here.

The following annotations (debug/informational/warning/error messages) were provided:
 -DEBUG- Sole jar output [camel-spring-*[0-9T].jar] identifier set to project name
 -DEBUG- Sole testsjar output [camel-spring-*[0-9T]-tests.jar] identifier set to project name
 -INFO- Optional dependency camel-core-osgi failed with reason build failed
 -DEBUG- (Apache Gump generated) Apache Maven Settings in: /srv/gump/public/workspace/camel/components/camel-spring/gump_mvn_settings.xml
 -INFO- Failed with reason build failed
 -DEBUG- Maven POM in: /srv/gump/public/workspace/camel/components/camel-spring/pom.xml
 -INFO- Failed to extract fallback artifacts from Gump Repository



The following work was performed:
http://vmgump.apache.org/gump/public/camel/camel-spring/gump_work/build_camel_camel-spring.html
Work Name: build_camel_camel-spring (Type: Build)
Work ended in a state of : Failed
Elapsed: 17 secs
Command Line: /opt/maven2/bin/mvn --batch-mode -DskipTests=true --settings /srv/gump/public/workspace/camel/components/camel-spring/gump_mvn_settings.xml
install 
[Working Directory: /srv/gump/public/workspace/camel/components/camel-spring]
M2_HOME: /opt/maven2
---------------------------------------------
690K downloaded  (hsqldb-1.8.0.7.jar)



Downloading: http://localhost:8192/maven2/org/springframework/spring-test/3.0.5.RELEASE/spring-test-3.0.5.RELEASE.jar
Downloading: http://localhost:8192/maven2/org/aspectj/aspectjweaver/1.6.2/aspectjweaver-1.6.2.jar

Downloading: http://localhost:8192/maven2/org/springframework/spring-jdbc/3.0.5.RELEASE/spring-jdbc-3.0.5.RELEASE.jar


[INFO] ------------------------------------------------------------------------
[ERROR] BUILD ERROR
[INFO] ------------------------------------------------------------------------
[INFO] Failed to resolve artifact.

Missing:
----------
1) org.apache.camel:camel-core-osgi:jar:2.8-SNAPSHOT

  Try downloading the file manually from the project website.

  Then, install it using the command: 
      mvn install:install-file -DgroupId=org.apache.camel -DartifactId=camel-core-osgi -Dversion=2.8-SNAPSHOT
-Dpackaging=jar -Dfile=/path/to/file

  Alternatively, if you host your own repository you can deploy the file there: 
      mvn deploy:deploy-file -DgroupId=org.apache.camel -DartifactId=camel-core-osgi -Dversion=2.8-SNAPSHOT
-Dpackaging=jar -Dfile=/path/to/file -Durl=[url] -DrepositoryId=[id]

  Path to dependency: 
  	1) org.apache.camel:camel-spring:bundle:2.8-SNAPSHOT
  	2) org.apache.camel:camel-core-osgi:jar:2.8-SNAPSHOT

----------
1 required artifact is missing.

for artifact: 
  org.apache.camel:camel-spring:bundle:2.8-SNAPSHOT

from the specified remote repositories:
  gump-central (http://localhost:8192/maven2),
  gump-apache.snapshots (http://localhost:8192/repo/m2-snapshot-repository)



[INFO] ------------------------------------------------------------------------
[INFO] For more information, run Maven with the -e switch
[INFO] ------------------------------------------------------------------------
[INFO] Total time: 16 seconds
[INFO] Finished at: Fri Apr 29 17:46:43 UTC 2011
[INFO] Final Memory: 16M/39M
[INFO] ------------------------------------------------------------------------
---------------------------------------------

To subscribe to this information via syndicated feeds:
- RSS: http://vmgump.apache.org/gump/public/camel/camel-spring/rss.xml
- Atom: http://vmgump.apache.org/gump/public/camel/camel-spring/atom.xml

============================== Gump Tracking Only ===
Produced by Apache Gump(TM) version 2.3.
Gump Run 05001229042011, vmgump.apache.org:vmgump:05001229042011
Gump E-mail Identifier (unique within run) #4.

*********************************************************** G U M P
[GUMP@vmgump]: Project commons-jelly-tags-ant-test (in module commons-jelly) failed
To whom it may engage...
        
This is an automated request, but not an unsolicited one. For 
more information please visit http://gump.apache.org/nagged.html, 
and/or contact the folk at general@gump.apache.org.

Project commons-jelly-tags-ant-test has an issue affecting its community integration.
This issue affects 1 projects.
The current state of this project is 'Failed', with reason 'Build Failed'.
For reference only, the following projects are affected by this:
    - commons-jelly-tags-ant-test :  Commons Jelly


Full details are available at:
    http://vmgump.apache.org/gump/public/commons-jelly/commons-jelly-tags-ant-test/index.html

That said, some information snippets are provided here.

The following annotations (debug/informational/warning/error messages) were provided:
 -DEBUG- Dependency on ant exists, no need to add for property maven.jar.ant-optional.
 -DEBUG- Dependency on xml-xerces exists, no need to add for property maven.jar.xerces.
 -DEBUG- Dependency on commons-jexl-1.x exists, no need to add for property maven.jar.commons-jexl.
 -WARNING- Overriding Maven properties: [/srv/gump/public/workspace/commons-jelly/jelly-tags/ant/build.properties]
 -DEBUG- (Apache Gump generated) Apache Maven Properties in: /srv/gump/public/workspace/commons-jelly/jelly-tags/ant/build.properties
 -INFO- Failed with reason build failed
 -DEBUG- Maven POM in: /srv/gump/public/workspace/commons-jelly/jelly-tags/ant/project.xml
 -DEBUG- Maven project properties in: /srv/gump/public/workspace/commons-jelly/jelly-tags/ant/project.properties
 -INFO- Project Reports in: /srv/gump/public/workspace/commons-jelly/jelly-tags/ant/target/test-reports



The following work was performed:
http://vmgump.apache.org/gump/public/commons-jelly/commons-jelly-tags-ant-test/gump_work/build_commons-jelly_commons-jelly-tags-ant-test.html
Work Name: build_commons-jelly_commons-jelly-tags-ant-test (Type: Build)
Work ended in a state of : Failed
Elapsed: 9 secs
Command Line: maven --offline jar 
[Working Directory: /srv/gump/public/workspace/commons-jelly/jelly-tags/ant]
---------------------------------------------
    [junit] Actual expression: (${foo4.1})=(null)
    [junit] 	at org.apache.commons.jelly.tags.junit.AssertTagSupport.fail(AssertTagSupport.java:44)
    [junit] 	at org.apache.commons.jelly.tags.junit.AssertTagSupport.failNotEquals(AssertTagSupport.java:77)
    [junit] 	at org.apache.commons.jelly.tags.junit.AssertEqualsTag.doTag(AssertEqualsTag.java:56)
    [junit] 	at org.apache.commons.jelly.impl.TagScript.run(TagScript.java:267)
    [junit] 	at org.apache.commons.jelly.impl.ScriptBlock.run(ScriptBlock.java:96)
    [junit] 	at org.apache.commons.jelly.tags.junit.CaseTag$1.runTest(CaseTag.java:60)
    [junit] 
    [junit] 
    [junit] Testcase: startUpReadWrite(org.apache.commons.jelly.tags.junit.CaseTag$1):	Caused
an ERROR
    [junit] file:/srv/gump/public/workspace/commons-jelly/jelly-tags/ant/target/test-classes/org/apache/commons/jelly/ant/suite.jelly:98:5:
<test:assertEquals> file:/srv/gump/public/workspace/commons-jelly/jelly-tags/ant/target/test-classes/org/apache/commons/jelly/ant/suite.jelly:98:5:
<test:assertEquals>  expected:[bar5] but was:[null]
    [junit] Expected expression: (bar5)=(bar5)
    [junit] Actual expression: (${foo5.1})=(null)
    [junit] org.apache.commons.jelly.JellyTagException: file:/srv/gump/public/workspace/commons-jelly/jelly-tags/ant/target/test-classes/org/apache/commons/jelly/ant/suite.jelly:98:5:
<test:assertEquals> file:/srv/gump/public/workspace/commons-jelly/jelly-tags/ant/target/test-classes/org/apache/commons/jelly/ant/suite.jelly:98:5:
<test:assertEquals>  expected:[bar5] but was:[null]
    [junit] Expected expression: (bar5)=(bar5)
    [junit] Actual expression: (${foo5.1})=(null)
    [junit] 	at org.apache.commons.jelly.impl.TagScript.handleException(TagScript.java:732)
    [junit] 	at org.apache.commons.jelly.impl.TagScript.run(TagScript.java:287)
    [junit] 	at org.apache.commons.jelly.impl.ScriptBlock.run(ScriptBlock.java:96)
    [junit] 	at org.apache.commons.jelly.tags.junit.CaseTag$1.runTest(CaseTag.java:60)
    [junit] Caused by: org.apache.commons.jelly.tags.junit.JellyAssertionFailedError: file:/srv/gump/public/workspace/commons-jelly/jelly-tags/ant/target/test-classes/org/apache/commons/jelly/ant/suite.jelly:98:5:
<test:assertEquals>  expected:[bar5] but was:[null]
    [junit] Expected expression: (bar5)=(bar5)
    [junit] Actual expression: (${foo5.1})=(null)
    [junit] 	at org.apache.commons.jelly.tags.junit.AssertTagSupport.fail(AssertTagSupport.java:44)
    [junit] 	at org.apache.commons.jelly.tags.junit.AssertTagSupport.failNotEquals(AssertTagSupport.java:77)
    [junit] 	at org.apache.commons.jelly.tags.junit.AssertEqualsTag.doTag(AssertEqualsTag.java:56)
    [junit] 	at org.apache.commons.jelly.impl.TagScript.run(TagScript.java:267)
    [junit] Root cause
    [junit] org.apache.commons.jelly.tags.junit.JellyAssertionFailedError: file:/srv/gump/public/workspace/commons-jelly/jelly-tags/ant/target/test-classes/org/apache/commons/jelly/ant/suite.jelly:98:5:
<test:assertEquals>  expected:[bar5] but was:[null]
    [junit] Expected expression: (bar5)=(bar5)
    [junit] Actual expression: (${foo5.1})=(null)
    [junit] 	at org.apache.commons.jelly.tags.junit.AssertTagSupport.fail(AssertTagSupport.java:44)
    [junit] 	at org.apache.commons.jelly.tags.junit.AssertTagSupport.failNotEquals(AssertTagSupport.java:77)
    [junit] 	at org.apache.commons.jelly.tags.junit.AssertEqualsTag.doTag(AssertEqualsTag.java:56)
    [junit] 	at org.apache.commons.jelly.impl.TagScript.run(TagScript.java:267)
    [junit] 	at org.apache.commons.jelly.impl.ScriptBlock.run(ScriptBlock.java:96)
    [junit] 	at org.apache.commons.jelly.tags.junit.CaseTag$1.runTest(CaseTag.java:60)
    [junit] 
    [junit] 
    [junit] [ERROR] TEST org.apache.commons.jelly.ant.TestJelly FAILED

BUILD FAILED
File...... /home/gump/.maven/cache/maven-test-plugin-1.6.2/plugin.jelly
Element... fail
Line...... 181
Column.... 54
There were test failures.
Total time: 9 seconds
Finished at: Fri Apr 29 18:44:01 UTC 2011

---------------------------------------------

To subscribe to this information via syndicated feeds:
- RSS: http://vmgump.apache.org/gump/public/commons-jelly/commons-jelly-tags-ant-test/rss.xml
- Atom: http://vmgump.apache.org/gump/public/commons-jelly/commons-jelly-tags-ant-test/atom.xml

============================== Gump Tracking Only ===
Produced by Apache Gump(TM) version 2.3.
Gump Run 05001229042011, vmgump.apache.org:vmgump:05001229042011
Gump E-mail Identifier (unique within run) #5.

*********************************************************** G U M P
[GUMP@vmgump]: Project cocoon-optional-test (in module cocoon3) failed
To whom it may engage...
        
This is an automated request, but not an unsolicited one. For 
more information please visit http://gump.apache.org/nagged.html, 
and/or contact the folk at general@gump.apache.org.

Project cocoon-optional-test has an issue affecting its community integration.
This issue affects 1 projects.
The current state of this project is 'Failed', with reason 'Build Failed'.
For reference only, the following projects are affected by this:
    - cocoon-optional-test :  Java XML Framework


Full details are available at:
    http://vmgump.apache.org/gump/public/cocoon3/cocoon-optional-test/index.html

That said, some information snippets are provided here.

The following annotations (debug/informational/warning/error messages) were provided:
 -WARNING- Overriding Maven settings: [/srv/gump/public/workspace/cocoon3/cocoon-optional/gump_mvn_settings.xml]
 -DEBUG- (Apache Gump generated) Apache Maven Settings in: /srv/gump/public/workspace/cocoon3/cocoon-optional/gump_mvn_settings.xml
 -INFO- Failed with reason build failed
 -DEBUG- Maven POM in: /srv/gump/public/workspace/cocoon3/cocoon-optional/pom.xml
 -INFO- Project Reports in: /srv/gump/public/workspace/cocoon3/cocoon-optional/target/surefire-reports



The following work was performed:
http://vmgump.apache.org/gump/public/cocoon3/cocoon-optional-test/gump_work/build_cocoon3_cocoon-optional-test.html
Work Name: build_cocoon3_cocoon-optional-test (Type: Build)
Work ended in a state of : Failed
Elapsed: 17 secs
Command Line: /opt/maven2/bin/mvn --batch-mode --settings /srv/gump/public/workspace/cocoon3/cocoon-optional/gump_mvn_settings.xml
test 
[Working Directory: /srv/gump/public/workspace/cocoon3/cocoon-optional]
M2_HOME: /opt/maven2
---------------------------------------------
[INFO] [remote-resources:process {execution: default}]
[INFO] [resources:resources {execution: default-resources}]
[INFO] Using 'UTF-8' encoding to copy filtered resources.
[INFO] Copying 2 resources
[INFO] Copying 3 resources
[INFO] [compiler:compile {execution: default-compile}]
[INFO] Nothing to compile - all classes are up to date
[INFO] [resources:testResources {execution: default-testResources}]
[INFO] Using 'UTF-8' encoding to copy filtered resources.
[INFO] Copying 4 resources
[INFO] Copying 3 resources
[INFO] [compiler:testCompile {execution: default-testCompile}]
[INFO] Nothing to compile - all classes are up to date
[INFO] [surefire:test {execution: default-test}]
[INFO] Surefire report directory: /srv/gump/public/workspace/cocoon3/cocoon-optional/target/surefire-reports

-------------------------------------------------------
 T E S T S
-------------------------------------------------------
Running org.apache.cocoon.optional.pipeline.components.sax.jaxb.JAXBGeneratorTestCase
Tests run: 6, Failures: 0, Errors: 0, Skipped: 0, Time elapsed: 1.334 sec
Running org.apache.cocoon.optional.pipeline.components.sax.betwixt.BetwixtBeanGeneratorTest
Tests run: 2, Failures: 0, Errors: 0, Skipped: 0, Time elapsed: 0.265 sec
Running org.apache.cocoon.optional.pipeline.components.sax.fop.FopSerializerTestCase
Tests run: 1, Failures: 0, Errors: 0, Skipped: 0, Time elapsed: 1.615 sec
Running org.apache.cocoon.optional.pipeline.components.sax.solr.SolrConsumerTestCase
Tests run: 1, Failures: 0, Errors: 1, Skipped: 0, Time elapsed: 0.5 sec <<< FAILURE!
Running org.apache.cocoon.optional.pipeline.components.sax.neko.NekoGeneratorTestCase
Tests run: 1, Failures: 0, Errors: 0, Skipped: 0, Time elapsed: 0.079 sec

Results :

Tests in error: 
  testPipelineWithSolrConsumer(org.apache.cocoon.optional.pipeline.components.sax.solr.SolrConsumerTestCase)

Tests run: 11, Failures: 0, Errors: 1, Skipped: 0

[INFO] ------------------------------------------------------------------------
[ERROR] BUILD FAILURE
[INFO] ------------------------------------------------------------------------
[INFO] There are test failures.

Please refer to /srv/gump/public/workspace/cocoon3/cocoon-optional/target/surefire-reports
for the individual test results.
[INFO] ------------------------------------------------------------------------
[INFO] For more information, run Maven with the -e switch
[INFO] ------------------------------------------------------------------------
[INFO] Total time: 15 seconds
[INFO] Finished at: Fri Apr 29 20:42:40 UTC 2011
[INFO] Final Memory: 30M/73M
[INFO] ------------------------------------------------------------------------
---------------------------------------------

To subscribe to this information via syndicated feeds:
- RSS: http://vmgump.apache.org/gump/public/cocoon3/cocoon-optional-test/rss.xml
- Atom: http://vmgump.apache.org/gump/public/cocoon3/cocoon-optional-test/atom.xml

============================== Gump Tracking Only ===
Produced by Apache Gump(TM) version 2.3.
Gump Run 05001229042011, vmgump.apache.org:vmgump:05001229042011
Gump E-mail Identifier (unique within run) #6.


--
Apache Gump
http://gump.apache.org/ [Instance: vmgump]

---------------------------------------------------------------------
To unsubscribe, e-mail: general-unsubscribe@gump.apache.org
For additional commands, e-mail: general-help@gump.apache.org


Mime
View raw message