gump-general mailing list archives

Site index · List index
Message view « Date » · « Thread »
Top « Date » · « Thread »
From g...@vmgump.apache.org
Subject BATCH: All dressed up, with nowhere to go...
Date Wed, 20 Apr 2011 21:13:35 GMT
Dear Gumpmeisters,
            
The following 3 notifys should have been sent

*********************************************************** G U M P
[GUMP@vmgump]: Project apacheds-core-api-test (in module apacheds) failed
[GUMP@vmgump]: Project apacheds-xdbm-partition-test (in module apacheds) failed
[GUMP@vmgump]: Project apacheds-core (in module apacheds) failed
*********************************************************** G U M P
[GUMP@vmgump]: Project apacheds-core-api-test (in module apacheds) failed
To whom it may engage...
        
This is an automated request, but not an unsolicited one. For 
more information please visit http://gump.apache.org/nagged.html, 
and/or contact the folk at general@gump.apache.org.

Project apacheds-core-api-test has an issue affecting its community integration.
This issue affects 1 projects.
The current state of this project is 'Failed', with reason 'Build Failed'.
For reference only, the following projects are affected by this:
    - apacheds-core-api-test :  Apache Directory Server


Full details are available at:
    http://vmgump.apache.org/gump/public/apacheds/apacheds-core-api-test/index.html

That said, some information snippets are provided here.

The following annotations (debug/informational/warning/error messages) were provided:
 -WARNING- Overriding Maven settings: [/srv/gump/public/workspace/apacheds/core-api/gump_mvn_settings.xml]
 -DEBUG- (Apache Gump generated) Apache Maven Settings in: /srv/gump/public/workspace/apacheds/core-api/gump_mvn_settings.xml
 -INFO- Failed with reason build failed
 -DEBUG- Maven POM in: /srv/gump/public/workspace/apacheds/core-api/pom.xml



The following work was performed:
http://vmgump.apache.org/gump/public/apacheds/apacheds-core-api-test/gump_work/build_apacheds_apacheds-core-api-test.html
Work Name: build_apacheds_apacheds-core-api-test (Type: Build)
Work ended in a state of : Failed
Elapsed: 10 secs
Command Line: /opt/maven3/bin/mvn --batch-mode --settings /srv/gump/public/workspace/apacheds/core-api/gump_mvn_settings.xml
package 
[Working Directory: /srv/gump/public/workspace/apacheds/core-api]
M2_HOME: /opt/maven3
---------------------------------------------
[debug] execute contextualize
[INFO] Using 'UTF-8' encoding to copy filtered resources.
[INFO] Copying 1 resource
[INFO] Copying 3 resources
[INFO] 
[INFO] --- maven-compiler-plugin:2.3.2:testCompile (default-testCompile) @ apacheds-core-api
---
[INFO] Nothing to compile - all classes are up to date
[INFO] 
[INFO] --- maven-surefire-plugin:2.7.2:test (default-test) @ apacheds-core-api ---
[INFO] Surefire report directory: /srv/gump/public/workspace/apacheds/core-api/target/surefire-reports

-------------------------------------------------------
 T E S T S
-------------------------------------------------------
Running org.apache.directory.server.core.changelog.TagTest
Tests run: 8, Failures: 0, Errors: 0, Skipped: 0, Time elapsed: 0.072 sec
Running org.apache.directory.server.core.entry.SchemaAwareModificationTest
SLF4J: The requested version 1.5.9 by your slf4j binding is not compatible with [1.6]
SLF4J: See http://www.slf4j.org/codes.html#version_mismatch for further details.
Tests run: 1, Failures: 0, Errors: 1, Skipped: 0, Time elapsed: 1.201 sec <<< FAILURE!
Running org.apache.directory.server.core.entry.ClonedServerEntryTest
Tests run: 8, Failures: 0, Errors: 0, Skipped: 0, Time elapsed: 0.032 sec
Running org.apache.directory.server.core.entry.SchemaAwareEntryTest
Tests run: 1, Failures: 0, Errors: 1, Skipped: 0, Time elapsed: 0.673 sec <<< FAILURE!

Results :

Tests in error: 
  org.apache.directory.server.core.entry.SchemaAwareModificationTest: org.apache.directory.shared.ldap.aci.ACIItemSyntaxChecker
  org.apache.directory.server.core.entry.SchemaAwareEntryTest: org.apache.directory.shared.ldap.aci.ACIItemSyntaxChecker

Tests run: 18, Failures: 0, Errors: 2, Skipped: 0

[INFO] ------------------------------------------------------------------------
[INFO] BUILD FAILURE
[INFO] ------------------------------------------------------------------------
[INFO] Total time: 9.128s
[INFO] Finished at: Wed Apr 20 20:47:55 UTC 2011
[INFO] Final Memory: 8M/21M
[INFO] ------------------------------------------------------------------------
[ERROR] Failed to execute goal org.apache.maven.plugins:maven-surefire-plugin:2.7.2:test (default-test)
on project apacheds-core-api: There are test failures.
[ERROR] 
[ERROR] Please refer to /srv/gump/public/workspace/apacheds/core-api/target/surefire-reports
for the individual test results.
[ERROR] -> [Help 1]
[ERROR] 
[ERROR] To see the full stack trace of the errors, re-run Maven with the -e switch.
[ERROR] Re-run Maven using the -X switch to enable full debug logging.
[ERROR] 
[ERROR] For more information about the errors and possible solutions, please read the following
articles:
[ERROR] [Help 1] http://cwiki.apache.org/confluence/display/MAVEN/MojoFailureException
---------------------------------------------

To subscribe to this information via syndicated feeds:
- RSS: http://vmgump.apache.org/gump/public/apacheds/apacheds-core-api-test/rss.xml
- Atom: http://vmgump.apache.org/gump/public/apacheds/apacheds-core-api-test/atom.xml

============================== Gump Tracking Only ===
Produced by Apache Gump(TM) version 2.3.
Gump Run 08001220042011, vmgump.apache.org:vmgump:08001220042011
Gump E-mail Identifier (unique within run) #1.

*********************************************************** G U M P
[GUMP@vmgump]: Project apacheds-xdbm-partition-test (in module apacheds) failed
To whom it may engage...
        
This is an automated request, but not an unsolicited one. For 
more information please visit http://gump.apache.org/nagged.html, 
and/or contact the folk at general@gump.apache.org.

Project apacheds-xdbm-partition-test has an issue affecting its community integration.
This issue affects 1 projects.
The current state of this project is 'Failed', with reason 'Build Failed'.
For reference only, the following projects are affected by this:
    - apacheds-xdbm-partition-test :  Apache Directory Server


Full details are available at:
    http://vmgump.apache.org/gump/public/apacheds/apacheds-xdbm-partition-test/index.html

That said, some information snippets are provided here.

The following annotations (debug/informational/warning/error messages) were provided:
 -WARNING- Overriding Maven settings: [/srv/gump/public/workspace/apacheds/xdbm-partition/gump_mvn_settings.xml]
 -DEBUG- (Apache Gump generated) Apache Maven Settings in: /srv/gump/public/workspace/apacheds/xdbm-partition/gump_mvn_settings.xml
 -INFO- Failed with reason build failed
 -DEBUG- Maven POM in: /srv/gump/public/workspace/apacheds/xdbm-partition/pom.xml
 -INFO- Project Reports in: /srv/gump/public/workspace/apacheds/xdbm-partition/target/surefire-reports



The following work was performed:
http://vmgump.apache.org/gump/public/apacheds/apacheds-xdbm-partition-test/gump_work/build_apacheds_apacheds-xdbm-partition-test.html
Work Name: build_apacheds_apacheds-xdbm-partition-test (Type: Build)
Work ended in a state of : Failed
Elapsed: 15 secs
Command Line: /opt/maven3/bin/mvn --batch-mode --settings /srv/gump/public/workspace/apacheds/xdbm-partition/gump_mvn_settings.xml
package 
[Working Directory: /srv/gump/public/workspace/apacheds/xdbm-partition]
M2_HOME: /opt/maven3
---------------------------------------------
Tests run: 9, Failures: 0, Errors: 0, Skipped: 0, Time elapsed: 0.012 sec
Running org.apache.directory.server.xdbm.AbstractStoreTest
Tests run: 1, Failures: 0, Errors: 1, Skipped: 0, Time elapsed: 0.283 sec <<< FAILURE!
Running org.apache.directory.server.xdbm.impl.avl.AvlStoreTest
Tests run: 1, Failures: 0, Errors: 1, Skipped: 0, Time elapsed: 0.193 sec <<< FAILURE!
Running org.apache.directory.server.xdbm.impl.avl.AvlRdnIndexTest
Tests run: 1, Failures: 0, Errors: 1, Skipped: 0, Time elapsed: 0.137 sec <<< FAILURE!
Running org.apache.directory.server.xdbm.impl.avl.AvlTableTest
Tests run: 5, Failures: 0, Errors: 0, Skipped: 0, Time elapsed: 0.034 sec
Running org.apache.directory.server.xdbm.GenericIndexTest
Tests run: 39, Failures: 0, Errors: 0, Skipped: 0, Time elapsed: 0.077 sec
Running org.apache.directory.server.xdbm.ReverseIndexEntryTest
Tests run: 7, Failures: 0, Errors: 0, Skipped: 0, Time elapsed: 0.004 sec

Results :

Tests in error: 
  org.apache.directory.server.xdbm.search.impl.PresenceTest: org.apache.directory.shared.ldap.aci.ACIItemSyntaxChecker
  org.apache.directory.server.xdbm.search.impl.SubstringTest: org.apache.directory.shared.ldap.aci.ACIItemSyntaxChecker
  org.apache.directory.server.xdbm.search.impl.NestedFilterTest: org.apache.directory.shared.ldap.aci.ACIItemSyntaxChecker
  org.apache.directory.server.xdbm.search.impl.GreaterEqTest: org.apache.directory.shared.ldap.aci.ACIItemSyntaxChecker
  org.apache.directory.server.xdbm.search.impl.OneLevelScopeTest: org.apache.directory.shared.ldap.aci.ACIItemSyntaxChecker
  org.apache.directory.server.xdbm.search.impl.LessEqTest: org.apache.directory.shared.ldap.aci.ACIItemSyntaxChecker
  org.apache.directory.server.xdbm.search.impl.NotCursorTest: org.apache.directory.shared.ldap.aci.ACIItemSyntaxChecker
  org.apache.directory.server.xdbm.search.impl.SubtreeScopeTest: org.apache.directory.shared.ldap.aci.ACIItemSyntaxChecker
  org.apache.directory.server.xdbm.search.impl.AndCursorTest: org.apache.directory.shared.ldap.aci.ACIItemSyntaxChecker
  org.apache.directory.server.xdbm.search.impl.OrCursorTest: org.apache.directory.shared.ldap.aci.ACIItemSyntaxChecker
  org.apache.directory.server.xdbm.AbstractStoreTest: org.apache.directory.shared.ldap.aci.ACIItemSyntaxChecker
  org.apache.directory.server.xdbm.impl.avl.AvlStoreTest: org.apache.directory.shared.ldap.aci.ACIItemSyntaxChecker
  org.apache.directory.server.xdbm.impl.avl.AvlRdnIndexTest: org.apache.directory.shared.ldap.aci.ACIItemSyntaxChecker

Tests run: 127, Failures: 0, Errors: 13, Skipped: 0

[INFO] ------------------------------------------------------------------------
[INFO] BUILD FAILURE
[INFO] ------------------------------------------------------------------------
[INFO] Total time: 13.204s
[INFO] Finished at: Wed Apr 20 20:48:10 UTC 2011
[INFO] Final Memory: 8M/21M
[INFO] ------------------------------------------------------------------------
[ERROR] Failed to execute goal org.apache.maven.plugins:maven-surefire-plugin:2.7.2:test (default-test)
on project apacheds-xdbm-partition: There are test failures.
[ERROR] 
[ERROR] Please refer to /srv/gump/public/workspace/apacheds/xdbm-partition/target/surefire-reports
for the individual test results.
[ERROR] -> [Help 1]
[ERROR] 
[ERROR] To see the full stack trace of the errors, re-run Maven with the -e switch.
[ERROR] Re-run Maven using the -X switch to enable full debug logging.
[ERROR] 
[ERROR] For more information about the errors and possible solutions, please read the following
articles:
[ERROR] [Help 1] http://cwiki.apache.org/confluence/display/MAVEN/MojoFailureException
---------------------------------------------

To subscribe to this information via syndicated feeds:
- RSS: http://vmgump.apache.org/gump/public/apacheds/apacheds-xdbm-partition-test/rss.xml
- Atom: http://vmgump.apache.org/gump/public/apacheds/apacheds-xdbm-partition-test/atom.xml

============================== Gump Tracking Only ===
Produced by Apache Gump(TM) version 2.3.
Gump Run 08001220042011, vmgump.apache.org:vmgump:08001220042011
Gump E-mail Identifier (unique within run) #2.

*********************************************************** G U M P
[GUMP@vmgump]: Project apacheds-core (in module apacheds) failed
To whom it may engage...
        
This is an automated request, but not an unsolicited one. For 
more information please visit http://gump.apache.org/nagged.html, 
and/or contact the folk at general@gump.apache.org.

Project apacheds-core has an issue affecting its community integration.
This issue affects 37 projects.
The current state of this project is 'Failed', with reason 'Build Failed'.
For reference only, the following projects are affected by this:
    - apacheds-all :  Apache Directory Server
    - apacheds-core :  Apache Directory Server
    - apacheds-core-annotations :  Apache Directory Server
    - apacheds-core-annotations-test :  Apache Directory Server
    - apacheds-core-integ :  Apache Directory Server
    - apacheds-core-integ-test :  Apache Directory Server
    - apacheds-core-jndi :  Apache Directory Server
    - apacheds-core-test :  Apache Directory Server
    - apacheds-http-directory-bridge :  Apache Directory Server
    - apacheds-http-integration :  Apache Directory Server
    - apacheds-interceptor-kerberos :  Apache Directory Server
    - apacheds-jdbm-partition :  Apache Directory Server
    - apacheds-jdbm-partition-test :  Apache Directory Server
    - apacheds-kerberos-codec :  Apache Directory Server
    - apacheds-kerberos-test :  Apache Directory Server
    - apacheds-ldap-client-test :  Apache Directory Server
    - apacheds-ldif-partition :  Apache Directory Server
    - apacheds-ldif-partition-test :  Apache Directory Server
    - apacheds-protocol-changepw :  Apache Directory Server
    - apacheds-protocol-dns :  Apache Directory Server
    - apacheds-protocol-kerberos :  Apache Directory Server
    - apacheds-protocol-kerberos-test :  Apache Directory Server
    - apacheds-protocol-ldap :  Apache Directory Server
    - apacheds-protocol-ntp :  Apache Directory Server
    - apacheds-protocol-ntp-test :  Apache Directory Server
    - apacheds-protocol-shared :  Apache Directory Server
    - apacheds-server-annotations :  Apache Directory Server
    - apacheds-server-config :  Apache Directory Server
    - apacheds-server-integ :  Apache Directory Server
    - apacheds-server-integ-test :  Apache Directory Server
    - apacheds-server-jndi :  Apache Directory Server
    - apacheds-server-tools :  Apache Directory Server
    - apacheds-service :  Apache Directory Server
    - apacheds-service-builder :  Apache Directory Server
    - apacheds-test-framework :  Apache Directory Server
    - apacheds-wrapper :  Apache Directory Server
    - syncrepl :  Apache Directory Server


Full details are available at:
    http://vmgump.apache.org/gump/public/apacheds/apacheds-core/index.html

That said, some information snippets are provided here.

The following annotations (debug/informational/warning/error messages) were provided:
 -DEBUG- Sole jar output [apacheds-core-*[0-9T].jar] identifier set to project name
 -DEBUG- (Apache Gump generated) Apache Maven Settings in: /srv/gump/public/workspace/apacheds/core/gump_mvn_settings.xml
 -INFO- Failed with reason build failed
 -DEBUG- Maven POM in: /srv/gump/public/workspace/apacheds/core/pom.xml
 -INFO- Failed to extract fallback artifacts from Gump Repository



The following work was performed:
http://vmgump.apache.org/gump/public/apacheds/apacheds-core/gump_work/build_apacheds_apacheds-core.html
Work Name: build_apacheds_apacheds-core (Type: Build)
Work ended in a state of : Failed
Elapsed: 17 secs
Command Line: /opt/maven3/bin/mvn --batch-mode -DskipTests=true --settings /srv/gump/public/workspace/apacheds/core/gump_mvn_settings.xml
install 
[Working Directory: /srv/gump/public/workspace/apacheds/core]
M2_HOME: /opt/maven3
---------------------------------------------
[ERROR] /srv/gump/public/workspace/apacheds/core/src/main/java/org/apache/directory/server/core/partition/DefaultPartitionNexus.java:[181,31]
cannot find symbol
symbol  : variable SyncInfoValue
location: class org.apache.directory.server.core.partition.DefaultPartitionNexus
[ERROR] /srv/gump/public/workspace/apacheds/core/src/main/java/org/apache/directory/server/core/partition/DefaultPartitionNexus.java:[181,50]
cannot find symbol
symbol  : variable SyncRequestValue
location: class org.apache.directory.server.core.partition.DefaultPartitionNexus
[ERROR] /srv/gump/public/workspace/apacheds/core/src/main/java/org/apache/directory/server/core/partition/DefaultPartitionNexus.java:[182,12]
cannot find symbol
symbol  : variable SyncStateValue
location: class org.apache.directory.server.core.partition.DefaultPartitionNexus
[INFO] 8 errors 
[INFO] -------------------------------------------------------------
[INFO] ------------------------------------------------------------------------
[INFO] BUILD FAILURE
[INFO] ------------------------------------------------------------------------
[INFO] Total time: 15.801s
[INFO] Finished at: Wed Apr 20 20:48:57 UTC 2011
[INFO] Final Memory: 14M/38M
[INFO] ------------------------------------------------------------------------
[ERROR] Failed to execute goal org.apache.maven.plugins:maven-compiler-plugin:2.3.2:compile
(default-compile) on project apacheds-core: Compilation failure: Compilation failure:
[ERROR] /srv/gump/public/workspace/apacheds/core/src/main/java/org/apache/directory/server/core/partition/DefaultPartitionNexus.java:[60,55]
cannot find symbol
[ERROR] symbol  : class SyncDoneValue
[ERROR] location: package org.apache.directory.shared.ldap.extras.controls
[ERROR] /srv/gump/public/workspace/apacheds/core/src/main/java/org/apache/directory/server/core/partition/DefaultPartitionNexus.java:[61,55]
cannot find symbol
[ERROR] symbol  : class SyncInfoValue
[ERROR] location: package org.apache.directory.shared.ldap.extras.controls
[ERROR] /srv/gump/public/workspace/apacheds/core/src/main/java/org/apache/directory/server/core/partition/DefaultPartitionNexus.java:[62,55]
cannot find symbol
[ERROR] symbol  : class SyncRequestValue
[ERROR] location: package org.apache.directory.shared.ldap.extras.controls
[ERROR] /srv/gump/public/workspace/apacheds/core/src/main/java/org/apache/directory/server/core/partition/DefaultPartitionNexus.java:[63,55]
cannot find symbol
[ERROR] symbol  : class SyncStateValue
[ERROR] location: package org.apache.directory.shared.ldap.extras.controls
[ERROR] /srv/gump/public/workspace/apacheds/core/src/main/java/org/apache/directory/server/core/partition/DefaultPartitionNexus.java:[181,12]
cannot find symbol
[ERROR] symbol  : variable SyncDoneValue
[ERROR] location: class org.apache.directory.server.core.partition.DefaultPartitionNexus
[ERROR] /srv/gump/public/workspace/apacheds/core/src/main/java/org/apache/directory/server/core/partition/DefaultPartitionNexus.java:[181,31]
cannot find symbol
[ERROR] symbol  : variable SyncInfoValue
[ERROR] location: class org.apache.directory.server.core.partition.DefaultPartitionNexus
[ERROR] /srv/gump/public/workspace/apacheds/core/src/main/java/org/apache/directory/server/core/partition/DefaultPartitionNexus.java:[181,50]
cannot find symbol
[ERROR] symbol  : variable SyncRequestValue
[ERROR] location: class org.apache.directory.server.core.partition.DefaultPartitionNexus
[ERROR] /srv/gump/public/workspace/apacheds/core/src/main/java/org/apache/directory/server/core/partition/DefaultPartitionNexus.java:[182,12]
cannot find symbol
[ERROR] symbol  : variable SyncStateValue
[ERROR] location: class org.apache.directory.server.core.partition.DefaultPartitionNexus
[ERROR] -> [Help 1]
[ERROR] 
[ERROR] To see the full stack trace of the errors, re-run Maven with the -e switch.
[ERROR] Re-run Maven using the -X switch to enable full debug logging.
[ERROR] 
[ERROR] For more information about the errors and possible solutions, please read the following
articles:
[ERROR] [Help 1] http://cwiki.apache.org/confluence/display/MAVEN/MojoFailureException
---------------------------------------------

To subscribe to this information via syndicated feeds:
- RSS: http://vmgump.apache.org/gump/public/apacheds/apacheds-core/rss.xml
- Atom: http://vmgump.apache.org/gump/public/apacheds/apacheds-core/atom.xml

============================== Gump Tracking Only ===
Produced by Apache Gump(TM) version 2.3.
Gump Run 08001220042011, vmgump.apache.org:vmgump:08001220042011
Gump E-mail Identifier (unique within run) #3.


--
Apache Gump
http://gump.apache.org/ [Instance: vmgump]

---------------------------------------------------------------------
To unsubscribe, e-mail: general-unsubscribe@gump.apache.org
For additional commands, e-mail: general-help@gump.apache.org


Mime
View raw message