gump-general mailing list archives

Site index · List index
Message view « Date » · « Thread »
Top « Date » · « Thread »
From g...@vmgump.apache.org
Subject BATCH: All dressed up, with nowhere to go...
Date Tue, 15 Feb 2011 02:36:19 GMT
Dear Gumpmeisters,
            
The following 8 notifys should have been sent

*********************************************************** G U M P
[GUMP@vmgump]: Project pdfbox-lucene (in module pdfbox) failed
[GUMP@vmgump]: Project apache-mime4j-reactor (in module james-mime4j) failed
[GUMP@vmgump]: Project apacheds-xdbm-partition (in module apacheds) failed
[GUMP@vmgump]: Project apacheds-xdbm-tools (in module apacheds) failed
[GUMP@vmgump]: Project apacheds-core-api-test (in module apacheds) failed
[GUMP@vmgump]: Project apacheds-core (in module apacheds) failed
[GUMP@vmgump]: Project apacheds-protocol-dhcp (in module apacheds) failed
[GUMP@vmgump]: Project apacheds-kerberos-codec (in module apacheds) failed
*********************************************************** G U M P
[GUMP@vmgump]: Project pdfbox-lucene (in module pdfbox) failed
To whom it may engage...
        
This is an automated request, but not an unsolicited one. For 
more information please visit http://gump.apache.org/nagged.html, 
and/or contact the folk at general@gump.apache.org.

Project pdfbox-lucene has an issue affecting its community integration.
This issue affects 1 projects.
The current state of this project is 'Failed', with reason 'Build Failed'.
For reference only, the following projects are affected by this:
    - pdfbox-lucene :  Apache PDFBox is an open source Java PDF library for working...


Full details are available at:
    http://vmgump.apache.org/gump/public/pdfbox/pdfbox-lucene/index.html

That said, some information snippets are provided here.

The following annotations (debug/informational/warning/error messages) were provided:
 -DEBUG- Sole jar output [pdfbox-lucene-*[0-9T].jar] identifier set to project name
 -INFO- Optional dependency lucene-java-contrib prerequisite failed with reason build failed
 -DEBUG- (Apache Gump generated) Apache Maven Settings in: /srv/gump/public/workspace/pdfbox/lucene/gump_mvn_settings.xml
 -INFO- Failed with reason build failed
 -DEBUG- Maven POM in: /srv/gump/public/workspace/pdfbox/lucene/pom.xml
 -INFO- Failed to extract fallback artifacts from Gump Repository



The following work was performed:
http://vmgump.apache.org/gump/public/pdfbox/pdfbox-lucene/gump_work/build_pdfbox_pdfbox-lucene.html
Work Name: build_pdfbox_pdfbox-lucene (Type: Build)
Work ended in a state of : Failed
Elapsed: 10 secs
Command Line: /opt/maven2/bin/mvn --batch-mode --settings /srv/gump/public/workspace/pdfbox/lucene/gump_mvn_settings.xml
package 
[Working Directory: /srv/gump/public/workspace/pdfbox/lucene]
M2_HOME: /opt/maven2
---------------------------------------------
[INFO] Setting property: classpath.resource.loader.class => 'org.codehaus.plexus.velocity.ContextClassLoaderResourceLoader'.
[INFO] Setting property: velocimacro.messages.on => 'false'.
[INFO] Setting property: resource.loader => 'classpath'.
[INFO] Setting property: resource.manager.logwhenfound => 'false'.
[INFO] [remote-resources:process {execution: default}]
[INFO] [resources:resources {execution: default-resources}]
[INFO] Using 'ISO-8859-1' encoding to copy filtered resources.
[INFO] skip non existing resourceDirectory /srv/gump/public/workspace/pdfbox/lucene/src/main/resources
[INFO] Copying 3 resources
[INFO] [compiler:compile {execution: default-compile}]
[INFO] Compiling 4 source files to /srv/gump/public/workspace/pdfbox/lucene/target/classes
[INFO] ------------------------------------------------------------------------
[ERROR] BUILD FAILURE
[INFO] ------------------------------------------------------------------------
[INFO] Compilation failure

/srv/gump/public/workspace/pdfbox/lucene/src/main/java/org/apache/pdfbox/lucene/IndexFiles.java:[25,42]
package org.apache.lucene.analysis.standard does not exist

/srv/gump/public/workspace/pdfbox/lucene/src/main/java/org/apache/pdfbox/lucene/IndexFiles.java:[34,30]
cannot find symbol
symbol  : class TermEnum
location: package org.apache.lucene.index

/srv/gump/public/workspace/pdfbox/lucene/src/main/java/org/apache/pdfbox/lucene/IndexFiles.java:[59,12]
cannot find symbol
symbol  : class TermEnum
location: class org.apache.pdfbox.lucene.IndexFiles

/srv/gump/public/workspace/pdfbox/lucene/src/main/java/org/apache/pdfbox/lucene/IndexFiles.java:[120,48]
cannot find symbol
symbol  : class StandardAnalyzer
location: class org.apache.pdfbox.lucene.IndexFiles

/srv/gump/public/workspace/pdfbox/lucene/src/main/java/org/apache/pdfbox/lucene/IndexFiles.java:[120,87]
cannot find symbol
symbol  : variable MaxFieldLength
location: class org.apache.lucene.index.IndexWriter

/srv/gump/public/workspace/pdfbox/lucene/src/main/java/org/apache/pdfbox/lucene/IndexFiles.java:[120,21]
internal error; cannot instantiate org.apache.lucene.index.IndexWriter.<init> at org.apache.lucene.index.IndexWriter
to ()

/srv/gump/public/workspace/pdfbox/lucene/src/main/java/org/apache/pdfbox/lucene/IndexFiles.java:[163,32]
cannot find symbol
symbol  : method open(java.lang.String)
location: class org.apache.lucene.index.IndexReader

/srv/gump/public/workspace/pdfbox/lucene/src/main/java/org/apache/pdfbox/lucene/IndexFiles.java:[164,28]
terms(java.lang.String) in org.apache.lucene.index.IndexReader cannot be applied to (org.apache.lucene.index.Term)


[INFO] ------------------------------------------------------------------------
[INFO] For more information, run Maven with the -e switch
[INFO] ------------------------------------------------------------------------
[INFO] Total time: 9 seconds
[INFO] Finished at: Mon Feb 14 20:46:20 UTC 2011
[INFO] Final Memory: 24M/57M
[INFO] ------------------------------------------------------------------------
---------------------------------------------

To subscribe to this information via syndicated feeds:
- RSS: http://vmgump.apache.org/gump/public/pdfbox/pdfbox-lucene/rss.xml
- Atom: http://vmgump.apache.org/gump/public/pdfbox/pdfbox-lucene/atom.xml

============================== Gump Tracking Only ===
Produced by Apache Gump(TM) version 2.3.
Gump Run 06001814022011, vmgump.apache.org:vmgump:06001814022011
Gump E-mail Identifier (unique within run) #1.

*********************************************************** G U M P
[GUMP@vmgump]: Project apache-mime4j-reactor (in module james-mime4j) failed
To whom it may engage...
        
This is an automated request, but not an unsolicited one. For 
more information please visit http://gump.apache.org/nagged.html, 
and/or contact the folk at general@gump.apache.org.

Project apache-mime4j-reactor has an issue affecting its community integration.
This issue affects 1 projects.
The current state of this project is 'Failed', with reason 'Build Failed'.
For reference only, the following projects are affected by this:
    - apache-mime4j-reactor :  Java stream based MIME message parser


Full details are available at:
    http://vmgump.apache.org/gump/public/james-mime4j/apache-mime4j-reactor/index.html

That said, some information snippets are provided here.

The following annotations (debug/informational/warning/error messages) were provided:
 -INFO- Optional dependency doxia-site-renderer failed with reason build failed
 -WARNING- Overriding Maven settings: [/srv/gump/public/workspace/james-mime4j/gump_mvn_settings.xml]
 -DEBUG- (Apache Gump generated) Apache Maven Settings in: /srv/gump/public/workspace/james-mime4j/gump_mvn_settings.xml
 -INFO- Failed with reason build failed
 -DEBUG- Maven POM in: /srv/gump/public/workspace/james-mime4j/pom.xml



The following work was performed:
http://vmgump.apache.org/gump/public/james-mime4j/apache-mime4j-reactor/gump_work/build_james-mime4j_apache-mime4j-reactor.html
Work Name: build_james-mime4j_apache-mime4j-reactor (Type: Build)
Work ended in a state of : Failed
Elapsed: 45 secs
Command Line: /opt/maven2/bin/mvn --batch-mode --settings /srv/gump/public/workspace/james-mime4j/gump_mvn_settings.xml
package 
[Working Directory: /srv/gump/public/workspace/james-mime4j]
M2_HOME: /opt/maven2
---------------------------------------------
Running org.apache.james.mime4j.stream.MimeTokenStreamTest
Tests run: 1, Failures: 0, Errors: 0, Skipped: 0, Time elapsed: 0.012 sec
Running org.apache.james.mime4j.TestUtil
Tests run: 0, Failures: 0, Errors: 0, Skipped: 0, Time elapsed: 0.002 sec
Running org.apache.james.mime4j.io.PositionInputStreamTest
Tests run: 1, Failures: 0, Errors: 0, Skipped: 0, Time elapsed: 0.003 sec
Running org.apache.james.mime4j.stream.MimeTokenNoRecurseTest
Tests run: 4, Failures: 0, Errors: 0, Skipped: 0, Time elapsed: 0.013 sec
Running org.apache.james.mime4j.parser.MimeStreamParserTest
Tests run: 11, Failures: 0, Errors: 0, Skipped: 0, Time elapsed: 0.1 sec
Running org.apache.james.mime4j.codec.DecoderUtilTest
Tests run: 13, Failures: 0, Errors: 0, Skipped: 0, Time elapsed: 0.037 sec
Running org.apache.james.mime4j.MimeExceptionTest
Tests run: 3, Failures: 0, Errors: 0, Skipped: 0, Time elapsed: 0.003 sec
Running org.apache.james.mime4j.codec.QuotedPrintableEncodeTest
Tests run: 5, Failures: 0, Errors: 0, Skipped: 0, Time elapsed: 0.016 sec
Running org.apache.james.mime4j.MimeIOExceptionTest
Tests run: 1, Failures: 0, Errors: 0, Skipped: 0, Time elapsed: 0.003 sec
Running org.apache.james.mime4j.codec.QuotedPrintableInputStreamTest
Tests run: 19, Failures: 0, Errors: 0, Skipped: 0, Time elapsed: 0.011 sec
Running org.apache.james.mime4j.stream.MimeTokenStreamBodyDescriptorTest
Tests run: 2, Failures: 0, Errors: 0, Skipped: 0, Time elapsed: 0.009 sec
Running org.apache.james.mime4j.codec.CodecUtilTest
Tests run: 5, Failures: 0, Errors: 0, Skipped: 0, Time elapsed: 0.054 sec
Running org.apache.james.mime4j.stream.MultipartStreamTest
Tests run: 2, Failures: 0, Errors: 0, Skipped: 0, Time elapsed: 0.005 sec

Results :

Tests run: 219, Failures: 0, Errors: 0, Skipped: 0

[INFO] [jar:jar {execution: default-jar}]
[INFO] Building jar: /srv/gump/public/workspace/james-mime4j/core/target/apache-mime4j-core-0.7-SNAPSHOT.jar
[INFO] [jar:test-jar {execution: default}]
[INFO] Building jar: /srv/gump/public/workspace/james-mime4j/core/target/apache-mime4j-core-0.7-SNAPSHOT-tests.jar
[INFO] [javadoc:jar {execution: javadoc-jar}]
[INFO] The goal 'org.apache.maven.plugins:maven-javadoc-plugin:2.6.1:javadoc' has not be previously
called for the project: 'org.apache.james:apache-mime4j-storage:jar:0.7-SNAPSHOT'. Trying
to invoke it...
[ERROR] MavenInvocationException: Error when invoking Maven, consult the invoker log file:
/srv/gump/public/workspace/james-mime4j/core/target/invoker/maven-javadoc-plugin410701664.txt
[INFO] ------------------------------------------------------------------------
[ERROR] BUILD ERROR
[INFO] ------------------------------------------------------------------------
[INFO] MavenReportException: Error while creating archive:Error when invoking Maven, consult
the invoker log file: /srv/gump/public/workspace/james-mime4j/core/target/invoker/maven-javadoc-plugin410701664.txt

[INFO] ------------------------------------------------------------------------
[INFO] For more information, run Maven with the -e switch
[INFO] ------------------------------------------------------------------------
[INFO] Total time: 44 seconds
[INFO] Finished at: Mon Feb 14 21:38:54 UTC 2011
[INFO] Final Memory: 38M/93M
[INFO] ------------------------------------------------------------------------
---------------------------------------------

To subscribe to this information via syndicated feeds:
- RSS: http://vmgump.apache.org/gump/public/james-mime4j/apache-mime4j-reactor/rss.xml
- Atom: http://vmgump.apache.org/gump/public/james-mime4j/apache-mime4j-reactor/atom.xml

============================== Gump Tracking Only ===
Produced by Apache Gump(TM) version 2.3.
Gump Run 06001814022011, vmgump.apache.org:vmgump:06001814022011
Gump E-mail Identifier (unique within run) #2.

*********************************************************** G U M P
[GUMP@vmgump]: Project apacheds-xdbm-partition (in module apacheds) failed
To whom it may engage...
        
This is an automated request, but not an unsolicited one. For 
more information please visit http://gump.apache.org/nagged.html, 
and/or contact the folk at general@gump.apache.org.

Project apacheds-xdbm-partition has an issue affecting its community integration.
This issue affects 6 projects.
The current state of this project is 'Failed', with reason 'Build Failed'.
For reference only, the following projects are affected by this:
    - apacheds-all :  Apache Directory Server
    - apacheds-server-config :  Apache Directory Server
    - apacheds-service :  Apache Directory Server
    - apacheds-service-builder :  Apache Directory Server
    - apacheds-wrapper :  Apache Directory Server
    - apacheds-xdbm-partition :  Apache Directory Server


Full details are available at:
    http://vmgump.apache.org/gump/public/apacheds/apacheds-xdbm-partition/index.html

That said, some information snippets are provided here.

The following annotations (debug/informational/warning/error messages) were provided:
 -DEBUG- Sole jar output [apacheds-xdbm-partition-*[0-9T].jar] identifier set to project name
 -DEBUG- (Apache Gump generated) Apache Maven Settings in: /srv/gump/public/workspace/apacheds/xdbm-partition/gump_mvn_settings.xml
 -INFO- Failed with reason build failed
 -DEBUG- Maven POM in: /srv/gump/public/workspace/apacheds/xdbm-partition/pom.xml
 -INFO- Failed to extract fallback artifacts from Gump Repository



The following work was performed:
http://vmgump.apache.org/gump/public/apacheds/apacheds-xdbm-partition/gump_work/build_apacheds_apacheds-xdbm-partition.html
Work Name: build_apacheds_apacheds-xdbm-partition (Type: Build)
Work ended in a state of : Failed
Elapsed: 24 secs
Command Line: /opt/maven3/bin/mvn --batch-mode --settings /srv/gump/public/workspace/apacheds/xdbm-partition/gump_mvn_settings.xml
install 
[Working Directory: /srv/gump/public/workspace/apacheds/xdbm-partition]
M2_HOME: /opt/maven3
---------------------------------------------
Tests run: 9, Failures: 0, Errors: 0, Skipped: 0, Time elapsed: 0.005 sec
Running org.apache.directory.server.xdbm.AbstractStoreTest
Tests run: 1, Failures: 0, Errors: 1, Skipped: 0, Time elapsed: 0.248 sec <<< FAILURE!
Running org.apache.directory.server.xdbm.impl.avl.AvlStoreTest
Tests run: 1, Failures: 0, Errors: 1, Skipped: 0, Time elapsed: 0.175 sec <<< FAILURE!
Running org.apache.directory.server.xdbm.impl.avl.AvlRdnIndexTest
Tests run: 1, Failures: 0, Errors: 1, Skipped: 0, Time elapsed: 0.131 sec <<< FAILURE!
Running org.apache.directory.server.xdbm.impl.avl.AvlTableTest
Tests run: 5, Failures: 0, Errors: 0, Skipped: 0, Time elapsed: 0.032 sec
Running org.apache.directory.server.xdbm.GenericIndexTest
Tests run: 39, Failures: 0, Errors: 0, Skipped: 0, Time elapsed: 0.066 sec
Running org.apache.directory.server.xdbm.ReverseIndexEntryTest
Tests run: 7, Failures: 0, Errors: 0, Skipped: 0, Time elapsed: 0.004 sec

Results :

Tests in error: 
  org.apache.directory.server.xdbm.search.impl.PresenceTest: antlr/RecognitionException
  org.apache.directory.server.xdbm.search.impl.SubstringTest: antlr/RecognitionException
  org.apache.directory.server.xdbm.search.impl.NestedFilterTest: antlr/RecognitionException
  org.apache.directory.server.xdbm.search.impl.GreaterEqTest: antlr/RecognitionException
  org.apache.directory.server.xdbm.search.impl.OneLevelScopeTest: antlr/RecognitionException
  org.apache.directory.server.xdbm.search.impl.LessEqTest: antlr/RecognitionException
  org.apache.directory.server.xdbm.search.impl.NotCursorTest: antlr/RecognitionException
  org.apache.directory.server.xdbm.search.impl.SubtreeScopeTest: antlr/RecognitionException
  org.apache.directory.server.xdbm.search.impl.AndCursorTest: antlr/RecognitionException
  org.apache.directory.server.xdbm.search.impl.OrCursorTest: antlr/RecognitionException
  org.apache.directory.server.xdbm.AbstractStoreTest: antlr/RecognitionException
  org.apache.directory.server.xdbm.impl.avl.AvlStoreTest: antlr/RecognitionException
  org.apache.directory.server.xdbm.impl.avl.AvlRdnIndexTest: antlr/RecognitionException

Tests run: 127, Failures: 0, Errors: 13, Skipped: 0

[INFO] ------------------------------------------------------------------------
[INFO] BUILD FAILURE
[INFO] ------------------------------------------------------------------------
[INFO] Total time: 23.019s
[INFO] Finished at: Tue Feb 15 01:51:32 UTC 2011
[INFO] Final Memory: 16M/51M
[INFO] ------------------------------------------------------------------------
[ERROR] Failed to execute goal org.apache.maven.plugins:maven-surefire-plugin:2.7.2:test (default-test)
on project apacheds-xdbm-partition: There are test failures.
[ERROR] 
[ERROR] Please refer to /srv/gump/public/workspace/apacheds/xdbm-partition/target/surefire-reports
for the individual test results.
[ERROR] -> [Help 1]
[ERROR] 
[ERROR] To see the full stack trace of the errors, re-run Maven with the -e switch.
[ERROR] Re-run Maven using the -X switch to enable full debug logging.
[ERROR] 
[ERROR] For more information about the errors and possible solutions, please read the following
articles:
[ERROR] [Help 1] http://cwiki.apache.org/confluence/display/MAVEN/MojoFailureException
---------------------------------------------

To subscribe to this information via syndicated feeds:
- RSS: http://vmgump.apache.org/gump/public/apacheds/apacheds-xdbm-partition/rss.xml
- Atom: http://vmgump.apache.org/gump/public/apacheds/apacheds-xdbm-partition/atom.xml

============================== Gump Tracking Only ===
Produced by Apache Gump(TM) version 2.3.
Gump Run 06001814022011, vmgump.apache.org:vmgump:06001814022011
Gump E-mail Identifier (unique within run) #3.

*********************************************************** G U M P
[GUMP@vmgump]: Project apacheds-xdbm-tools (in module apacheds) failed
To whom it may engage...
        
This is an automated request, but not an unsolicited one. For 
more information please visit http://gump.apache.org/nagged.html, 
and/or contact the folk at general@gump.apache.org.

Project apacheds-xdbm-tools has an issue affecting its community integration.
This issue affects 1 projects.
The current state of this project is 'Failed', with reason 'Build Failed'.
For reference only, the following projects are affected by this:
    - apacheds-xdbm-tools :  Apache Directory Server


Full details are available at:
    http://vmgump.apache.org/gump/public/apacheds/apacheds-xdbm-tools/index.html

That said, some information snippets are provided here.

The following annotations (debug/informational/warning/error messages) were provided:
 -DEBUG- Sole jar output [apacheds-xdbm-tools-*[0-9T].jar] identifier set to project name
 -INFO- Optional dependency apacheds-xdbm-partition failed with reason build failed
 -DEBUG- (Apache Gump generated) Apache Maven Settings in: /srv/gump/public/workspace/apacheds/xdbm-tools/gump_mvn_settings.xml
 -INFO- Failed with reason build failed
 -DEBUG- Maven POM in: /srv/gump/public/workspace/apacheds/xdbm-tools/pom.xml
 -INFO- Failed to extract fallback artifacts from Gump Repository



The following work was performed:
http://vmgump.apache.org/gump/public/apacheds/apacheds-xdbm-tools/gump_work/build_apacheds_apacheds-xdbm-tools.html
Work Name: build_apacheds_apacheds-xdbm-tools (Type: Build)
Work ended in a state of : Failed
Elapsed: 4 secs
Command Line: /opt/maven3/bin/mvn --batch-mode --settings /srv/gump/public/workspace/apacheds/xdbm-tools/gump_mvn_settings.xml
install 
[Working Directory: /srv/gump/public/workspace/apacheds/xdbm-tools]
M2_HOME: /opt/maven3
---------------------------------------------
[INFO] Scanning for projects...
[INFO]                                                                         
[INFO] ------------------------------------------------------------------------
[INFO] Building ApacheDS Generalized (X) DBM Tools 1.5.8-SNAPSHOT
[INFO] ------------------------------------------------------------------------
[WARNING] The POM for org.apache.directory.shared:ldap-client-api:jar:1.0.0-M1-SNAPSHOT is
missing, no dependency information available
[WARNING] The POM for org.apache.directory.shared:shared-asn1-api:jar:1.0.0-M1-SNAPSHOT is
missing, no dependency information available
[WARNING] The POM for org.apache.directory.shared:shared-i18n:jar:1.0.0-M1-SNAPSHOT is missing,
no dependency information available
[WARNING] The POM for org.apache.directory.shared:shared-ldap:jar:1.0.0-M1-SNAPSHOT is missing,
no dependency information available
[WARNING] The POM for org.apache.directory.shared:shared-ldap-codec:jar:1.0.0-M1-SNAPSHOT
is missing, no dependency information available
[WARNING] The POM for org.apache.directory.shared:shared-ldap-model:jar:1.0.0-M1-SNAPSHOT
is missing, no dependency information available
[WARNING] The POM for org.apache.directory.shared:shared-ldap-schema:jar:1.0.0-M1-SNAPSHOT
is missing, no dependency information available
[WARNING] The POM for org.apache.directory.shared:shared-util:jar:1.0.0-M1-SNAPSHOT is missing,
no dependency information available
Downloading: http://localhost:8192/repo/m2-snapshot-repository/org/apache/directory/server/apacheds-xdbm-partition/1.5.8-SNAPSHOT/maven-metadata.xml
Downloading: http://localhost:8192/repo/m2-snapshot-repository/org/apache/directory/server/apacheds-xdbm-partition/1.5.8-SNAPSHOT/apacheds-xdbm-partition-1.5.8-SNAPSHOT.pom
[WARNING] The POM for org.apache.directory.server:apacheds-xdbm-partition:jar:1.5.8-SNAPSHOT
is missing, no dependency information available
Downloading: http://localhost:8192/repo/m2-snapshot-repository/org/apache/directory/server/apacheds-xdbm-partition/1.5.8-SNAPSHOT/apacheds-xdbm-partition-1.5.8-SNAPSHOT.jar
[INFO] ------------------------------------------------------------------------
[INFO] BUILD FAILURE
[INFO] ------------------------------------------------------------------------
[INFO] Total time: 2.562s
[INFO] Finished at: Tue Feb 15 01:51:44 UTC 2011
[INFO] Final Memory: 3M/15M
[INFO] ------------------------------------------------------------------------
[ERROR] Failed to execute goal on project apacheds-xdbm-tools: Could not resolve dependencies
for project org.apache.directory.server:apacheds-xdbm-tools:jar:1.5.8-SNAPSHOT: Could not
find artifact org.apache.directory.server:apacheds-xdbm-partition:jar:1.5.8-SNAPSHOT in gump-apache.snapshots
(http://localhost:8192/repo/m2-snapshot-repository) -> [Help 1]
[ERROR] 
[ERROR] To see the full stack trace of the errors, re-run Maven with the -e switch.
[ERROR] Re-run Maven using the -X switch to enable full debug logging.
[ERROR] 
[ERROR] For more information about the errors and possible solutions, please read the following
articles:
[ERROR] [Help 1] http://cwiki.apache.org/confluence/display/MAVEN/DependencyResolutionException
---------------------------------------------

To subscribe to this information via syndicated feeds:
- RSS: http://vmgump.apache.org/gump/public/apacheds/apacheds-xdbm-tools/rss.xml
- Atom: http://vmgump.apache.org/gump/public/apacheds/apacheds-xdbm-tools/atom.xml

============================== Gump Tracking Only ===
Produced by Apache Gump(TM) version 2.3.
Gump Run 06001814022011, vmgump.apache.org:vmgump:06001814022011
Gump E-mail Identifier (unique within run) #4.

*********************************************************** G U M P
[GUMP@vmgump]: Project apacheds-core-api-test (in module apacheds) failed
To whom it may engage...
        
This is an automated request, but not an unsolicited one. For 
more information please visit http://gump.apache.org/nagged.html, 
and/or contact the folk at general@gump.apache.org.

Project apacheds-core-api-test has an issue affecting its community integration.
This issue affects 1 projects.
The current state of this project is 'Failed', with reason 'Build Failed'.
For reference only, the following projects are affected by this:
    - apacheds-core-api-test :  Apache Directory Server


Full details are available at:
    http://vmgump.apache.org/gump/public/apacheds/apacheds-core-api-test/index.html

That said, some information snippets are provided here.

The following annotations (debug/informational/warning/error messages) were provided:
 -WARNING- Overriding Maven settings: [/srv/gump/public/workspace/apacheds/core-api/gump_mvn_settings.xml]
 -DEBUG- (Apache Gump generated) Apache Maven Settings in: /srv/gump/public/workspace/apacheds/core-api/gump_mvn_settings.xml
 -INFO- Failed with reason build failed
 -DEBUG- Maven POM in: /srv/gump/public/workspace/apacheds/core-api/pom.xml



The following work was performed:
http://vmgump.apache.org/gump/public/apacheds/apacheds-core-api-test/gump_work/build_apacheds_apacheds-core-api-test.html
Work Name: build_apacheds_apacheds-core-api-test (Type: Build)
Work ended in a state of : Failed
Elapsed: 10 secs
Command Line: /opt/maven3/bin/mvn --batch-mode --settings /srv/gump/public/workspace/apacheds/core-api/gump_mvn_settings.xml
package 
[Working Directory: /srv/gump/public/workspace/apacheds/core-api]
M2_HOME: /opt/maven3
---------------------------------------------
[INFO] Copying 3 resources
[INFO] 
[INFO] --- maven-compiler-plugin:2.3.2:testCompile (default-testCompile) @ apacheds-core-api
---
[INFO] Nothing to compile - all classes are up to date
[INFO] 
[INFO] --- maven-surefire-plugin:2.7.2:test (default-test) @ apacheds-core-api ---
[INFO] Surefire report directory: /srv/gump/public/workspace/apacheds/core-api/target/surefire-reports

-------------------------------------------------------
 T E S T S
-------------------------------------------------------
Running org.apache.directory.server.core.changelog.TagTest
Tests run: 8, Failures: 0, Errors: 0, Skipped: 0, Time elapsed: 0.07 sec
Running org.apache.directory.server.core.entry.SchemaAwareModificationTest
SLF4J: The requested version 1.5.9 by your slf4j binding is not compatible with [1.6]
SLF4J: See http://www.slf4j.org/codes.html#version_mismatch for further details.
Tests run: 1, Failures: 0, Errors: 1, Skipped: 0, Time elapsed: 1.147 sec <<< FAILURE!
Running org.apache.directory.server.core.entry.ClonedServerEntryTest
Tests run: 8, Failures: 0, Errors: 0, Skipped: 0, Time elapsed: 0.027 sec
Running org.apache.directory.server.core.entry.SchemaAwareEntryAttributeTest
Tests run: 1, Failures: 0, Errors: 1, Skipped: 0, Time elapsed: 0.89 sec <<< FAILURE!
Running org.apache.directory.server.core.entry.SchemaAwareEntryTest
Tests run: 1, Failures: 0, Errors: 1, Skipped: 0, Time elapsed: 0.41 sec <<< FAILURE!

Results :

Tests in error: 
  org.apache.directory.server.core.entry.SchemaAwareModificationTest: antlr/RecognitionException
  org.apache.directory.server.core.entry.SchemaAwareEntryAttributeTest: antlr/RecognitionException
  org.apache.directory.server.core.entry.SchemaAwareEntryTest: antlr/RecognitionException

Tests run: 19, Failures: 0, Errors: 3, Skipped: 0

[INFO] ------------------------------------------------------------------------
[INFO] BUILD FAILURE
[INFO] ------------------------------------------------------------------------
[INFO] Total time: 9.197s
[INFO] Finished at: Tue Feb 15 01:51:55 UTC 2011
[INFO] Final Memory: 8M/20M
[INFO] ------------------------------------------------------------------------
[ERROR] Failed to execute goal org.apache.maven.plugins:maven-surefire-plugin:2.7.2:test (default-test)
on project apacheds-core-api: There are test failures.
[ERROR] 
[ERROR] Please refer to /srv/gump/public/workspace/apacheds/core-api/target/surefire-reports
for the individual test results.
[ERROR] -> [Help 1]
[ERROR] 
[ERROR] To see the full stack trace of the errors, re-run Maven with the -e switch.
[ERROR] Re-run Maven using the -X switch to enable full debug logging.
[ERROR] 
[ERROR] For more information about the errors and possible solutions, please read the following
articles:
[ERROR] [Help 1] http://cwiki.apache.org/confluence/display/MAVEN/MojoFailureException
---------------------------------------------

To subscribe to this information via syndicated feeds:
- RSS: http://vmgump.apache.org/gump/public/apacheds/apacheds-core-api-test/rss.xml
- Atom: http://vmgump.apache.org/gump/public/apacheds/apacheds-core-api-test/atom.xml

============================== Gump Tracking Only ===
Produced by Apache Gump(TM) version 2.3.
Gump Run 06001814022011, vmgump.apache.org:vmgump:06001814022011
Gump E-mail Identifier (unique within run) #5.

*********************************************************** G U M P
[GUMP@vmgump]: Project apacheds-core (in module apacheds) failed
To whom it may engage...
        
This is an automated request, but not an unsolicited one. For 
more information please visit http://gump.apache.org/nagged.html, 
and/or contact the folk at general@gump.apache.org.

Project apacheds-core has an issue affecting its community integration.
This issue affects 28 projects.
The current state of this project is 'Failed', with reason 'Build Failed'.
For reference only, the following projects are affected by this:
    - apacheds-core :  Apache Directory Server
    - apacheds-core-annotations :  Apache Directory Server
    - apacheds-core-annotations-test :  Apache Directory Server
    - apacheds-core-integ :  Apache Directory Server
    - apacheds-core-integ-test :  Apache Directory Server
    - apacheds-core-jndi :  Apache Directory Server
    - apacheds-http-directory-bridge :  Apache Directory Server
    - apacheds-http-integration :  Apache Directory Server
    - apacheds-interceptor-kerberos :  Apache Directory Server
    - apacheds-jdbm-partition :  Apache Directory Server
    - apacheds-kerberos-test :  Apache Directory Server
    - apacheds-ldap-client-test :  Apache Directory Server
    - apacheds-ldif-partition :  Apache Directory Server
    - apacheds-protocol-changepw :  Apache Directory Server
    - apacheds-protocol-dns :  Apache Directory Server
    - apacheds-protocol-kerberos :  Apache Directory Server
    - apacheds-protocol-kerberos-test :  Apache Directory Server
    - apacheds-protocol-ldap :  Apache Directory Server
    - apacheds-protocol-ntp :  Apache Directory Server
    - apacheds-protocol-ntp-test :  Apache Directory Server
    - apacheds-protocol-shared :  Apache Directory Server
    - apacheds-server-annotations :  Apache Directory Server
    - apacheds-server-integ :  Apache Directory Server
    - apacheds-server-integ-test :  Apache Directory Server
    - apacheds-server-jndi :  Apache Directory Server
    - apacheds-server-tools :  Apache Directory Server
    - apacheds-test-framework :  Apache Directory Server
    - syncrepl :  Apache Directory Server


Full details are available at:
    http://vmgump.apache.org/gump/public/apacheds/apacheds-core/index.html

That said, some information snippets are provided here.

The following annotations (debug/informational/warning/error messages) were provided:
 -DEBUG- Sole jar output [apacheds-core-*[0-9T].jar] identifier set to project name
 -DEBUG- (Apache Gump generated) Apache Maven Settings in: /srv/gump/public/workspace/apacheds/core/gump_mvn_settings.xml
 -INFO- Failed with reason build failed
 -DEBUG- Maven POM in: /srv/gump/public/workspace/apacheds/core/pom.xml
 -INFO- Failed to extract fallback artifacts from Gump Repository



The following work was performed:
http://vmgump.apache.org/gump/public/apacheds/apacheds-core/gump_work/build_apacheds_apacheds-core.html
Work Name: build_apacheds_apacheds-core (Type: Build)
Work ended in a state of : Failed
Elapsed: 28 secs
Command Line: /opt/maven3/bin/mvn --batch-mode --settings /srv/gump/public/workspace/apacheds/core/gump_mvn_settings.xml
install 
[Working Directory: /srv/gump/public/workspace/apacheds/core]
M2_HOME: /opt/maven3
---------------------------------------------
Tests run: 8, Failures: 0, Errors: 0, Skipped: 0, Time elapsed: 0.019 sec
Running org.apache.directory.server.core.authz.support.RestrictedByFilterTest
Tests run: 1, Failures: 0, Errors: 1, Skipped: 0, Time elapsed: 0.094 sec <<< FAILURE!
Running org.apache.directory.server.core.authz.support.OperationScopeTest
Tests run: 2, Failures: 0, Errors: 0, Skipped: 0, Time elapsed: 0.005 sec
Running org.apache.directory.server.core.authz.support.MaxImmSubFilterTest
Tests run: 1, Failures: 0, Errors: 1, Skipped: 0, Time elapsed: 0.147 sec <<< FAILURE!
Running org.apache.directory.server.core.authz.support.MaxValueCountFilterTest
Tests run: 1, Failures: 0, Errors: 1, Skipped: 0, Time elapsed: 0.197 sec <<< FAILURE!
Running org.apache.directory.server.core.authz.support.MostSpecificUserClassFilterTest
Tests run: 6, Failures: 0, Errors: 0, Skipped: 0, Time elapsed: 0.036 sec
Running org.apache.directory.server.core.authn.SimpleAuthenticatorOneWayEncryptedTest
Tests run: 2, Failures: 0, Errors: 0, Skipped: 0, Time elapsed: 0.169 sec
Running org.apache.directory.server.core.authn.LdapPrincipalTest
Tests run: 1, Failures: 0, Errors: 0, Skipped: 0, Time elapsed: 0.005 sec

Results :

Tests in error: 
  org.apache.directory.server.core.schema.SchemaServiceTest: antlr/RecognitionException
  org.apache.directory.server.core.security.TlsKeyGeneratorTest: antlr/RecognitionException
  org.apache.directory.server.core.subtree.RefinementLeafEvaluatorTest: antlr/TokenStream
  org.apache.directory.server.core.subtree.SubtreeEvaluatorTest: antlr/RecognitionException
  org.apache.directory.server.core.subtree.SubtreeEvaluatorTest
  org.apache.directory.server.core.subtree.RefinementEvaluatorTest: antlr/TokenStream
  org.apache.directory.server.core.normalization.NormalizationVisitorTest: antlr/TokenStream
  org.apache.directory.server.core.authz.support.RelatedProtectedItemFilterTest: antlr/TokenStream
  org.apache.directory.server.core.authz.support.RestrictedByFilterTest: antlr/TokenStream
  org.apache.directory.server.core.authz.support.MaxImmSubFilterTest: antlr/TokenStream
  org.apache.directory.server.core.authz.support.MaxValueCountFilterTest: antlr/TokenStream

Tests run: 51, Failures: 0, Errors: 11, Skipped: 0

[INFO] ------------------------------------------------------------------------
[INFO] BUILD FAILURE
[INFO] ------------------------------------------------------------------------
[INFO] Total time: 27.063s
[INFO] Finished at: Tue Feb 15 01:52:46 UTC 2011
[INFO] Final Memory: 17M/49M
[INFO] ------------------------------------------------------------------------
[ERROR] Failed to execute goal org.apache.maven.plugins:maven-surefire-plugin:2.7.2:test (default-test)
on project apacheds-core: There are test failures.
[ERROR] 
[ERROR] Please refer to /srv/gump/public/workspace/apacheds/core/target/surefire-reports for
the individual test results.
[ERROR] -> [Help 1]
[ERROR] 
[ERROR] To see the full stack trace of the errors, re-run Maven with the -e switch.
[ERROR] Re-run Maven using the -X switch to enable full debug logging.
[ERROR] 
[ERROR] For more information about the errors and possible solutions, please read the following
articles:
[ERROR] [Help 1] http://cwiki.apache.org/confluence/display/MAVEN/MojoFailureException
---------------------------------------------

To subscribe to this information via syndicated feeds:
- RSS: http://vmgump.apache.org/gump/public/apacheds/apacheds-core/rss.xml
- Atom: http://vmgump.apache.org/gump/public/apacheds/apacheds-core/atom.xml

============================== Gump Tracking Only ===
Produced by Apache Gump(TM) version 2.3.
Gump Run 06001814022011, vmgump.apache.org:vmgump:06001814022011
Gump E-mail Identifier (unique within run) #6.

*********************************************************** G U M P
[GUMP@vmgump]: Project apacheds-protocol-dhcp (in module apacheds) failed
To whom it may engage...
        
This is an automated request, but not an unsolicited one. For 
more information please visit http://gump.apache.org/nagged.html, 
and/or contact the folk at general@gump.apache.org.

Project apacheds-protocol-dhcp has an issue affecting its community integration.
This issue affects 1 projects.
The current state of this project is 'Failed', with reason 'Build Failed'.
For reference only, the following projects are affected by this:
    - apacheds-protocol-dhcp :  Apache Directory Server


Full details are available at:
    http://vmgump.apache.org/gump/public/apacheds/apacheds-protocol-dhcp/index.html

That said, some information snippets are provided here.

The following annotations (debug/informational/warning/error messages) were provided:
 -DEBUG- Sole jar output [apacheds-protocol-dhcp-*[0-9T].jar] identifier set to project name
 -INFO- Optional dependency apacheds-protocol-shared prerequisite failed with reason build
failed
 -DEBUG- (Apache Gump generated) Apache Maven Settings in: /srv/gump/public/workspace/apacheds/protocol-dhcp/gump_mvn_settings.xml
 -INFO- Failed with reason build failed
 -DEBUG- Maven POM in: /srv/gump/public/workspace/apacheds/protocol-dhcp/pom.xml
 -INFO- Failed to extract fallback artifacts from Gump Repository



The following work was performed:
http://vmgump.apache.org/gump/public/apacheds/apacheds-protocol-dhcp/gump_work/build_apacheds_apacheds-protocol-dhcp.html
Work Name: build_apacheds_apacheds-protocol-dhcp (Type: Build)
Work ended in a state of : Failed
Elapsed: 8 secs
Command Line: /opt/maven3/bin/mvn --batch-mode --settings /srv/gump/public/workspace/apacheds/protocol-dhcp/gump_mvn_settings.xml
install 
[Working Directory: /srv/gump/public/workspace/apacheds/protocol-dhcp]
M2_HOME: /opt/maven3
---------------------------------------------
[INFO] Scanning for projects...
[INFO]                                                                         
[INFO] ------------------------------------------------------------------------
[INFO] Building ApacheDS Protocol Dhcp 1.5.8-SNAPSHOT
[INFO] ------------------------------------------------------------------------
[WARNING] The POM for org.apache.directory.shared:shared-ldap:jar:1.0.0-M1-SNAPSHOT is missing,
no dependency information available
[INFO] 
[INFO] --- maven-remote-resources-plugin:1.1:process (default) @ apacheds-protocol-dhcp ---
[INFO] Setting property: classpath.resource.loader.class => 'org.codehaus.plexus.velocity.ContextClassLoaderResourceLoader'.
[INFO] Setting property: velocimacro.messages.on => 'false'.
[INFO] Setting property: resource.loader => 'classpath'.
[INFO] Setting property: resource.manager.logwhenfound => 'false'.
[WARNING] Missing POM for org.apache.directory.shared:shared-ldap:jar:1.0.0-M1-SNAPSHOT
[INFO] 
[INFO] --- maven-resources-plugin:2.4.3:resources (default-resources) @ apacheds-protocol-dhcp
---
[INFO] Using 'UTF-8' encoding to copy filtered resources.
[INFO] Copying 0 resource
[INFO] Copying 3 resources
[INFO] 
[INFO] --- maven-compiler-plugin:2.3.2:compile (default-compile) @ apacheds-protocol-dhcp
---
[INFO] Compiling 116 source files to /srv/gump/public/workspace/apacheds/protocol-dhcp/target/classes
[INFO] -------------------------------------------------------------
[ERROR] COMPILATION ERROR : 
[INFO] -------------------------------------------------------------
[ERROR] /srv/gump/public/workspace/apacheds/protocol-dhcp/src/main/java/org/apache/directory/server/dhcp/store/SimpleDhcpStore.java:[46,55]
package org.apache.directory.shared.ldap.model.constants does not exist
[ERROR] /srv/gump/public/workspace/apacheds/protocol-dhcp/src/main/java/org/apache/directory/server/dhcp/store/SimpleDhcpStore.java:[136,57]
cannot find symbol
symbol  : variable SchemaConstants
location: class org.apache.directory.server.dhcp.store.SimpleDhcpStore
[INFO] 2 errors 
[INFO] -------------------------------------------------------------
[INFO] ------------------------------------------------------------------------
[INFO] BUILD FAILURE
[INFO] ------------------------------------------------------------------------
[INFO] Total time: 6.999s
[INFO] Finished at: Tue Feb 15 01:53:02 UTC 2011
[INFO] Final Memory: 11M/28M
[INFO] ------------------------------------------------------------------------
[ERROR] Failed to execute goal org.apache.maven.plugins:maven-compiler-plugin:2.3.2:compile
(default-compile) on project apacheds-protocol-dhcp: Compilation failure: Compilation failure:
[ERROR] /srv/gump/public/workspace/apacheds/protocol-dhcp/src/main/java/org/apache/directory/server/dhcp/store/SimpleDhcpStore.java:[46,55]
package org.apache.directory.shared.ldap.model.constants does not exist
[ERROR] /srv/gump/public/workspace/apacheds/protocol-dhcp/src/main/java/org/apache/directory/server/dhcp/store/SimpleDhcpStore.java:[136,57]
cannot find symbol
[ERROR] symbol  : variable SchemaConstants
[ERROR] location: class org.apache.directory.server.dhcp.store.SimpleDhcpStore
[ERROR] -> [Help 1]
[ERROR] 
[ERROR] To see the full stack trace of the errors, re-run Maven with the -e switch.
[ERROR] Re-run Maven using the -X switch to enable full debug logging.
[ERROR] 
[ERROR] For more information about the errors and possible solutions, please read the following
articles:
[ERROR] [Help 1] http://cwiki.apache.org/confluence/display/MAVEN/MojoFailureException
---------------------------------------------

To subscribe to this information via syndicated feeds:
- RSS: http://vmgump.apache.org/gump/public/apacheds/apacheds-protocol-dhcp/rss.xml
- Atom: http://vmgump.apache.org/gump/public/apacheds/apacheds-protocol-dhcp/atom.xml

============================== Gump Tracking Only ===
Produced by Apache Gump(TM) version 2.3.
Gump Run 06001814022011, vmgump.apache.org:vmgump:06001814022011
Gump E-mail Identifier (unique within run) #7.

*********************************************************** G U M P
[GUMP@vmgump]: Project apacheds-kerberos-codec (in module apacheds) failed
To whom it may engage...
        
This is an automated request, but not an unsolicited one. For 
more information please visit http://gump.apache.org/nagged.html, 
and/or contact the folk at general@gump.apache.org.

Project apacheds-kerberos-codec has an issue affecting its community integration.
This issue affects 1 projects.
The current state of this project is 'Failed', with reason 'Build Failed'.
For reference only, the following projects are affected by this:
    - apacheds-kerberos-codec :  Apache Directory Server


Full details are available at:
    http://vmgump.apache.org/gump/public/apacheds/apacheds-kerberos-codec/index.html

That said, some information snippets are provided here.

The following annotations (debug/informational/warning/error messages) were provided:
 -DEBUG- Sole jar output [apacheds-kerberos-codec-*[0-9T].jar] identifier set to project name
 -INFO- Optional dependency apacheds-protocol-shared prerequisite failed with reason build
failed
 -DEBUG- (Apache Gump generated) Apache Maven Settings in: /srv/gump/public/workspace/apacheds/kerberos-codec/gump_mvn_settings.xml
 -INFO- Failed with reason build failed
 -DEBUG- Maven POM in: /srv/gump/public/workspace/apacheds/kerberos-codec/pom.xml
 -INFO- Failed to extract fallback artifacts from Gump Repository



The following work was performed:
http://vmgump.apache.org/gump/public/apacheds/apacheds-kerberos-codec/gump_work/build_apacheds_apacheds-kerberos-codec.html
Work Name: build_apacheds_apacheds-kerberos-codec (Type: Build)
Work ended in a state of : Failed
Elapsed: 4 secs
Command Line: /opt/maven3/bin/mvn --batch-mode --settings /srv/gump/public/workspace/apacheds/kerberos-codec/gump_mvn_settings.xml
install 
[Working Directory: /srv/gump/public/workspace/apacheds/kerberos-codec]
M2_HOME: /opt/maven3
---------------------------------------------
[INFO] Scanning for projects...
[INFO]                                                                         
[INFO] ------------------------------------------------------------------------
[INFO] Building ApacheDS Protocol Kerberos Codec 1.5.8-SNAPSHOT
[INFO] ------------------------------------------------------------------------
[WARNING] The POM for org.apache.directory.shared:ldap-client-api:jar:1.0.0-M1-SNAPSHOT is
missing, no dependency information available
[WARNING] The POM for org.apache.directory.shared:shared-asn1-api:jar:1.0.0-M1-SNAPSHOT is
missing, no dependency information available
[WARNING] The POM for org.apache.directory.shared:shared-i18n:jar:1.0.0-M1-SNAPSHOT is missing,
no dependency information available
[WARNING] The POM for org.apache.directory.shared:shared-ldap:jar:1.0.0-M1-SNAPSHOT is missing,
no dependency information available
[WARNING] The POM for org.apache.directory.shared:shared-ldap-codec:jar:1.0.0-M1-SNAPSHOT
is missing, no dependency information available
[WARNING] The POM for org.apache.directory.shared:shared-ldap-model:jar:1.0.0-M1-SNAPSHOT
is missing, no dependency information available
[WARNING] The POM for org.apache.directory.shared:shared-ldap-schema:jar:1.0.0-M1-SNAPSHOT
is missing, no dependency information available
[WARNING] The POM for org.apache.directory.shared:shared-util:jar:1.0.0-M1-SNAPSHOT is missing,
no dependency information available
Downloading: http://localhost:8192/repo/m2-snapshot-repository/org/apache/directory/server/apacheds-protocol-shared/1.5.8-SNAPSHOT/maven-metadata.xml
Downloading: http://localhost:8192/repo/m2-snapshot-repository/org/apache/directory/server/apacheds-protocol-shared/1.5.8-SNAPSHOT/apacheds-protocol-shared-1.5.8-SNAPSHOT.pom
[WARNING] The POM for org.apache.directory.server:apacheds-protocol-shared:jar:1.5.8-SNAPSHOT
is missing, no dependency information available
Downloading: http://localhost:8192/repo/m2-snapshot-repository/org/apache/directory/shared/shared-asn1-ber/1.0.0-M1-SNAPSHOT/maven-metadata.xml
Downloading: http://localhost:8192/repo/m2-snapshot-repository/org/apache/directory/shared/shared-asn1-ber/1.0.0-M1-SNAPSHOT/shared-asn1-ber-1.0.0-M1-SNAPSHOT.pom
[WARNING] The POM for org.apache.directory.shared:shared-asn1-ber:jar:1.0.0-M1-SNAPSHOT is
missing, no dependency information available
Downloading: http://localhost:8192/repo/m2-snapshot-repository/org/apache/directory/server/apacheds-protocol-shared/1.5.8-SNAPSHOT/apacheds-protocol-shared-1.5.8-SNAPSHOT.jar
Downloading: http://localhost:8192/repo/m2-snapshot-repository/org/apache/directory/shared/shared-asn1-ber/1.0.0-M1-SNAPSHOT/shared-asn1-ber-1.0.0-M1-SNAPSHOT.jar
Downloaded: http://localhost:8192/repo/m2-snapshot-repository/org/apache/directory/shared/shared-asn1-ber/1.0.0-M1-SNAPSHOT/shared-asn1-ber-1.0.0-M1-SNAPSHOT.jar
(42 KB at 281.3 KB/sec)
[INFO] ------------------------------------------------------------------------
[INFO] BUILD FAILURE
[INFO] ------------------------------------------------------------------------
[INFO] Total time: 2.773s
[INFO] Finished at: Tue Feb 15 01:54:51 UTC 2011
[INFO] Final Memory: 4M/15M
[INFO] ------------------------------------------------------------------------
[ERROR] Failed to execute goal on project apacheds-kerberos-codec: Could not resolve dependencies
for project org.apache.directory.server:apacheds-kerberos-codec:jar:1.5.8-SNAPSHOT: Could
not find artifact org.apache.directory.server:apacheds-protocol-shared:jar:1.5.8-SNAPSHOT
in gump-apache.snapshots (http://localhost:8192/repo/m2-snapshot-repository) -> [Help 1]
[ERROR] 
[ERROR] To see the full stack trace of the errors, re-run Maven with the -e switch.
[ERROR] Re-run Maven using the -X switch to enable full debug logging.
[ERROR] 
[ERROR] For more information about the errors and possible solutions, please read the following
articles:
[ERROR] [Help 1] http://cwiki.apache.org/confluence/display/MAVEN/DependencyResolutionException
---------------------------------------------

To subscribe to this information via syndicated feeds:
- RSS: http://vmgump.apache.org/gump/public/apacheds/apacheds-kerberos-codec/rss.xml
- Atom: http://vmgump.apache.org/gump/public/apacheds/apacheds-kerberos-codec/atom.xml

============================== Gump Tracking Only ===
Produced by Apache Gump(TM) version 2.3.
Gump Run 06001814022011, vmgump.apache.org:vmgump:06001814022011
Gump E-mail Identifier (unique within run) #8.


--
Apache Gump
http://gump.apache.org/ [Instance: vmgump]

---------------------------------------------------------------------
To unsubscribe, e-mail: general-unsubscribe@gump.apache.org
For additional commands, e-mail: general-help@gump.apache.org


Mime
View raw message