gump-general mailing list archives

Site index · List index
Message view « Date » · « Thread »
Top « Date » · « Thread »
From g...@vmgump.apache.org
Subject BATCH: All dressed up, with nowhere to go...
Date Thu, 03 Feb 2011 03:03:32 GMT
Dear Gumpmeisters,
            
The following 3 notifys should have been sent

*********************************************************** G U M P
[GUMP@vmgump]: Project directory-junit-addons-pom (in module directory-junit-addons) failed
[GUMP@vmgump]: Project apacheds-jdbm (in module apacheds) failed
[GUMP@vmgump]: Project apacheds-protocol-dhcp (in module apacheds) failed
*********************************************************** G U M P
[GUMP@vmgump]: Project directory-junit-addons-pom (in module directory-junit-addons) failed
To whom it may engage...
        
This is an automated request, but not an unsolicited one. For 
more information please visit http://gump.apache.org/nagged.html, 
and/or contact the folk at general@gump.apache.org.

Project directory-junit-addons-pom has an issue affecting its community integration.
This issue affects 56 projects.
The current state of this project is 'Failed', with reason 'Build Failed'.
For reference only, the following projects are affected by this:
    - apacheds-all :  Apache Directory Server
    - apacheds-core :  Apache Directory Server
    - apacheds-core-annotations :  Apache Directory Server
    - apacheds-core-annotations-test :  Apache Directory Server
    - apacheds-core-api :  Apache Directory Server
    - apacheds-core-api-test :  Apache Directory Server
    - apacheds-core-avl :  Apache Directory Server
    - apacheds-core-integ :  Apache Directory Server
    - apacheds-core-integ-test :  Apache Directory Server
    - apacheds-core-jndi :  Apache Directory Server
    - apacheds-http-directory-bridge :  Apache Directory Server
    - apacheds-http-integration :  Apache Directory Server
    - apacheds-i18n :  Apache Directory Server
    - apacheds-interceptor-kerberos :  Apache Directory Server
    - apacheds-jdbm-partition :  Apache Directory Server
    - apacheds-kerberos-codec :  Apache Directory Server
    - apacheds-kerberos-test :  Apache Directory Server
    - apacheds-ldap-client-test :  Apache Directory Server
    - apacheds-ldif-partition :  Apache Directory Server
    - apacheds-protocol-changepw :  Apache Directory Server
    - apacheds-protocol-dns :  Apache Directory Server
    - apacheds-protocol-kerberos :  Apache Directory Server
    - apacheds-protocol-kerberos-test :  Apache Directory Server
    - apacheds-protocol-ldap :  Apache Directory Server
    - apacheds-protocol-ntp :  Apache Directory Server
    - apacheds-protocol-ntp-test :  Apache Directory Server
    - apacheds-protocol-shared :  Apache Directory Server
    - apacheds-server-annotations :  Apache Directory Server
    - apacheds-server-config :  Apache Directory Server
    - apacheds-server-integ :  Apache Directory Server
    - apacheds-server-integ-test :  Apache Directory Server
    - apacheds-server-jndi :  Apache Directory Server
    - apacheds-server-replication :  Apache Directory Server
    - apacheds-server-tools :  Apache Directory Server
    - apacheds-service :  Apache Directory Server
    - apacheds-service-builder :  Apache Directory Server
    - apacheds-test-framework :  Apache Directory Server
    - apacheds-wrapper :  Apache Directory Server
    - apacheds-xdbm-partition :  Apache Directory Server
    - apacheds-xdbm-tools :  Apache Directory Server
    - directory-junit-addons :  Junit Apache Directory Libraries
    - directory-junit-addons-pom :  Junit Apache Directory Libraries
    - ldap-client-api :  Shared Apache Directory Libraries
    - shared-all :  Shared Apache Directory Libraries
    - shared-asn1-api :  Shared Apache Directory Libraries
    - shared-asn1-ber :  Shared Apache Directory Libraries
    - shared-dsml-engine :  Shared Apache Directory Libraries
    - shared-dsml-parser :  Shared Apache Directory Libraries
    - shared-i18n :  Shared Apache Directory Libraries
    - shared-integ :  Shared Apache Directory Libraries
    - shared-ldap :  Shared Apache Directory Libraries
    - shared-ldap-schema :  Shared Apache Directory Libraries
    - shared-ldap-schema-converter :  Shared Apache Directory Libraries
    - shared-ldap-test :  Shared Apache Directory Libraries
    - shared-util :  Shared Apache Directory Libraries
    - syncrepl :  Apache Directory Server


Full details are available at:
    http://vmgump.apache.org/gump/public/directory-junit-addons/directory-junit-addons-pom/index.html

That said, some information snippets are provided here.

The following annotations (debug/informational/warning/error messages) were provided:
 -DEBUG- (Apache Gump generated) Apache Maven Settings in: /srv/gump/public/workspace/directory-junit-addons/gump_mvn_settings.xml
 -INFO- Failed with reason build failed
 -DEBUG- Maven POM in: /srv/gump/public/workspace/directory-junit-addons/pom.xml
 -DEBUG- Extracted fallback artifacts from Gump Repository



The following work was performed:
http://vmgump.apache.org/gump/public/directory-junit-addons/directory-junit-addons-pom/gump_work/build_directory-junit-addons_directory-junit-addons-pom.html
Work Name: build_directory-junit-addons_directory-junit-addons-pom (Type: Build)
Work ended in a state of : Failed
Elapsed: 13 secs
Command Line: mvn --batch-mode -Dpackaging=pom -DgroupId=org.apache.directory.junit -Dfile=pom.xml
-DartifactId=directory-junit-addons -Dversion=0.1-SNAPSHOT --settings /srv/gump/public/workspace/directory-junit-addons/gump_mvn_settings.xml
install:install-file 
[Working Directory: /srv/gump/public/workspace/directory-junit-addons]
---------------------------------------------
[INFO] Scanning for projects...
Downloading: http://localhost:8192/maven2/org/apache/directory/project/project/19/project-19.pom

Downloading: http://localhost:8192/maven2/org/apache/apache/8/apache-8.pom

Downloading: http://localhost:8192/maven2/org/apache/maven/plugins/maven-remote-resources-plugin/1.1/maven-remote-resources-plugin-1.1.pom

Downloading: http://localhost:8192/maven2/org/apache/maven/plugins/maven-plugins/14/maven-plugins-14.pom

Downloading: http://localhost:8192/maven2/org/apache/maven/maven-parent/13/maven-parent-13.pom

Downloading: http://localhost:8192/maven2/org/apache/apache/6/apache-6.pom

Downloading: http://localhost:8192/maven2/org/apache/maven/plugins/maven-remote-resources-plugin/1.1/maven-remote-resources-plugin-1.1.jar

Downloading: http://localhost:8192/maven2/org/apache/geronimo/genesis/plugins/tools-maven-plugin/1.4/tools-maven-plugin-1.4.pom

Downloading: http://localhost:8192/maven2/org/apache/geronimo/genesis/plugins/plugins/1.4/plugins-1.4.pom

Downloading: http://localhost:8192/maven2/org/apache/geronimo/genesis/genesis/1.4/genesis-1.4.pom

Downloading: http://localhost:8192/maven2/org/apache/apache/3/apache-3.pom

Downloading: http://localhost:8192/maven2/org/apache/geronimo/genesis/plugins/tools-maven-plugin/1.4/tools-maven-plugin-1.4.jar

Downloading: http://localhost:8192/maven2/org/apache/maven/plugins/maven-site-plugin/3.0-beta-3/maven-site-plugin-3.0-beta-3.pom

Downloading: http://localhost:8192/maven2/org/apache/maven/plugins/maven-plugins/18/maven-plugins-18.pom

Downloading: http://localhost:8192/maven2/org/apache/maven/maven-parent/16/maven-parent-16.pom

Downloading: http://localhost:8192/maven2/org/apache/apache/7/apache-7.pom

[INFO] ------------------------------------------------------------------------
[ERROR] BUILD ERROR
[INFO] ------------------------------------------------------------------------
[INFO] Error resolving version for 'org.apache.maven.plugins:maven-site-plugin': Plugin requires
Maven version 3.0
[INFO] ------------------------------------------------------------------------
[INFO] For more information, run Maven with the -e switch
[INFO] ------------------------------------------------------------------------
[INFO] Total time: 12 seconds
[INFO] Finished at: Wed Feb 02 18:07:08 UTC 2011
[INFO] Final Memory: 3M/15M
[INFO] ------------------------------------------------------------------------
---------------------------------------------

To subscribe to this information via syndicated feeds:
- RSS: http://vmgump.apache.org/gump/public/directory-junit-addons/directory-junit-addons-pom/rss.xml
- Atom: http://vmgump.apache.org/gump/public/directory-junit-addons/directory-junit-addons-pom/atom.xml

============================== Gump Tracking Only ===
Produced by Apache Gump(TM) version 2.3.
Gump Run 08001802022011, vmgump.apache.org:vmgump:08001802022011
Gump E-mail Identifier (unique within run) #1.

*********************************************************** G U M P
[GUMP@vmgump]: Project apacheds-jdbm (in module apacheds) failed
To whom it may engage...
        
This is an automated request, but not an unsolicited one. For 
more information please visit http://gump.apache.org/nagged.html, 
and/or contact the folk at general@gump.apache.org.

Project apacheds-jdbm has an issue affecting its community integration.
This issue affects 1 projects.
The current state of this project is 'Failed', with reason 'Build Failed'.
For reference only, the following projects are affected by this:
    - apacheds-jdbm :  Apache Directory Server


Full details are available at:
    http://vmgump.apache.org/gump/public/apacheds/apacheds-jdbm/index.html

That said, some information snippets are provided here.

The following annotations (debug/informational/warning/error messages) were provided:
 -DEBUG- Sole jar output [apacheds-jdbm-*[0-9T].jar] identifier set to project name
 -INFO- Optional dependency apacheds-i18n prerequisite failed with reason build failed
 -DEBUG- (Apache Gump generated) Apache Maven Settings in: /srv/gump/public/workspace/apacheds/jdbm/gump_mvn_settings.xml
 -INFO- Failed with reason build failed
 -DEBUG- Maven POM in: /srv/gump/public/workspace/apacheds/jdbm/pom.xml
 -INFO- Failed to extract fallback artifacts from Gump Repository



The following work was performed:
http://vmgump.apache.org/gump/public/apacheds/apacheds-jdbm/gump_work/build_apacheds_apacheds-jdbm.html
Work Name: build_apacheds_apacheds-jdbm (Type: Build)
Work ended in a state of : Failed
Elapsed: 5 secs
Command Line: /opt/maven3/bin/mvn --batch-mode --settings /srv/gump/public/workspace/apacheds/jdbm/gump_mvn_settings.xml
install 
[Working Directory: /srv/gump/public/workspace/apacheds/jdbm]
M2_HOME: /opt/maven3
---------------------------------------------
[INFO] Scanning for projects...
[INFO]                                                                         
[INFO] ------------------------------------------------------------------------
[INFO] Building ApacheDS JDBM implementation 1.5.8-SNAPSHOT
[INFO] ------------------------------------------------------------------------
Downloading: http://localhost:8192/repo/m2-snapshot-repository/org/apache/directory/junit/junit-addons/0.1-SNAPSHOT/maven-metadata.xml
Downloading: http://localhost:8192/repo/m2-snapshot-repository/org/apache/directory/junit/junit-addons/0.1-SNAPSHOT/junit-addons-0.1-SNAPSHOT.pom
[WARNING] The POM for org.apache.directory.junit:junit-addons:jar:0.1-SNAPSHOT is missing,
no dependency information available
Downloading: http://localhost:8192/repo/m2-snapshot-repository/org/apache/directory/server/apacheds-i18n/1.5.8-SNAPSHOT/maven-metadata.xml
Downloading: http://localhost:8192/repo/m2-snapshot-repository/org/apache/directory/server/apacheds-i18n/1.5.8-SNAPSHOT/apacheds-i18n-1.5.8-SNAPSHOT.pom
[WARNING] The POM for org.apache.directory.server:apacheds-i18n:jar:1.5.8-SNAPSHOT is missing,
no dependency information available
Downloading: http://localhost:8192/maven2/findbugs/annotations/1.0.0/annotations-1.0.0.pom
Downloaded: http://localhost:8192/maven2/findbugs/annotations/1.0.0/annotations-1.0.0.pom
(376 B at 0.4 KB/sec)
Downloading: http://localhost:8192/repo/m2-snapshot-repository/org/slf4j/slf4j-parent/1.5.9-SNAPSHOT/maven-metadata.xml
Downloading: http://localhost:8192/repo/m2-snapshot-repository/org/apache/directory/junit/junit-addons/0.1-SNAPSHOT/junit-addons-0.1-SNAPSHOT.jar
Downloading: http://localhost:8192/repo/m2-snapshot-repository/org/apache/directory/server/apacheds-i18n/1.5.8-SNAPSHOT/apacheds-i18n-1.5.8-SNAPSHOT.jar
Downloading: http://localhost:8192/maven2/findbugs/annotations/1.0.0/annotations-1.0.0.jar
Downloaded: http://localhost:8192/maven2/findbugs/annotations/1.0.0/annotations-1.0.0.jar
(27 KB at 78.6 KB/sec)
[INFO] ------------------------------------------------------------------------
[INFO] BUILD FAILURE
[INFO] ------------------------------------------------------------------------
[INFO] Total time: 2.935s
[INFO] Finished at: Thu Feb 03 01:54:22 UTC 2011
[INFO] Final Memory: 3M/15M
[INFO] ------------------------------------------------------------------------
[ERROR] Failed to execute goal on project apacheds-jdbm: Could not resolve dependencies for
project org.apache.directory.server:apacheds-jdbm:jar:1.5.8-SNAPSHOT: The following artifacts
could not be resolved: org.apache.directory.junit:junit-addons:jar:0.1-SNAPSHOT, org.apache.directory.server:apacheds-i18n:jar:1.5.8-SNAPSHOT:
Could not find artifact org.apache.directory.junit:junit-addons:jar:0.1-SNAPSHOT in gump-apache.snapshots
(http://localhost:8192/repo/m2-snapshot-repository) -> [Help 1]
[ERROR] 
[ERROR] To see the full stack trace of the errors, re-run Maven with the -e switch.
[ERROR] Re-run Maven using the -X switch to enable full debug logging.
[ERROR] 
[ERROR] For more information about the errors and possible solutions, please read the following
articles:
[ERROR] [Help 1] http://cwiki.apache.org/confluence/display/MAVEN/DependencyResolutionException
---------------------------------------------

To subscribe to this information via syndicated feeds:
- RSS: http://vmgump.apache.org/gump/public/apacheds/apacheds-jdbm/rss.xml
- Atom: http://vmgump.apache.org/gump/public/apacheds/apacheds-jdbm/atom.xml

============================== Gump Tracking Only ===
Produced by Apache Gump(TM) version 2.3.
Gump Run 08001802022011, vmgump.apache.org:vmgump:08001802022011
Gump E-mail Identifier (unique within run) #2.

*********************************************************** G U M P
[GUMP@vmgump]: Project apacheds-protocol-dhcp (in module apacheds) failed
To whom it may engage...
        
This is an automated request, but not an unsolicited one. For 
more information please visit http://gump.apache.org/nagged.html, 
and/or contact the folk at general@gump.apache.org.

Project apacheds-protocol-dhcp has an issue affecting its community integration.
This issue affects 1 projects.
The current state of this project is 'Failed', with reason 'Build Failed'.
For reference only, the following projects are affected by this:
    - apacheds-protocol-dhcp :  Apache Directory Server


Full details are available at:
    http://vmgump.apache.org/gump/public/apacheds/apacheds-protocol-dhcp/index.html

That said, some information snippets are provided here.

The following annotations (debug/informational/warning/error messages) were provided:
 -DEBUG- Sole jar output [apacheds-protocol-dhcp-*[0-9T].jar] identifier set to project name
 -INFO- Optional dependency apacheds-protocol-shared prerequisite failed with reason build
failed
 -DEBUG- (Apache Gump generated) Apache Maven Settings in: /srv/gump/public/workspace/apacheds/protocol-dhcp/gump_mvn_settings.xml
 -INFO- Failed with reason build failed
 -DEBUG- Maven POM in: /srv/gump/public/workspace/apacheds/protocol-dhcp/pom.xml
 -INFO- Failed to extract fallback artifacts from Gump Repository



The following work was performed:
http://vmgump.apache.org/gump/public/apacheds/apacheds-protocol-dhcp/gump_work/build_apacheds_apacheds-protocol-dhcp.html
Work Name: build_apacheds_apacheds-protocol-dhcp (Type: Build)
Work ended in a state of : Failed
Elapsed: 5 secs
Command Line: /opt/maven3/bin/mvn --batch-mode --settings /srv/gump/public/workspace/apacheds/protocol-dhcp/gump_mvn_settings.xml
install 
[Working Directory: /srv/gump/public/workspace/apacheds/protocol-dhcp]
M2_HOME: /opt/maven3
---------------------------------------------
[INFO] Scanning for projects...
[INFO]                                                                         
[INFO] ------------------------------------------------------------------------
[INFO] Building ApacheDS Protocol Dhcp 1.5.8-SNAPSHOT
[INFO] ------------------------------------------------------------------------
[WARNING] The POM for org.apache.directory.junit:junit-addons:jar:0.1-SNAPSHOT is missing,
no dependency information available
[WARNING] The POM for org.apache.directory.server:apacheds-i18n:jar:1.5.8-SNAPSHOT is missing,
no dependency information available
Downloading: http://localhost:8192/repo/m2-snapshot-repository/org/apache/directory/shared/shared-ldap/0.9.20-SNAPSHOT/maven-metadata.xml
Downloading: http://localhost:8192/repo/m2-snapshot-repository/org/apache/directory/shared/shared-ldap/0.9.20-SNAPSHOT/shared-ldap-0.9.20-SNAPSHOT.pom
[WARNING] The POM for org.apache.directory.shared:shared-ldap:jar:0.9.20-SNAPSHOT is missing,
no dependency information available
Downloading: http://localhost:8192/maven2/org/apache/mina/mina-core/2.0.2/mina-core-2.0.2.pom
Downloaded: http://localhost:8192/maven2/org/apache/mina/mina-core/2.0.2/mina-core-2.0.2.pom
(2 KB at 2.4 KB/sec)
Downloading: http://localhost:8192/maven2/org/apache/mina/mina-parent/2.0.2/mina-parent-2.0.2.pom
Downloaded: http://localhost:8192/maven2/org/apache/mina/mina-parent/2.0.2/mina-parent-2.0.2.pom
(17 KB at 23.1 KB/sec)
Downloading: http://localhost:8192/repo/m2-snapshot-repository/org/apache/directory/shared/shared-ldap/0.9.20-SNAPSHOT/shared-ldap-0.9.20-SNAPSHOT.jar
Downloading: http://localhost:8192/maven2/org/apache/mina/mina-core/2.0.2/mina-core-2.0.2.jar
Downloaded: http://localhost:8192/maven2/org/apache/mina/mina-core/2.0.2/mina-core-2.0.2.jar
(628 KB at 3002.8 KB/sec)
[INFO] ------------------------------------------------------------------------
[INFO] BUILD FAILURE
[INFO] ------------------------------------------------------------------------
[INFO] Total time: 3.849s
[INFO] Finished at: Thu Feb 03 02:03:57 UTC 2011
[INFO] Final Memory: 3M/15M
[INFO] ------------------------------------------------------------------------
[ERROR] Failed to execute goal on project apacheds-protocol-dhcp: Could not resolve dependencies
for project org.apache.directory.server:apacheds-protocol-dhcp:jar:1.5.8-SNAPSHOT: The following
artifacts could not be resolved: org.apache.directory.junit:junit-addons:jar:0.1-SNAPSHOT,
org.apache.directory.server:apacheds-i18n:jar:1.5.8-SNAPSHOT, org.apache.directory.shared:shared-ldap:jar:0.9.20-SNAPSHOT:
Failure to find org.apache.directory.junit:junit-addons:jar:0.1-SNAPSHOT in http://localhost:8192/repo/m2-snapshot-repository
was cached in the local repository, resolution will not be reattempted until the update interval
of gump-apache.snapshots has elapsed or updates are forced -> [Help 1]
[ERROR] 
[ERROR] To see the full stack trace of the errors, re-run Maven with the -e switch.
[ERROR] Re-run Maven using the -X switch to enable full debug logging.
[ERROR] 
[ERROR] For more information about the errors and possible solutions, please read the following
articles:
[ERROR] [Help 1] http://cwiki.apache.org/confluence/display/MAVEN/DependencyResolutionException
---------------------------------------------

To subscribe to this information via syndicated feeds:
- RSS: http://vmgump.apache.org/gump/public/apacheds/apacheds-protocol-dhcp/rss.xml
- Atom: http://vmgump.apache.org/gump/public/apacheds/apacheds-protocol-dhcp/atom.xml

============================== Gump Tracking Only ===
Produced by Apache Gump(TM) version 2.3.
Gump Run 08001802022011, vmgump.apache.org:vmgump:08001802022011
Gump E-mail Identifier (unique within run) #3.


--
Apache Gump
http://gump.apache.org/ [Instance: vmgump]

---------------------------------------------------------------------
To unsubscribe, e-mail: general-unsubscribe@gump.apache.org
For additional commands, e-mail: general-help@gump.apache.org


Mime
View raw message