gump-general mailing list archives

Site index · List index
Message view « Date » · « Thread »
Top « Date » · « Thread »
From g...@vmgump.apache.org
Subject BATCH: All dressed up, with nowhere to go...
Date Sat, 29 Jan 2011 02:21:41 GMT
Dear Gumpmeisters,
            
The following 6 notifys should have been sent

*********************************************************** G U M P
[GUMP@vmgump]: Project apacheds-protocol-changepw (in module apacheds) failed
[GUMP@vmgump]: Project syncrepl (in module apacheds) failed
[GUMP@vmgump]: Project apacheds-server-tools (in module apacheds) failed
[GUMP@vmgump]: Project apacheds-kerberos-test (in module apacheds) failed
[GUMP@vmgump]: Project apacheds-ldap-client-test (in module apacheds) failed
[GUMP@vmgump]: Project apacheds-server-integ-test (in module apacheds) failed
*********************************************************** G U M P
[GUMP@vmgump]: Project apacheds-protocol-changepw (in module apacheds) failed
To whom it may engage...
        
This is an automated request, but not an unsolicited one. For 
more information please visit http://gump.apache.org/nagged.html, 
and/or contact the folk at general@gump.apache.org.

Project apacheds-protocol-changepw has an issue affecting its community integration.
This issue affects 5 projects.
The current state of this project is 'Failed', with reason 'Build Failed'.
For reference only, the following projects are affected by this:
    - apacheds-all :  Apache Directory Server
    - apacheds-protocol-changepw :  Apache Directory Server
    - apacheds-service :  Apache Directory Server
    - apacheds-service-builder :  Apache Directory Server
    - apacheds-wrapper :  Apache Directory Server


Full details are available at:
    http://vmgump.apache.org/gump/public/apacheds/apacheds-protocol-changepw/index.html

That said, some information snippets are provided here.

The following annotations (debug/informational/warning/error messages) were provided:
 -DEBUG- Sole jar output [apacheds-protocol-changepw-*[0-9T].jar] identifier set to project
name
 -DEBUG- (Apache Gump generated) Apache Maven Settings in: /srv/gump/public/workspace/apacheds/protocol-changepw/gump_mvn_settings.xml
 -INFO- Failed with reason build failed
 -DEBUG- Maven POM in: /srv/gump/public/workspace/apacheds/protocol-changepw/pom.xml
 -DEBUG- Extracted fallback artifacts from Gump Repository



The following work was performed:
http://vmgump.apache.org/gump/public/apacheds/apacheds-protocol-changepw/gump_work/build_apacheds_apacheds-protocol-changepw.html
Work Name: build_apacheds_apacheds-protocol-changepw (Type: Build)
Work ended in a state of : Failed
Elapsed: 11 secs
Command Line: /opt/maven3/bin/mvn --batch-mode --settings /srv/gump/public/workspace/apacheds/protocol-changepw/gump_mvn_settings.xml
install 
[Working Directory: /srv/gump/public/workspace/apacheds/protocol-changepw]
M2_HOME: /opt/maven3
---------------------------------------------
[ERROR] location: class org.apache.directory.server.changepw.io.ChangePasswordDataDecoder
[ERROR] /srv/gump/public/workspace/apacheds/protocol-changepw/src/main/java/org/apache/directory/server/changepw/io/ChangePasswordDataDecoder.java:[77,44]
cannot find symbol
[ERROR] symbol  : variable PrincipalNameDecoder
[ERROR] location: class org.apache.directory.server.changepw.io.ChangePasswordDataDecoder
[ERROR] /srv/gump/public/workspace/apacheds/protocol-changepw/src/main/java/org/apache/directory/server/changepw/io/ChangePasswordDataDecoder.java:[80,20]
cannot find symbol
[ERROR] symbol  : class DERGeneralString
[ERROR] location: class org.apache.directory.server.changepw.io.ChangePasswordDataDecoder
[ERROR] /srv/gump/public/workspace/apacheds/protocol-changepw/src/main/java/org/apache/directory/server/changepw/io/ChangePasswordDataDecoder.java:[80,46]
cannot find symbol
[ERROR] symbol  : class DERGeneralString
[ERROR] location: class org.apache.directory.server.changepw.io.ChangePasswordDataDecoder
[ERROR] /srv/gump/public/workspace/apacheds/protocol-changepw/src/main/java/org/apache/directory/server/changepw/io/ChangePasswordErrorDecoder.java:[48,8]
cannot find symbol
[ERROR] symbol  : class ChangePasswordErrorModifier
[ERROR] location: class org.apache.directory.server.changepw.io.ChangePasswordErrorDecoder
[ERROR] /srv/gump/public/workspace/apacheds/protocol-changepw/src/main/java/org/apache/directory/server/changepw/io/ChangePasswordErrorDecoder.java:[48,51]
cannot find symbol
[ERROR] symbol  : class ChangePasswordErrorModifier
[ERROR] location: class org.apache.directory.server.changepw.io.ChangePasswordErrorDecoder
[ERROR] /srv/gump/public/workspace/apacheds/protocol-changepw/src/main/java/org/apache/directory/server/changepw/io/ChangePasswordErrorDecoder.java:[64,47]
cannot find symbol
[ERROR] symbol  : method decodeKrbError(java.nio.ByteBuffer)
[ERROR] location: class org.apache.directory.server.kerberos.protocol.KerberosDecoder
[ERROR] /srv/gump/public/workspace/apacheds/protocol-changepw/src/main/java/org/apache/directory/server/changepw/io/ChangePasswordReplyDecoder.java:[62,8]
cannot find symbol
[ERROR] symbol  : class PrivateMessageDecoder
[ERROR] location: class org.apache.directory.server.changepw.io.ChangePasswordReplyDecoder
[ERROR] /srv/gump/public/workspace/apacheds/protocol-changepw/src/main/java/org/apache/directory/server/changepw/io/ChangePasswordReplyDecoder.java:[62,51]
cannot find symbol
[ERROR] symbol  : class PrivateMessageDecoder
[ERROR] location: class org.apache.directory.server.changepw.io.ChangePasswordReplyDecoder
[ERROR] /srv/gump/public/workspace/apacheds/protocol-changepw/src/main/java/org/apache/directory/server/changepw/io/ChangePasswordReplyDecoder.java:[63,8]
cannot find symbol
[ERROR] symbol  : class PrivateMessage
[ERROR] location: class org.apache.directory.server.changepw.io.ChangePasswordReplyDecoder
[ERROR] /srv/gump/public/workspace/apacheds/protocol-changepw/src/main/java/org/apache/directory/server/changepw/io/ChangePasswordReplyDecoder.java:[66,31]
cannot find symbol
[ERROR] symbol  : method getChangePasswordReply()
[ERROR] location: class org.apache.directory.shared.kerberos.messages.ApRep
[ERROR] /srv/gump/public/workspace/apacheds/protocol-changepw/src/main/java/org/apache/directory/server/changepw/io/ChangePasswordDataEncoder.java:[50,8]
cannot find symbol
[ERROR] symbol  : class ASN1OutputStream
[ERROR] location: class org.apache.directory.server.changepw.io.ChangePasswordDataEncoder
[ERROR] /srv/gump/public/workspace/apacheds/protocol-changepw/src/main/java/org/apache/directory/server/changepw/io/ChangePasswordDataEncoder.java:[50,35]
cannot find symbol
[ERROR] symbol  : class ASN1OutputStream
[ERROR] location: class org.apache.directory.server.changepw.io.ChangePasswordDataEncoder
[ERROR] /srv/gump/public/workspace/apacheds/protocol-changepw/src/main/java/org/apache/directory/server/changepw/io/ChangePasswordDataEncoder.java:[52,8]
cannot find symbol
[ERROR] symbol  : class DERSequence
[ERROR] location: class org.apache.directory.server.changepw.io.ChangePasswordDataEncoder
[ERROR] /srv/gump/public/workspace/apacheds/protocol-changepw/src/main/java/org/apache/directory/server/changepw/io/ChangePasswordDataEncoder.java:[70,8]
cannot find symbol
[ERROR] symbol  : class ASN1OutputStream
[ERROR] location: class org.apache.directory.server.changepw.io.ChangePasswordDataEncoder
[ERROR] -> [Help 1]
[ERROR] 
[ERROR] To see the full stack trace of the errors, re-run Maven with the -e switch.
[ERROR] Re-run Maven using the -X switch to enable full debug logging.
[ERROR] 
[ERROR] For more information about the errors and possible solutions, please read the following
articles:
[ERROR] [Help 1] http://cwiki.apache.org/confluence/display/MAVEN/MojoFailureException
---------------------------------------------

To subscribe to this information via syndicated feeds:
- RSS: http://vmgump.apache.org/gump/public/apacheds/apacheds-protocol-changepw/rss.xml
- Atom: http://vmgump.apache.org/gump/public/apacheds/apacheds-protocol-changepw/atom.xml

============================== Gump Tracking Only ===
Produced by Apache Gump(TM) version 2.3.
Gump Run 05001828012011, vmgump.apache.org:vmgump:05001828012011
Gump E-mail Identifier (unique within run) #1.

*********************************************************** G U M P
[GUMP@vmgump]: Project syncrepl (in module apacheds) failed
To whom it may engage...
        
This is an automated request, but not an unsolicited one. For 
more information please visit http://gump.apache.org/nagged.html, 
and/or contact the folk at general@gump.apache.org.

Project syncrepl has an issue affecting its community integration.
This issue affects 1 projects.
The current state of this project is 'Failed', with reason 'Build Failed'.
For reference only, the following projects are affected by this:
    - syncrepl :  Apache Directory Server


Full details are available at:
    http://vmgump.apache.org/gump/public/apacheds/syncrepl/index.html

That said, some information snippets are provided here.

The following annotations (debug/informational/warning/error messages) were provided:
 -DEBUG- Sole jar output [syncrepl-*[0-9T].jar] identifier set to project name
 -DEBUG- (Apache Gump generated) Apache Maven Settings in: /srv/gump/public/workspace/apacheds/syncrepl/gump_mvn_settings.xml
 -INFO- Failed with reason build failed
 -DEBUG- Maven POM in: /srv/gump/public/workspace/apacheds/syncrepl/pom.xml
 -INFO- Failed to extract fallback artifacts from Gump Repository



The following work was performed:
http://vmgump.apache.org/gump/public/apacheds/syncrepl/gump_work/build_apacheds_syncrepl.html
Work Name: build_apacheds_syncrepl (Type: Build)
Work ended in a state of : Failed
Elapsed: 2 secs
Command Line: /opt/maven3/bin/mvn --batch-mode --settings /srv/gump/public/workspace/apacheds/syncrepl/gump_mvn_settings.xml
install 
[Working Directory: /srv/gump/public/workspace/apacheds/syncrepl]
M2_HOME: /opt/maven3
---------------------------------------------
[INFO] Scanning for projects...
[ERROR] The build could not read 1 project -> [Help 1]
[ERROR]   
[ERROR]   The project org.apache.directory.server:syncrepl:1.5.8-SNAPSHOT (/srv/gump/public/workspace/apacheds/syncrepl/pom.xml)
has 1 error
[ERROR]     'dependencies.dependency.version' for org.apache.directory.shared:ldap-client-api:jar
must be a valid version but is '${org.apache.directory.ldap.client.api.version}'. @ line 43,
column 16
[ERROR] 
[ERROR] To see the full stack trace of the errors, re-run Maven with the -e switch.
[ERROR] Re-run Maven using the -X switch to enable full debug logging.
[ERROR] 
[ERROR] For more information about the errors and possible solutions, please read the following
articles:
[ERROR] [Help 1] http://cwiki.apache.org/confluence/display/MAVEN/ProjectBuildingException
---------------------------------------------

To subscribe to this information via syndicated feeds:
- RSS: http://vmgump.apache.org/gump/public/apacheds/syncrepl/rss.xml
- Atom: http://vmgump.apache.org/gump/public/apacheds/syncrepl/atom.xml

============================== Gump Tracking Only ===
Produced by Apache Gump(TM) version 2.3.
Gump Run 05001828012011, vmgump.apache.org:vmgump:05001828012011
Gump E-mail Identifier (unique within run) #2.

*********************************************************** G U M P
[GUMP@vmgump]: Project apacheds-server-tools (in module apacheds) failed
To whom it may engage...
        
This is an automated request, but not an unsolicited one. For 
more information please visit http://gump.apache.org/nagged.html, 
and/or contact the folk at general@gump.apache.org.

Project apacheds-server-tools has an issue affecting its community integration.
This issue affects 1 projects.
The current state of this project is 'Failed', with reason 'Build Failed'.
For reference only, the following projects are affected by this:
    - apacheds-server-tools :  Apache Directory Server


Full details are available at:
    http://vmgump.apache.org/gump/public/apacheds/apacheds-server-tools/index.html

That said, some information snippets are provided here.

The following annotations (debug/informational/warning/error messages) were provided:
 -DEBUG- Sole jar output [apacheds-server-tools-*[0-9T].jar] identifier set to project name
 -DEBUG- (Apache Gump generated) Apache Maven Settings in: /srv/gump/public/workspace/apacheds/server-tools/gump_mvn_settings.xml
 -INFO- Failed with reason build failed
 -DEBUG- Maven POM in: /srv/gump/public/workspace/apacheds/server-tools/pom.xml
 -INFO- Failed to extract fallback artifacts from Gump Repository



The following work was performed:
http://vmgump.apache.org/gump/public/apacheds/apacheds-server-tools/gump_work/build_apacheds_apacheds-server-tools.html
Work Name: build_apacheds_apacheds-server-tools (Type: Build)
Work ended in a state of : Failed
Elapsed: 2 secs
Command Line: /opt/maven3/bin/mvn --batch-mode --settings /srv/gump/public/workspace/apacheds/server-tools/gump_mvn_settings.xml
install 
[Working Directory: /srv/gump/public/workspace/apacheds/server-tools]
M2_HOME: /opt/maven3
---------------------------------------------
[INFO] Scanning for projects...
[ERROR] The build could not read 1 project -> [Help 1]
[ERROR]   
[ERROR]   The project org.apache.directory.server:apacheds-server-tools:1.5.8-SNAPSHOT (/srv/gump/public/workspace/apacheds/server-tools/pom.xml)
has 1 error
[ERROR]     'dependencies.dependency.version' for org.apache.directory.daemon:daemon-bootstrappers:jar
is missing. @ line 89, column 17
[ERROR] 
[ERROR] To see the full stack trace of the errors, re-run Maven with the -e switch.
[ERROR] Re-run Maven using the -X switch to enable full debug logging.
[ERROR] 
[ERROR] For more information about the errors and possible solutions, please read the following
articles:
[ERROR] [Help 1] http://cwiki.apache.org/confluence/display/MAVEN/ProjectBuildingException
---------------------------------------------

To subscribe to this information via syndicated feeds:
- RSS: http://vmgump.apache.org/gump/public/apacheds/apacheds-server-tools/rss.xml
- Atom: http://vmgump.apache.org/gump/public/apacheds/apacheds-server-tools/atom.xml

============================== Gump Tracking Only ===
Produced by Apache Gump(TM) version 2.3.
Gump Run 05001828012011, vmgump.apache.org:vmgump:05001828012011
Gump E-mail Identifier (unique within run) #3.

*********************************************************** G U M P
[GUMP@vmgump]: Project apacheds-kerberos-test (in module apacheds) failed
To whom it may engage...
        
This is an automated request, but not an unsolicited one. For 
more information please visit http://gump.apache.org/nagged.html, 
and/or contact the folk at general@gump.apache.org.

Project apacheds-kerberos-test has an issue affecting its community integration.
This issue affects 1 projects.
The current state of this project is 'Failed', with reason 'Build Failed'.
For reference only, the following projects are affected by this:
    - apacheds-kerberos-test :  Apache Directory Server


Full details are available at:
    http://vmgump.apache.org/gump/public/apacheds/apacheds-kerberos-test/index.html

That said, some information snippets are provided here.

The following annotations (debug/informational/warning/error messages) were provided:
 -DEBUG- Sole jar output [apacheds-kerberos-test-*[0-9T].jar] identifier set to project name
 -WARNING- Bad *Optional* Dependency. Project: apacheds-apacheds-kerberos-codec : unknown
to *this* workspace
 -DEBUG- (Apache Gump generated) Apache Maven Settings in: /srv/gump/public/workspace/apacheds/kerberos-test/gump_mvn_settings.xml
 -INFO- Failed with reason build failed
 -DEBUG- Maven POM in: /srv/gump/public/workspace/apacheds/kerberos-test/pom.xml
 -INFO- Failed to extract fallback artifacts from Gump Repository



The following work was performed:
http://vmgump.apache.org/gump/public/apacheds/apacheds-kerberos-test/gump_work/build_apacheds_apacheds-kerberos-test.html
Work Name: build_apacheds_apacheds-kerberos-test (Type: Build)
Work ended in a state of : Failed
Elapsed: 23 secs
Command Line: /opt/maven3/bin/mvn --batch-mode --settings /srv/gump/public/workspace/apacheds/kerberos-test/gump_mvn_settings.xml
install 
[Working Directory: /srv/gump/public/workspace/apacheds/kerberos-test]
M2_HOME: /opt/maven3
---------------------------------------------
[INFO] 
[INFO] --- maven-resources-plugin:2.4.3:resources (default-resources) @ apacheds-kerberos-test
---
[INFO] Using 'UTF-8' encoding to copy filtered resources.
[INFO] skip non existing resourceDirectory /srv/gump/public/workspace/apacheds/kerberos-test/src/main/resources
[INFO] Copying 3 resources
[INFO] 
[INFO] --- maven-compiler-plugin:2.3.2:compile (default-compile) @ apacheds-kerberos-test
---
[INFO] No sources to compile
[INFO] 
[INFO] --- maven-resources-plugin:2.4.3:testResources (default-testResources) @ apacheds-kerberos-test
---
[INFO] Using 'UTF-8' encoding to copy filtered resources.
[INFO] Copying 2 resources
[INFO] Copying 3 resources
[INFO] 
[INFO] --- maven-compiler-plugin:2.3.2:testCompile (default-testCompile) @ apacheds-kerberos-test
---
[INFO] Compiling 2 source files to /srv/gump/public/workspace/apacheds/kerberos-test/target/test-classes
[INFO] 
[INFO] --- maven-surefire-plugin:2.6:test (default-test) @ apacheds-kerberos-test ---
[INFO] Surefire report directory: /srv/gump/public/workspace/apacheds/kerberos-test/target/surefire-reports

-------------------------------------------------------
 T E S T S
-------------------------------------------------------
Running org.apache.directory.server.kerberos.kdc.SaslGssapiBindITest
Tests run: 1, Failures: 1, Errors: 0, Skipped: 0, Time elapsed: 10.677 sec <<< FAILURE!

Results :

Failed tests: 
  testSaslGssapiBind(org.apache.directory.server.kerberos.kdc.SaslGssapiBindITest)

Tests run: 1, Failures: 1, Errors: 0, Skipped: 0

[INFO] ------------------------------------------------------------------------
[INFO] BUILD FAILURE
[INFO] ------------------------------------------------------------------------
[INFO] Total time: 21.773s
[INFO] Finished at: Sat Jan 29 01:35:42 UTC 2011
[INFO] Final Memory: 18M/49M
[INFO] ------------------------------------------------------------------------
[ERROR] Failed to execute goal org.apache.maven.plugins:maven-surefire-plugin:2.6:test (default-test)
on project apacheds-kerberos-test: There are test failures.
[ERROR] 
[ERROR] Please refer to /srv/gump/public/workspace/apacheds/kerberos-test/target/surefire-reports
for the individual test results.
[ERROR] -> [Help 1]
[ERROR] 
[ERROR] To see the full stack trace of the errors, re-run Maven with the -e switch.
[ERROR] Re-run Maven using the -X switch to enable full debug logging.
[ERROR] 
[ERROR] For more information about the errors and possible solutions, please read the following
articles:
[ERROR] [Help 1] http://cwiki.apache.org/confluence/display/MAVEN/MojoFailureException
---------------------------------------------

To subscribe to this information via syndicated feeds:
- RSS: http://vmgump.apache.org/gump/public/apacheds/apacheds-kerberos-test/rss.xml
- Atom: http://vmgump.apache.org/gump/public/apacheds/apacheds-kerberos-test/atom.xml

============================== Gump Tracking Only ===
Produced by Apache Gump(TM) version 2.3.
Gump Run 05001828012011, vmgump.apache.org:vmgump:05001828012011
Gump E-mail Identifier (unique within run) #4.

*********************************************************** G U M P
[GUMP@vmgump]: Project apacheds-ldap-client-test (in module apacheds) failed
To whom it may engage...
        
This is an automated request, but not an unsolicited one. For 
more information please visit http://gump.apache.org/nagged.html, 
and/or contact the folk at general@gump.apache.org.

Project apacheds-ldap-client-test has an issue affecting its community integration.
This issue affects 1 projects.
The current state of this project is 'Failed', with reason 'Missing Build Outputs'.
For reference only, the following projects are affected by this:
    - apacheds-ldap-client-test :  Apache Directory Server


Full details are available at:
    http://vmgump.apache.org/gump/public/apacheds/apacheds-ldap-client-test/index.html

That said, some information snippets are provided here.

The following annotations (debug/informational/warning/error messages) were provided:
 -DEBUG- Sole jar output [apacheds-ldap-client-test-*[0-9T].jar] identifier set to project
name
 -DEBUG- (Apache Gump generated) Apache Maven Settings in: /srv/gump/public/workspace/apacheds/ldap-client-test/gump_mvn_settings.xml
 -DEBUG- Maven POM in: /srv/gump/public/workspace/apacheds/ldap-client-test/pom.xml
 -INFO- Failed with reason missing build outputs
 -ERROR- Missing Output: /srv/gump/public/workspace/apacheds/ldap-client-test/target/apacheds-ldap-client-test-*[0-9T].jar
 -ERROR- See Directory Listing Work for Missing Outputs
 -INFO- Failed to extract fallback artifacts from Gump Repository



The following work was performed:
http://vmgump.apache.org/gump/public/apacheds/apacheds-ldap-client-test/gump_work/build_apacheds_apacheds-ldap-client-test.html
Work Name: build_apacheds_apacheds-ldap-client-test (Type: Build)
Work ended in a state of : Success
Elapsed: 54 secs
Command Line: /opt/maven3/bin/mvn --batch-mode --settings /srv/gump/public/workspace/apacheds/ldap-client-test/gump_mvn_settings.xml
install 
[Working Directory: /srv/gump/public/workspace/apacheds/ldap-client-test]
M2_HOME: /opt/maven3
---------------------------------------------
 T E S T S
-------------------------------------------------------
Running org.apache.directory.shared.client.api.operations.ClientAbandonRequestTest
Tests run: 1, Failures: 0, Errors: 0, Skipped: 0, Time elapsed: 11.464 sec
Running org.apache.directory.shared.client.api.operations.ClientCompareRequestTest
Tests run: 2, Failures: 0, Errors: 0, Skipped: 0, Time elapsed: 3.012 sec
Running org.apache.directory.shared.client.api.LdapConnectionTest
Tests run: 8, Failures: 0, Errors: 0, Skipped: 0, Time elapsed: 5.335 sec
Running org.apache.directory.shared.client.api.operations.ClientExtendedRequestTest
Tests run: 2, Failures: 0, Errors: 0, Skipped: 0, Time elapsed: 2.096 sec
Running org.apache.directory.shared.client.api.operations.bind.SimpleBindRequestTest
Tests run: 13, Failures: 0, Errors: 0, Skipped: 0, Time elapsed: 3.836 sec
Running org.apache.directory.shared.client.api.NetworkSchemaLoaderTest
Tests run: 1, Failures: 0, Errors: 0, Skipped: 0, Time elapsed: 2.589 sec
Running org.apache.directory.shared.client.api.operations.search.ClientSearchRequestTest
Tests run: 6, Failures: 0, Errors: 0, Skipped: 0, Time elapsed: 1.395 sec
Running org.apache.directory.shared.client.api.operations.search.SearchRequestReturningAttributesTest
Tests run: 13, Failures: 0, Errors: 0, Skipped: 0, Time elapsed: 2.795 sec
Running org.apache.directory.shared.client.api.operations.ClientModifyRequestTest
Tests run: 6, Failures: 0, Errors: 0, Skipped: 0, Time elapsed: 1.697 sec
Running org.apache.directory.shared.client.api.operations.ClientModifyDnRequestTest
Tests run: 4, Failures: 0, Errors: 0, Skipped: 0, Time elapsed: 1.339 sec
Running org.apache.directory.shared.client.api.operations.ClientAddRequestTest
Tests run: 3, Failures: 0, Errors: 0, Skipped: 0, Time elapsed: 1.663 sec
Running org.apache.directory.shared.client.api.LdapSSLConnectionTest
Tests run: 4, Failures: 0, Errors: 0, Skipped: 0, Time elapsed: 1.539 sec
Running org.apache.directory.shared.client.api.operations.ClientDeleteRequestTest
Tests run: 6, Failures: 0, Errors: 0, Skipped: 3, Time elapsed: 1.47 sec

Results :

Tests run: 69, Failures: 0, Errors: 0, Skipped: 3

[INFO] 
[INFO] --- maven-jar-plugin:2.3.1:jar (default-jar) @ ldap-client-test ---
[INFO] Building jar: /srv/gump/public/workspace/apacheds/ldap-client-test/target/ldap-client-test-1.5.8-SNAPSHOT.jar
[INFO] 
[INFO] --- tools-maven-plugin:1.4:verify-legal-files (verify-legal-files) @ ldap-client-test
---
[INFO] Checking legal files in: ldap-client-test-1.5.8-SNAPSHOT.jar
[INFO] 
[INFO] --- maven-install-plugin:2.3.1:install (default-install) @ ldap-client-test ---
[INFO] Installing /srv/gump/public/workspace/apacheds/ldap-client-test/target/ldap-client-test-1.5.8-SNAPSHOT.jar
to /srv/gump/public/workspace/mvnlocalrepo/shared/org/apache/directory/server/ldap-client-test/1.5.8-SNAPSHOT/ldap-client-test-1.5.8-SNAPSHOT.jar
[INFO] Installing /srv/gump/public/workspace/apacheds/ldap-client-test/pom.xml to /srv/gump/public/workspace/mvnlocalrepo/shared/org/apache/directory/server/ldap-client-test/1.5.8-SNAPSHOT/ldap-client-test-1.5.8-SNAPSHOT.pom
[INFO] ------------------------------------------------------------------------
[INFO] BUILD SUCCESS
[INFO] ------------------------------------------------------------------------
[INFO] Total time: 52.898s
[INFO] Finished at: Sat Jan 29 01:41:06 UTC 2011
[INFO] Final Memory: 19M/49M
[INFO] ------------------------------------------------------------------------
---------------------------------------------

To subscribe to this information via syndicated feeds:
- RSS: http://vmgump.apache.org/gump/public/apacheds/apacheds-ldap-client-test/rss.xml
- Atom: http://vmgump.apache.org/gump/public/apacheds/apacheds-ldap-client-test/atom.xml

============================== Gump Tracking Only ===
Produced by Apache Gump(TM) version 2.3.
Gump Run 05001828012011, vmgump.apache.org:vmgump:05001828012011
Gump E-mail Identifier (unique within run) #5.

*********************************************************** G U M P
[GUMP@vmgump]: Project apacheds-server-integ-test (in module apacheds) failed
To whom it may engage...
        
This is an automated request, but not an unsolicited one. For 
more information please visit http://gump.apache.org/nagged.html, 
and/or contact the folk at general@gump.apache.org.

Project apacheds-server-integ-test has an issue affecting its community integration.
This issue affects 1 projects.
The current state of this project is 'Failed', with reason 'Build Failed'.
For reference only, the following projects are affected by this:
    - apacheds-server-integ-test :  Apache Directory Server


Full details are available at:
    http://vmgump.apache.org/gump/public/apacheds/apacheds-server-integ-test/index.html

That said, some information snippets are provided here.

The following annotations (debug/informational/warning/error messages) were provided:
 -WARNING- Overriding Maven settings: [/srv/gump/public/workspace/apacheds/server-integ/gump_mvn_settings.xml]
 -DEBUG- (Apache Gump generated) Apache Maven Settings in: /srv/gump/public/workspace/apacheds/server-integ/gump_mvn_settings.xml
 -INFO- Failed with reason build failed
 -DEBUG- Maven POM in: /srv/gump/public/workspace/apacheds/server-integ/pom.xml



The following work was performed:
http://vmgump.apache.org/gump/public/apacheds/apacheds-server-integ-test/gump_work/build_apacheds_apacheds-server-integ-test.html
Work Name: build_apacheds_apacheds-server-integ-test (Type: Build)
Work ended in a state of : Failed
Elapsed: 2 mins 50 secs
Command Line: /opt/maven3/bin/mvn --batch-mode --settings /srv/gump/public/workspace/apacheds/server-integ/gump_mvn_settings.xml
package 
[Working Directory: /srv/gump/public/workspace/apacheds/server-integ]
M2_HOME: /opt/maven3
---------------------------------------------
	at java.lang.Thread.run(Thread.java:636)
java.lang.NullPointerException
	at org.apache.directory.server.operations.search.PersistentSearchIT$PSearchListener.run(PersistentSearchIT.java:615)
	at java.lang.Thread.run(Thread.java:636)
java.lang.NullPointerException
	at org.apache.directory.server.operations.search.PersistentSearchIT$PSearchListener.run(PersistentSearchIT.java:615)
	at java.lang.Thread.run(Thread.java:636)
Tests run: 294, Failures: 18, Errors: 0, Skipped: 4, Time elapsed: 159.192 sec <<<
FAILURE!

Results :

Failed tests: 
  testSaslCramMd5Bind(org.apache.directory.server.operations.bind.SaslBindIT)
  testSaslCramMd5BindBadPassword(org.apache.directory.server.operations.bind.SaslBindIT)
  testSaslDigestMd5Bind(org.apache.directory.server.operations.bind.SaslBindIT)
  testSaslGssApiBind(org.apache.directory.server.operations.bind.SaslBindIT)
  testSaslDigestMd5BindBadRealm(org.apache.directory.server.operations.bind.SaslBindIT)
  testSaslDigestMd5BindBadPassword(org.apache.directory.server.operations.bind.SaslBindIT)
  testNtlmBind(org.apache.directory.server.operations.bind.SaslBindIT)
  testGssSpnegoBind(org.apache.directory.server.operations.bind.SaslBindIT)
  testPsearchModify(org.apache.directory.server.operations.search.PersistentSearchIT)
  testPsearchModifyDn(org.apache.directory.server.operations.search.PersistentSearchIT)
  testPsearchDelete(org.apache.directory.server.operations.search.PersistentSearchIT)
  testPsearchAdd(org.apache.directory.server.operations.search.PersistentSearchIT)
  testPsearchModifyWithEC(org.apache.directory.server.operations.search.PersistentSearchIT)
  testPsearchModifyDnWithEC(org.apache.directory.server.operations.search.PersistentSearchIT)
  testPsearchDeleteWithEC(org.apache.directory.server.operations.search.PersistentSearchIT)
  testPsearchAddWithEC(org.apache.directory.server.operations.search.PersistentSearchIT)
  testPsearchAddModifyEnabledWithEC(org.apache.directory.server.operations.search.PersistentSearchIT)
  testSubentryControl(org.apache.directory.server.operations.search.SearchIT)

Tests run: 294, Failures: 18, Errors: 0, Skipped: 4

[INFO] ------------------------------------------------------------------------
[INFO] BUILD FAILURE
[INFO] ------------------------------------------------------------------------
[INFO] Total time: 2:49.146s
[INFO] Finished at: Sat Jan 29 01:44:41 UTC 2011
[INFO] Final Memory: 14M/40M
[INFO] ------------------------------------------------------------------------
[ERROR] Failed to execute goal org.apache.maven.plugins:maven-surefire-plugin:2.6:test (default-test)
on project apacheds-server-integ: There are test failures.
[ERROR] 
[ERROR] Please refer to /srv/gump/public/workspace/apacheds/server-integ/target/surefire-reports
for the individual test results.
[ERROR] -> [Help 1]
[ERROR] 
[ERROR] To see the full stack trace of the errors, re-run Maven with the -e switch.
[ERROR] Re-run Maven using the -X switch to enable full debug logging.
[ERROR] 
[ERROR] For more information about the errors and possible solutions, please read the following
articles:
[ERROR] [Help 1] http://cwiki.apache.org/confluence/display/MAVEN/MojoFailureException
---------------------------------------------

To subscribe to this information via syndicated feeds:
- RSS: http://vmgump.apache.org/gump/public/apacheds/apacheds-server-integ-test/rss.xml
- Atom: http://vmgump.apache.org/gump/public/apacheds/apacheds-server-integ-test/atom.xml

============================== Gump Tracking Only ===
Produced by Apache Gump(TM) version 2.3.
Gump Run 05001828012011, vmgump.apache.org:vmgump:05001828012011
Gump E-mail Identifier (unique within run) #6.


--
Apache Gump
http://gump.apache.org/ [Instance: vmgump]

---------------------------------------------------------------------
To unsubscribe, e-mail: general-unsubscribe@gump.apache.org
For additional commands, e-mail: general-help@gump.apache.org


Mime
View raw message