gump-general mailing list archives

Site index · List index
Message view « Date » · « Thread »
Top « Date » · « Thread »
From g...@vmgump.apache.org
Subject BATCH: All dressed up, with nowhere to go...
Date Tue, 04 Jan 2011 02:19:02 GMT
Dear Gumpmeisters,
            
The following 4 notifys should have been sent

*********************************************************** G U M P
[GUMP@vmgump]: Project doxia-parent (in module doxia) failed
[GUMP@vmgump]: Project apacheds-protocol-changepw (in module apacheds) failed
[GUMP@vmgump]: Project apacheds-server-tools (in module apacheds) failed
[GUMP@vmgump]: Project syncrepl (in module apacheds) failed
*********************************************************** G U M P
[GUMP@vmgump]: Project doxia-parent (in module doxia) failed
To whom it may engage...
        
This is an automated request, but not an unsolicited one. For 
more information please visit http://gump.apache.org/nagged.html, 
and/or contact the folk at general@gump.apache.org.

Project doxia-parent has an issue affecting its community integration.
This issue affects 17 projects.
The current state of this project is 'Failed', with reason 'Build Failed'.
For reference only, the following projects are affected by this:
    - doxia-core :  A content generation framework which aims to provide its use...
    - doxia-decoration-model :  A content generation framework which aims to provide its use...
    - doxia-logging-api :  A content generation framework which aims to provide its use...
    - doxia-module-apt :  A content generation framework which aims to provide its use...
    - doxia-module-confluence :  A content generation framework which aims to provide its
use...
    - doxia-module-docbook-simple :  A content generation framework which aims to provide
its use...
    - doxia-module-fml :  A content generation framework which aims to provide its use...
    - doxia-module-xdoc :  A content generation framework which aims to provide its use...
    - doxia-module-xhtml :  A content generation framework which aims to provide its use...
    - doxia-modules-parent :  A content generation framework which aims to provide its use...
    - doxia-parent :  A content generation framework which aims to provide its use...
    - doxia-sink-api :  Cross project build tool
    - doxia-sink-api-jar :  A content generation framework which aims to provide its use...
    - doxia-site-renderer :  A content generation framework which aims to provide its use...
    - doxia-site-renderer-test :  A content generation framework which aims to provide its
use...
    - doxia-sitetools-parent :  A content generation framework which aims to provide its use...
    - doxia-test-docs :  A content generation framework which aims to provide its use...


Full details are available at:
    http://vmgump.apache.org/gump/public/doxia/doxia-parent/index.html

That said, some information snippets are provided here.

The following annotations (debug/informational/warning/error messages) were provided:
 -DEBUG- (Apache Gump generated) Apache Maven Settings in: /srv/gump/public/workspace/doxia/doxia/gump_mvn_settings.xml
 -INFO- Failed with reason build failed
 -DEBUG- Maven POM in: /srv/gump/public/workspace/doxia/doxia/pom.xml



The following work was performed:
http://vmgump.apache.org/gump/public/doxia/doxia-parent/gump_work/build_doxia_doxia-parent.html
Work Name: build_doxia_doxia-parent (Type: Build)
Work ended in a state of : Failed
Elapsed: 1 sec
Command Line: mvn --batch-mode -Dpackaging=pom -DgroupId=gump-org.apache.maven.doxia -Dfile=pom.xml
-DartifactId=doxia -Dversion=1.1.5-SNAPSHOT --settings /srv/gump/public/workspace/doxia/doxia/gump_mvn_settings.xml
install:install-file 
[Working Directory: /srv/gump/public/workspace/doxia/doxia]
---------------------------------------------
	at org.apache.maven.cli.compat.CompatibleMain.main(CompatibleMain.java:60)
	at sun.reflect.NativeMethodAccessorImpl.invoke0(Native Method)
	at sun.reflect.NativeMethodAccessorImpl.invoke(NativeMethodAccessorImpl.java:57)
	at sun.reflect.DelegatingMethodAccessorImpl.invoke(DelegatingMethodAccessorImpl.java:43)
	at java.lang.reflect.Method.invoke(Method.java:616)
	at org.codehaus.classworlds.Launcher.launchEnhanced(Launcher.java:315)
	at org.codehaus.classworlds.Launcher.launch(Launcher.java:255)
	at org.codehaus.classworlds.Launcher.mainWithExitCode(Launcher.java:430)
	at org.codehaus.classworlds.Launcher.main(Launcher.java:375)
Caused by: org.apache.maven.project.ProjectBuildingException: Cannot find parent: org.apache.maven:maven-parent
for project: org.apache.maven.doxia:doxia:pom:1.1.5-SNAPSHOT for project org.apache.maven.doxia:doxia:pom:1.1.5-SNAPSHOT
	at org.apache.maven.project.DefaultMavenProjectBuilder.assembleLineage(DefaultMavenProjectBuilder.java:1396)
	at org.apache.maven.project.DefaultMavenProjectBuilder.buildInternal(DefaultMavenProjectBuilder.java:823)
	at org.apache.maven.project.DefaultMavenProjectBuilder.buildFromSourceFileInternal(DefaultMavenProjectBuilder.java:508)
	at org.apache.maven.project.DefaultMavenProjectBuilder.build(DefaultMavenProjectBuilder.java:200)
	at org.apache.maven.DefaultMaven.getProject(DefaultMaven.java:604)
	at org.apache.maven.DefaultMaven.collectProjects(DefaultMaven.java:487)
	at org.apache.maven.DefaultMaven.getProjects(DefaultMaven.java:391)
	... 12 more
Caused by: org.apache.maven.project.ProjectBuildingException: POM 'org.apache.maven:maven-parent'
not found in repository: Unable to download the artifact from any repository

  org.apache.maven:maven-parent:pom:19-SNAPSHOT

from the specified remote repositories:
  gump-central (http://localhost:8192/maven2)

 for project org.apache.maven:maven-parent
	at org.apache.maven.project.DefaultMavenProjectBuilder.findModelFromRepository(DefaultMavenProjectBuilder.java:605)
	at org.apache.maven.project.DefaultMavenProjectBuilder.assembleLineage(DefaultMavenProjectBuilder.java:1392)
	... 18 more
Caused by: org.apache.maven.artifact.resolver.ArtifactNotFoundException: Unable to download
the artifact from any repository

  org.apache.maven:maven-parent:pom:19-SNAPSHOT

from the specified remote repositories:
  gump-central (http://localhost:8192/maven2)


	at org.apache.maven.artifact.resolver.DefaultArtifactResolver.resolve(DefaultArtifactResolver.java:228)
	at org.apache.maven.artifact.resolver.DefaultArtifactResolver.resolve(DefaultArtifactResolver.java:90)
	at org.apache.maven.project.DefaultMavenProjectBuilder.findModelFromRepository(DefaultMavenProjectBuilder.java:558)
	... 19 more
Caused by: org.apache.maven.wagon.ResourceDoesNotExistException: Unable to download the artifact
from any repository
	at org.apache.maven.artifact.manager.DefaultWagonManager.getArtifact(DefaultWagonManager.java:404)
	at org.apache.maven.artifact.resolver.DefaultArtifactResolver.resolve(DefaultArtifactResolver.java:216)
	... 21 more
[INFO] ------------------------------------------------------------------------
[INFO] Total time: < 1 second
[INFO] Finished at: Mon Jan 03 18:05:54 UTC 2011
[INFO] Final Memory: 2M/15M
[INFO] ------------------------------------------------------------------------
---------------------------------------------

To subscribe to this information via syndicated feeds:
- RSS: http://vmgump.apache.org/gump/public/doxia/doxia-parent/rss.xml
- Atom: http://vmgump.apache.org/gump/public/doxia/doxia-parent/atom.xml

============================== Gump Tracking Only ===
Produced by Apache Gump(TM) version 2.3.
Gump Run 05001803012011, vmgump.apache.org:vmgump:05001803012011
Gump E-mail Identifier (unique within run) #1.

*********************************************************** G U M P
[GUMP@vmgump]: Project apacheds-protocol-changepw (in module apacheds) failed
To whom it may engage...
        
This is an automated request, but not an unsolicited one. For 
more information please visit http://gump.apache.org/nagged.html, 
and/or contact the folk at general@gump.apache.org.

Project apacheds-protocol-changepw has an issue affecting its community integration.
This issue affects 5 projects.
The current state of this project is 'Failed', with reason 'Build Failed'.
For reference only, the following projects are affected by this:
    - apacheds-all :  Apache Directory Server
    - apacheds-protocol-changepw :  Apache Directory Server
    - apacheds-service :  Apache Directory Server
    - apacheds-service-builder :  Apache Directory Server
    - apacheds-wrapper :  Apache Directory Server


Full details are available at:
    http://vmgump.apache.org/gump/public/apacheds/apacheds-protocol-changepw/index.html

That said, some information snippets are provided here.

The following annotations (debug/informational/warning/error messages) were provided:
 -DEBUG- Sole jar output [apacheds-protocol-changepw-*[0-9T].jar] identifier set to project
name
 -DEBUG- (Apache Gump generated) Apache Maven Settings in: /srv/gump/public/workspace/apacheds/protocol-changepw/gump_mvn_settings.xml
 -INFO- Failed with reason build failed
 -DEBUG- Maven POM in: /srv/gump/public/workspace/apacheds/protocol-changepw/pom.xml
 -DEBUG- Extracted fallback artifacts from Gump Repository



The following work was performed:
http://vmgump.apache.org/gump/public/apacheds/apacheds-protocol-changepw/gump_work/build_apacheds_apacheds-protocol-changepw.html
Work Name: build_apacheds_apacheds-protocol-changepw (Type: Build)
Work ended in a state of : Failed
Elapsed: 9 secs
Command Line: /opt/maven2/bin/mvn --batch-mode --settings /srv/gump/public/workspace/apacheds/protocol-changepw/gump_mvn_settings.xml
install 
[Working Directory: /srv/gump/public/workspace/apacheds/protocol-changepw]
M2_HOME: /opt/maven2
---------------------------------------------
location: class org.apache.directory.server.changepw.io.ChangePasswordReplyEncoder
/srv/gump/public/workspace/apacheds/protocol-changepw/src/main/java/org/apache/directory/server/changepw/io/ChangePasswordReplyEncoder.java:[56,8]
cannot find symbol
symbol  : class PrivateMessageEncoder
location: class org.apache.directory.server.changepw.io.ChangePasswordReplyEncoder
/srv/gump/public/workspace/apacheds/protocol-changepw/src/main/java/org/apache/directory/server/changepw/io/ChangePasswordReplyEncoder.java:[56,51]
cannot find symbol
symbol  : class PrivateMessageEncoder
location: class org.apache.directory.server.changepw.io.ChangePasswordReplyEncoder
/srv/gump/public/workspace/apacheds/protocol-changepw/src/main/java/org/apache/directory/server/changepw/protocol/ChangePasswordProtocolHandler.java:[153,12]
cannot find symbol
symbol  : class ChangePasswordErrorModifier
location: class org.apache.directory.server.changepw.protocol.ChangePasswordProtocolHandler
/srv/gump/public/workspace/apacheds/protocol-changepw/src/main/java/org/apache/directory/server/changepw/protocol/ChangePasswordProtocolHandler.java:[153,55]
cannot find symbol
symbol  : class ChangePasswordErrorModifier
location: class org.apache.directory.server.changepw.protocol.ChangePasswordProtocolHandler
/srv/gump/public/workspace/apacheds/protocol-changepw/src/main/java/org/apache/directory/server/changepw/protocol/ChangePasswordProtocolHandler.java:[189,16]
setErrorCode(org.apache.directory.shared.kerberos.exceptions.ErrorType) in org.apache.directory.shared.kerberos.messages.KrbError
cannot be applied to (org.apache.directory.server.changepw.exceptions.ErrorType)
/srv/gump/public/workspace/apacheds/protocol-changepw/src/main/java/org/apache/directory/server/changepw/protocol/ChangePasswordProtocolHandler.java:[191,16]
setSName(org.apache.directory.shared.kerberos.components.PrincipalName) in org.apache.directory.shared.kerberos.messages.KrbError
cannot be applied to (javax.security.auth.kerberos.KerberosPrincipal)
/srv/gump/public/workspace/apacheds/protocol-changepw/src/main/java/org/apache/directory/server/changepw/io/ChangePasswordDataDecoder.java:[77,44]
cannot find symbol
symbol  : variable PrincipalNameDecoder
location: class org.apache.directory.server.changepw.io.ChangePasswordDataDecoder
/srv/gump/public/workspace/apacheds/protocol-changepw/src/main/java/org/apache/directory/server/changepw/io/ChangePasswordErrorDecoder.java:[48,8]
cannot find symbol
symbol  : class ChangePasswordErrorModifier
location: class org.apache.directory.server.changepw.io.ChangePasswordErrorDecoder
/srv/gump/public/workspace/apacheds/protocol-changepw/src/main/java/org/apache/directory/server/changepw/io/ChangePasswordErrorDecoder.java:[48,51]
cannot find symbol
symbol  : class ChangePasswordErrorModifier
location: class org.apache.directory.server.changepw.io.ChangePasswordErrorDecoder
/srv/gump/public/workspace/apacheds/protocol-changepw/src/main/java/org/apache/directory/server/changepw/io/ChangePasswordErrorDecoder.java:[64,47]
cannot find symbol
symbol  : method decodeKrbError(java.nio.ByteBuffer)
location: class org.apache.directory.server.kerberos.protocol.KerberosDecoder
/srv/gump/public/workspace/apacheds/protocol-changepw/src/main/java/org/apache/directory/server/changepw/io/ChangePasswordReplyDecoder.java:[62,8]
cannot find symbol
symbol  : class PrivateMessageDecoder
location: class org.apache.directory.server.changepw.io.ChangePasswordReplyDecoder
/srv/gump/public/workspace/apacheds/protocol-changepw/src/main/java/org/apache/directory/server/changepw/io/ChangePasswordReplyDecoder.java:[62,51]
cannot find symbol
symbol  : class PrivateMessageDecoder
location: class org.apache.directory.server.changepw.io.ChangePasswordReplyDecoder
/srv/gump/public/workspace/apacheds/protocol-changepw/src/main/java/org/apache/directory/server/changepw/io/ChangePasswordReplyDecoder.java:[63,8]
cannot find symbol
symbol  : class PrivateMessage
location: class org.apache.directory.server.changepw.io.ChangePasswordReplyDecoder
/srv/gump/public/workspace/apacheds/protocol-changepw/src/main/java/org/apache/directory/server/changepw/io/ChangePasswordReplyDecoder.java:[66,31]
cannot find symbol
symbol  : method getChangePasswordReply()
location: class org.apache.directory.shared.kerberos.messages.ApRep
/srv/gump/public/workspace/apacheds/protocol-changepw/src/main/java/org/apache/directory/server/changepw/io/ChangePasswordDataEncoder.java:[87,50]
cannot find symbol
symbol  : variable PrincipalNameEncoder
location: class org.apache.directory.server.changepw.io.ChangePasswordDataEncoder

[INFO] ------------------------------------------------------------------------
[INFO] For more information, run Maven with the -e switch
[INFO] ------------------------------------------------------------------------
[INFO] Total time: 8 seconds
[INFO] Finished at: Tue Jan 04 01:09:57 UTC 2011
[INFO] Final Memory: 40M/95M
[INFO] ------------------------------------------------------------------------
---------------------------------------------

To subscribe to this information via syndicated feeds:
- RSS: http://vmgump.apache.org/gump/public/apacheds/apacheds-protocol-changepw/rss.xml
- Atom: http://vmgump.apache.org/gump/public/apacheds/apacheds-protocol-changepw/atom.xml

============================== Gump Tracking Only ===
Produced by Apache Gump(TM) version 2.3.
Gump Run 05001803012011, vmgump.apache.org:vmgump:05001803012011
Gump E-mail Identifier (unique within run) #7.

*********************************************************** G U M P
[GUMP@vmgump]: Project apacheds-server-tools (in module apacheds) failed
To whom it may engage...
        
This is an automated request, but not an unsolicited one. For 
more information please visit http://gump.apache.org/nagged.html, 
and/or contact the folk at general@gump.apache.org.

Project apacheds-server-tools has an issue affecting its community integration.
This issue affects 1 projects.
The current state of this project is 'Failed', with reason 'Build Failed'.
For reference only, the following projects are affected by this:
    - apacheds-server-tools :  Apache Directory Server


Full details are available at:
    http://vmgump.apache.org/gump/public/apacheds/apacheds-server-tools/index.html

That said, some information snippets are provided here.

The following annotations (debug/informational/warning/error messages) were provided:
 -DEBUG- Sole jar output [apacheds-server-tools-*[0-9T].jar] identifier set to project name
 -DEBUG- (Apache Gump generated) Apache Maven Settings in: /srv/gump/public/workspace/apacheds/server-tools/gump_mvn_settings.xml
 -INFO- Failed with reason build failed
 -DEBUG- Maven POM in: /srv/gump/public/workspace/apacheds/server-tools/pom.xml
 -INFO- Failed to extract fallback artifacts from Gump Repository



The following work was performed:
http://vmgump.apache.org/gump/public/apacheds/apacheds-server-tools/gump_work/build_apacheds_apacheds-server-tools.html
Work Name: build_apacheds_apacheds-server-tools (Type: Build)
Work ended in a state of : Failed
Elapsed: 1 sec
Command Line: /opt/maven2/bin/mvn --batch-mode --settings /srv/gump/public/workspace/apacheds/server-tools/gump_mvn_settings.xml
install 
[Working Directory: /srv/gump/public/workspace/apacheds/server-tools]
M2_HOME: /opt/maven2
---------------------------------------------
[INFO] Scanning for projects...
[INFO] ------------------------------------------------------------------------
[ERROR] FATAL ERROR
[INFO] ------------------------------------------------------------------------
[INFO] Error building POM (may not be this project's POM).


Project ID: org.apache.directory.server:apacheds-server-tools
POM Location: /srv/gump/public/workspace/apacheds/server-tools/pom.xml
Validation Messages:

    [0]  'dependencies.dependency.version' is missing for org.apache.directory.daemon:daemon-bootstrappers:jar


Reason: Failed to validate POM for project org.apache.directory.server:apacheds-server-tools
at /srv/gump/public/workspace/apacheds/server-tools/pom.xml


[INFO] ------------------------------------------------------------------------
[INFO] Trace
org.apache.maven.reactor.MavenExecutionException: Failed to validate POM for project org.apache.directory.server:apacheds-server-tools
at /srv/gump/public/workspace/apacheds/server-tools/pom.xml
	at org.apache.maven.DefaultMaven.getProjects(DefaultMaven.java:404)
	at org.apache.maven.DefaultMaven.doExecute(DefaultMaven.java:272)
	at org.apache.maven.DefaultMaven.execute(DefaultMaven.java:138)
	at org.apache.maven.cli.MavenCli.main(MavenCli.java:362)
	at org.apache.maven.cli.compat.CompatibleMain.main(CompatibleMain.java:60)
	at sun.reflect.NativeMethodAccessorImpl.invoke0(Native Method)
	at sun.reflect.NativeMethodAccessorImpl.invoke(NativeMethodAccessorImpl.java:57)
	at sun.reflect.DelegatingMethodAccessorImpl.invoke(DelegatingMethodAccessorImpl.java:43)
	at java.lang.reflect.Method.invoke(Method.java:616)
	at org.codehaus.classworlds.Launcher.launchEnhanced(Launcher.java:315)
	at org.codehaus.classworlds.Launcher.launch(Launcher.java:255)
	at org.codehaus.classworlds.Launcher.mainWithExitCode(Launcher.java:430)
	at org.codehaus.classworlds.Launcher.main(Launcher.java:375)
Caused by: org.apache.maven.project.InvalidProjectModelException: Failed to validate POM for
project org.apache.directory.server:apacheds-server-tools at /srv/gump/public/workspace/apacheds/server-tools/pom.xml
	at org.apache.maven.project.DefaultMavenProjectBuilder.processProjectLogic(DefaultMavenProjectBuilder.java:1077)
	at org.apache.maven.project.DefaultMavenProjectBuilder.buildInternal(DefaultMavenProjectBuilder.java:880)
	at org.apache.maven.project.DefaultMavenProjectBuilder.buildFromSourceFileInternal(DefaultMavenProjectBuilder.java:508)
	at org.apache.maven.project.DefaultMavenProjectBuilder.build(DefaultMavenProjectBuilder.java:200)
	at org.apache.maven.DefaultMaven.getProject(DefaultMaven.java:604)
	at org.apache.maven.DefaultMaven.collectProjects(DefaultMaven.java:487)
	at org.apache.maven.DefaultMaven.getProjects(DefaultMaven.java:391)
	... 12 more
[INFO] ------------------------------------------------------------------------
[INFO] Total time: < 1 second
[INFO] Finished at: Tue Jan 04 01:19:17 UTC 2011
[INFO] Final Memory: 3M/15M
[INFO] ------------------------------------------------------------------------
---------------------------------------------

To subscribe to this information via syndicated feeds:
- RSS: http://vmgump.apache.org/gump/public/apacheds/apacheds-server-tools/rss.xml
- Atom: http://vmgump.apache.org/gump/public/apacheds/apacheds-server-tools/atom.xml

============================== Gump Tracking Only ===
Produced by Apache Gump(TM) version 2.3.
Gump Run 05001803012011, vmgump.apache.org:vmgump:05001803012011
Gump E-mail Identifier (unique within run) #8.

*********************************************************** G U M P
[GUMP@vmgump]: Project syncrepl (in module apacheds) failed
To whom it may engage...
        
This is an automated request, but not an unsolicited one. For 
more information please visit http://gump.apache.org/nagged.html, 
and/or contact the folk at general@gump.apache.org.

Project syncrepl has an issue affecting its community integration.
This issue affects 1 projects.
The current state of this project is 'Failed', with reason 'Build Failed'.
For reference only, the following projects are affected by this:
    - syncrepl :  Apache Directory Server


Full details are available at:
    http://vmgump.apache.org/gump/public/apacheds/syncrepl/index.html

That said, some information snippets are provided here.

The following annotations (debug/informational/warning/error messages) were provided:
 -DEBUG- Sole jar output [syncrepl-*[0-9T].jar] identifier set to project name
 -DEBUG- (Apache Gump generated) Apache Maven Settings in: /srv/gump/public/workspace/apacheds/syncrepl/gump_mvn_settings.xml
 -INFO- Failed with reason build failed
 -DEBUG- Maven POM in: /srv/gump/public/workspace/apacheds/syncrepl/pom.xml
 -INFO- Failed to extract fallback artifacts from Gump Repository



The following work was performed:
http://vmgump.apache.org/gump/public/apacheds/syncrepl/gump_work/build_apacheds_syncrepl.html
Work Name: build_apacheds_syncrepl (Type: Build)
Work ended in a state of : Failed
Elapsed: 11 secs
Command Line: /opt/maven2/bin/mvn --batch-mode --settings /srv/gump/public/workspace/apacheds/syncrepl/gump_mvn_settings.xml
install 
[Working Directory: /srv/gump/public/workspace/apacheds/syncrepl]
M2_HOME: /opt/maven2
---------------------------------------------
location: class org.apache.directory.server.syncrepl.SyncreplRunnerUI
/srv/gump/public/workspace/apacheds/syncrepl/src/main/java/org/apache/directory/server/syncrepl/SyncreplRunnerUI.java:[172,26]
cannot access org.apache.directory.server.protocol.shared.DirectoryBackedService
class file for org.apache.directory.server.protocol.shared.DirectoryBackedService not found
                ldapServer.stop();
/srv/gump/public/workspace/apacheds/syncrepl/src/main/java/org/apache/directory/server/syncrepl/SyncreplRunnerUI.java:[210,22]
cannot find symbol
symbol  : method setWorkingDirectory(java.io.File)
location: interface org.apache.directory.server.core.DirectoryService
/srv/gump/public/workspace/apacheds/syncrepl/src/main/java/org/apache/directory/server/syncrepl/SyncreplRunnerUI.java:[217,42]
cannot find symbol
symbol  : class TcpTransport
location: class org.apache.directory.server.syncrepl.SyncreplRunnerUI
/srv/gump/public/workspace/apacheds/syncrepl/src/main/java/org/apache/directory/server/syncrepl/SyncreplRunnerUI.java:[222,21]
setSuffix(org.apache.directory.shared.ldap.name.DN) in org.apache.directory.server.core.partition.impl.btree.BTreePartition<java.lang.Long>
cannot be applied to (java.lang.String)
/srv/gump/public/workspace/apacheds/syncrepl/src/main/java/org/apache/directory/server/syncrepl/SyncreplRunnerUI.java:[224,21]
cannot find symbol
symbol  : method setPartitionDir(java.io.File)
location: class org.apache.directory.server.core.partition.impl.btree.jdbm.JdbmPartition
/srv/gump/public/workspace/apacheds/syncrepl/src/main/java/org/apache/directory/server/syncrepl/SyncreplRunnerUI.java:[357,41]
cannot find symbol
symbol  : method getWorkingDirectory()
location: interface org.apache.directory.server.core.DirectoryService
/srv/gump/public/workspace/apacheds/syncrepl/src/main/java/org/apache/directory/server/syncrepl/SyncreplRunnerUI.java:[358,21]
cannot find symbol
symbol  : method setWorkingDirectory(java.lang.String)
location: class org.apache.directory.server.core.partition.ldif.LdifPartition
/srv/gump/public/workspace/apacheds/syncrepl/src/main/java/org/apache/directory/server/syncrepl/SyncreplRunnerUI.java:[382,59]
cannot find symbol
symbol  : variable ExceptionUtils
location: class org.apache.directory.server.syncrepl.SyncreplRunnerUI
/srv/gump/public/workspace/apacheds/syncrepl/src/main/java/org/apache/directory/server/syncrepl/SyncreplRunnerUI.java:[397,23]
setSuffix(org.apache.directory.shared.ldap.name.DN) in org.apache.directory.server.core.partition.Partition
cannot be applied to (java.lang.String)
/srv/gump/public/workspace/apacheds/syncrepl/src/main/java/org/apache/directory/server/syncrepl/SyncreplRunnerUI.java:[399,80]
cannot find symbol
symbol  : method getWorkingDirectory()
location: interface org.apache.directory.server.core.DirectoryService
/srv/gump/public/workspace/apacheds/syncrepl/src/main/java/org/apache/directory/server/syncrepl/SyncreplRunnerUI.java:[399,45]
cannot find symbol
symbol  : method setPartitionDir(java.io.File)
location: class org.apache.directory.server.core.partition.impl.btree.jdbm.JdbmPartition
/srv/gump/public/workspace/apacheds/syncrepl/src/main/java/org/apache/directory/server/syncrepl/EntryInjector.java:[111,23]
cannot find symbol
symbol  : class SearchResponse
location: class org.apache.directory.server.syncrepl.EntryInjector
/srv/gump/public/workspace/apacheds/syncrepl/src/main/java/org/apache/directory/server/syncrepl/EntryInjector.java:[115,20]
cannot find symbol
symbol  : class SearchResponse
location: class org.apache.directory.server.syncrepl.EntryInjector
/srv/gump/public/workspace/apacheds/syncrepl/src/main/java/org/apache/directory/server/syncrepl/EntryInjector.java:[116,39]
cannot find symbol
symbol  : class SearchResultEntry
location: class org.apache.directory.server.syncrepl.EntryInjector
/srv/gump/public/workspace/apacheds/syncrepl/src/main/java/org/apache/directory/server/syncrepl/EntryInjector.java:[118,47]
cannot find symbol
symbol  : class SearchResultEntry
location: class org.apache.directory.server.syncrepl.EntryInjector

[INFO] ------------------------------------------------------------------------
[INFO] For more information, run Maven with the -e switch
[INFO] ------------------------------------------------------------------------
[INFO] Total time: 10 seconds
[INFO] Finished at: Tue Jan 04 01:21:06 UTC 2011
[INFO] Final Memory: 47M/112M
[INFO] ------------------------------------------------------------------------
---------------------------------------------

To subscribe to this information via syndicated feeds:
- RSS: http://vmgump.apache.org/gump/public/apacheds/syncrepl/rss.xml
- Atom: http://vmgump.apache.org/gump/public/apacheds/syncrepl/atom.xml

============================== Gump Tracking Only ===
Produced by Apache Gump(TM) version 2.3.
Gump Run 05001803012011, vmgump.apache.org:vmgump:05001803012011
Gump E-mail Identifier (unique within run) #9.


--
Apache Gump
http://gump.apache.org/ [Instance: vmgump]

---------------------------------------------------------------------
To unsubscribe, e-mail: general-unsubscribe@gump.apache.org
For additional commands, e-mail: general-help@gump.apache.org


Mime
View raw message