gump-general mailing list archives

Site index · List index
Message view « Date » · « Thread »
Top « Date » · « Thread »
From g...@vmgump.apache.org
Subject BATCH: All dressed up, with nowhere to go...
Date Fri, 10 Dec 2010 12:28:28 GMT
Dear Gumpmeisters,
            
The following 2 notifys should have been sent

*********************************************************** G U M P
[GUMP@vmgump]: Project camel-spring-test (in module camel) failed
[GUMP@vmgump]: Project camel-jms-test (in module camel) failed
*********************************************************** G U M P
[GUMP@vmgump]: Project camel-spring-test (in module camel) failed
To whom it may engage...
        
This is an automated request, but not an unsolicited one. For 
more information please visit http://gump.apache.org/nagged.html, 
and/or contact the folk at general@gump.apache.org.

Project camel-spring-test has an issue affecting its community integration.
This issue affects 1 projects.
The current state of this project is 'Failed', with reason 'Build Failed'.
For reference only, the following projects are affected by this:
    - camel-spring-test :  Integration framework based on known Enterprise Integration
...


Full details are available at:
    http://vmgump.apache.org/gump/public/camel/camel-spring-test/index.html

That said, some information snippets are provided here.

The following annotations (debug/informational/warning/error messages) were provided:
 -WARNING- Overriding Maven settings: [/srv/gump/public/workspace/camel/components/camel-spring/gump_mvn_settings.xml]
 -DEBUG- (Apache Gump generated) Apache Maven Settings in: /srv/gump/public/workspace/camel/components/camel-spring/gump_mvn_settings.xml
 -INFO- Failed with reason build failed
 -DEBUG- Maven POM in: /srv/gump/public/workspace/camel/components/camel-spring/pom.xml
 -INFO- Project Reports in: /srv/gump/public/workspace/camel/components/camel-spring/target/surefire-reports



The following work was performed:
http://vmgump.apache.org/gump/public/camel/camel-spring-test/gump_work/build_camel_camel-spring-test.html
Work Name: build_camel_camel-spring-test (Type: Build)
Work ended in a state of : Failed
Elapsed: 30 mins 8 secs
Command Line: /opt/maven2/bin/mvn --batch-mode --settings /srv/gump/public/workspace/camel/components/camel-spring/gump_mvn_settings.xml
test 
[Working Directory: /srv/gump/public/workspace/camel/components/camel-spring]
M2_HOME: /opt/maven2
---------------------------------------------
  testHandled(org.apache.camel.spring.processor.SpringDeadLetterChannelHandlerPolicyNewTest)
  testInheritErrorHandlerTrue(org.apache.camel.spring.processor.SpringInheritErrorHandlerTrueTest)
  testValidMessage(org.apache.camel.component.validator.ValidatorRouteTest)
  testInvalidMessage(org.apache.camel.component.validator.ValidatorRouteTest)
  testAggregateInterval(org.apache.camel.spring.processor.aggregator.SpringAggregateCompletionIntervalTest)
  testAggregateSimplePredicateEager(org.apache.camel.spring.processor.aggregator.SpringAggregateSimplePredicateEagerTest)
  testLoggingErrorHandler(org.apache.camel.spring.handler.ErrorHandlerDefinitionParserTest)
  testDefaultErrorHandler(org.apache.camel.spring.handler.ErrorHandlerDefinitionParserTest)
  testTransactionErrorHandler(org.apache.camel.spring.handler.ErrorHandlerDefinitionParserTest)
  testTXErrorHandler(org.apache.camel.spring.handler.ErrorHandlerDefinitionParserTest)
  testDeadLetterErrorHandler(org.apache.camel.spring.handler.ErrorHandlerDefinitionParserTest)
  testSendMatchingMessage(org.apache.camel.spring.processor.SpringValidateSimpleTest)
  testSendNotMatchingMessage(org.apache.camel.spring.processor.SpringValidateSimpleTest)
  testMarshalString(org.apache.camel.spring.issues.StringDataFormatTest)
  testUnMarshalString(org.apache.camel.spring.issues.StringDataFormatTest)
  testSpringRouteIsComponentAnnotated(org.apache.camel.spring.issues.contextscan2.SpringRouteIsComponentAnnotated2Test)
  testSplitUsingMethodCall(org.apache.camel.spring.processor.SpringTokenizerTest)
  testSplitNoStopOnExceptionOk(org.apache.camel.spring.processor.SpringSplitterNoStopOnExceptionTest)
  testSplitNoStopOnExceptionStop(org.apache.camel.spring.processor.SpringSplitterNoStopOnExceptionTest)
  testConvertToBytesCharset(org.apache.camel.component.properties.SpringPropertiesComponentEIPChoiceConvertBodyToTest)
  testNullBody(org.apache.camel.component.properties.SpringPropertiesComponentEIPChoiceConvertBodyToTest)
  testInterceptEndpoint(org.apache.camel.spring.processor.SpringInterceptSendToEndpointTest)
  testProduceInjectedOnce(org.apache.camel.spring.config.SpringProduceInjectedPrototypeBeanTest)
  testProduceInjectedTwice(org.apache.camel.spring.config.SpringProduceInjectedPrototypeBeanTest)
  testPreMove(org.apache.camel.spring.file.SpringFileConsumerPreMoveIssueTest)
  testOrderOK(org.apache.camel.spring.processor.onexception.RedeliveryPolicyReTest)
  testOrderERROR(org.apache.camel.spring.processor.onexception.RedeliveryPolicyReTest)
  testMessagesSentToConsumerArrive(org.apache.camel.spring.example.PojoConsumerTest)
  testTransactionRollback(org.apache.camel.spring.interceptor.SpringTransactionalClientDataWithOnExceptionAndRollbackUsingTransactedTest)
  testTransactionSuccess(org.apache.camel.spring.interceptor.SpringTransactionalClientDataWithOnExceptionAndRollbackUsingTransactedTest)
  testInterceptFile(org.apache.camel.spring.processor.SpringInterceptSendToEndpointDynamicTest)
  testNoInterceptFile(org.apache.camel.spring.processor.SpringInterceptSendToEndpointDynamicTest)
  testCBR(org.apache.camel.spring.processor.SpringCBRHeaderPredicateTest)
  testRouteBuilderRef2Test(org.apache.camel.spring.config.RouteBuilderRef2Test)

Tests run: 759, Failures: 7, Errors: 612, Skipped: 1

[INFO] ------------------------------------------------------------------------
[ERROR] BUILD FAILURE
[INFO] ------------------------------------------------------------------------
[INFO] There are test failures.

Please refer to /srv/gump/public/workspace/camel/components/camel-spring/target/surefire-reports
for the individual test results.
[INFO] ------------------------------------------------------------------------
[INFO] For more information, run Maven with the -e switch
[INFO] ------------------------------------------------------------------------
[INFO] Total time: 30 minutes 4 seconds
[INFO] Finished at: Fri Dec 10 07:09:57 UTC 2010
[INFO] Final Memory: 73M/174M
[INFO] ------------------------------------------------------------------------
---------------------------------------------

To subscribe to this information via syndicated feeds:
- RSS: http://vmgump.apache.org/gump/public/camel/camel-spring-test/rss.xml
- Atom: http://vmgump.apache.org/gump/public/camel/camel-spring-test/atom.xml

============================== Gump Tracking Only ===
Produced by Apache Gump(TM) version 2.3.
Gump Run 56001809122010, vmgump.apache.org:vmgump:56001809122010
Gump E-mail Identifier (unique within run) #1.

*********************************************************** G U M P
[GUMP@vmgump]: Project camel-jms-test (in module camel) failed
To whom it may engage...
        
This is an automated request, but not an unsolicited one. For 
more information please visit http://gump.apache.org/nagged.html, 
and/or contact the folk at general@gump.apache.org.

Project camel-jms-test has an issue affecting its community integration.
This issue affects 1 projects.
The current state of this project is 'Failed', with reason 'Build Failed'.
For reference only, the following projects are affected by this:
    - camel-jms-test :  Integration framework based on known Enterprise Integration
...


Full details are available at:
    http://vmgump.apache.org/gump/public/camel/camel-jms-test/index.html

That said, some information snippets are provided here.

The following annotations (debug/informational/warning/error messages) were provided:
 -WARNING- Overriding Maven settings: [/srv/gump/public/workspace/camel/components/camel-jms/gump_mvn_settings.xml]
 -DEBUG- (Apache Gump generated) Apache Maven Settings in: /srv/gump/public/workspace/camel/components/camel-jms/gump_mvn_settings.xml
 -INFO- Failed with reason build failed
 -DEBUG- Maven POM in: /srv/gump/public/workspace/camel/components/camel-jms/pom.xml
 -INFO- Project Reports in: /srv/gump/public/workspace/camel/components/camel-jms/target/surefire-report
 -WARNING- No directory [/srv/gump/public/workspace/camel/components/camel-jms/target/surefire-report]



The following work was performed:
http://vmgump.apache.org/gump/public/camel/camel-jms-test/gump_work/build_camel_camel-jms-test.html
Work Name: build_camel_camel-jms-test (Type: Build)
Work ended in a state of : Failed
Elapsed: 41 mins 43 secs
Command Line: /opt/maven2/bin/mvn --batch-mode --settings /srv/gump/public/workspace/camel/components/camel-jms/gump_mvn_settings.xml
test 
[Working Directory: /srv/gump/public/workspace/camel/components/camel-jms]
M2_HOME: /opt/maven2
---------------------------------------------
Tests run: 2, Failures: 0, Errors: 2, Skipped: 0, Time elapsed: 7.209 sec <<< FAILURE!
Running org.apache.camel.component.jms.JmsRouteWithCustomKeyFormatStrategyTest
Tests run: 4, Failures: 0, Errors: 0, Skipped: 0, Time elapsed: 14.735 sec
Running org.apache.camel.component.jms.issues.BruceHandlingBeanExceptionTest
Tests run: 3, Failures: 0, Errors: 0, Skipped: 0, Time elapsed: 15.135 sec
Running org.apache.camel.component.jms.ConsumeJmsMapMessageTest
Tests run: 2, Failures: 0, Errors: 0, Skipped: 0, Time elapsed: 8.599 sec
Running org.apache.camel.component.jms.tx.XMLQueueToQueueTransactionTest
Tests run: 1, Failures: 0, Errors: 1, Skipped: 0, Time elapsed: 6.292 sec <<< FAILURE!
Running org.apache.camel.component.jms.JmsRouteWithPassThroughKeyFormatStrategyTest
Tests run: 4, Failures: 0, Errors: 0, Skipped: 0, Time elapsed: 13.085 sec
Running org.apache.camel.component.jms.BrowsableQueueTest
Tests run: 1, Failures: 0, Errors: 0, Skipped: 0, Time elapsed: 8.911 sec
Running org.apache.camel.component.jms.JmsTransferExchangeTest
Tests run: 3, Failures: 0, Errors: 0, Skipped: 0, Time elapsed: 11.387 sec
Running org.apache.camel.component.jms.issues.JmsSendToAlotOfDestinationWithSameEndpointTest
Tests run: 1, Failures: 0, Errors: 1, Skipped: 0, Time elapsed: 10.577 sec <<< FAILURE!
Running org.apache.camel.component.jms.JmsRoutingSlipTest
Tests run: 1, Failures: 0, Errors: 0, Skipped: 0, Time elapsed: 6.046 sec
Running org.apache.camel.component.jms.JmsRouteUsingDifferentHeadersTest
Tests run: 1, Failures: 0, Errors: 0, Skipped: 0, Time elapsed: 6.003 sec
Running org.apache.camel.component.jms.JmsRouteToFileTest
Tests run: 1, Failures: 0, Errors: 0, Skipped: 0, Time elapsed: 5.066 sec
Running org.apache.camel.component.jms.tx.JMXTXUseOriginalBodyWithDLCErrorHandlerTest
Tests run: 3, Failures: 0, Errors: 3, Skipped: 0, Time elapsed: 12.409 sec <<< FAILURE!

Results :

Failed tests: 

Tests in error: 
  testOk(org.apache.camel.component.jms.tx.JMXTXUseOriginalBodyWithDLCErrorHandlerTest)
  testWithConstant(org.apache.camel.component.jms.tx.JMXTXUseOriginalBodyWithDLCErrorHandlerTest)
  testWithBean(org.apache.camel.component.jms.tx.JMXTXUseOriginalBodyWithDLCErrorHandlerTest)

Tests run: 330, Failures: 1, Errors: 50, Skipped: 7

[INFO] ------------------------------------------------------------------------
[ERROR] BUILD FAILURE
[INFO] ------------------------------------------------------------------------
[INFO] There are test failures.

Please refer to /srv/gump/public/workspace/camel/components/camel-jms/target/surefire-reports
for the individual test results.
[INFO] ------------------------------------------------------------------------
[INFO] For more information, run Maven with the -e switch
[INFO] ------------------------------------------------------------------------
[INFO] Total time: 41 minutes 40 seconds
[INFO] Finished at: Fri Dec 10 11:57:31 UTC 2010
[INFO] Final Memory: 47M/113M
[INFO] ------------------------------------------------------------------------
---------------------------------------------

To subscribe to this information via syndicated feeds:
- RSS: http://vmgump.apache.org/gump/public/camel/camel-jms-test/rss.xml
- Atom: http://vmgump.apache.org/gump/public/camel/camel-jms-test/atom.xml

============================== Gump Tracking Only ===
Produced by Apache Gump(TM) version 2.3.
Gump Run 56001809122010, vmgump.apache.org:vmgump:56001809122010
Gump E-mail Identifier (unique within run) #3.


--
Apache Gump
http://gump.apache.org/ [Instance: vmgump]

---------------------------------------------------------------------
To unsubscribe, e-mail: general-unsubscribe@gump.apache.org
For additional commands, e-mail: general-help@gump.apache.org


Mime
View raw message