gump-general mailing list archives

Site index · List index
Message view « Date » · « Thread »
Top « Date » · « Thread »
From g...@vmgump.apache.org
Subject BATCH: All dressed up, with nowhere to go...
Date Sat, 06 Nov 2010 21:29:32 GMT
Dear Gumpmeisters,
            
The following 32 notifys should have been sent

*********************************************************** G U M P
[GUMP@vmgump]: Project expat-configure (in module expat) failed
[GUMP@vmgump]: Project jmock2-test (in module jmock2) failed
[GUMP@vmgump]: Project lucene-java-analyzers-test (in module lucene-java) failed
[GUMP@vmgump]: Module hudson success, but with warnings.
[GUMP@vmgump]: Project santuario-tests (in module santuario) failed
[GUMP@vmgump]: Project wss4j (in module ws-wss4j) failed
[GUMP@vmgump]: Project apache-james-imap-parent (in module james-imap) failed
[GUMP@vmgump]: Project pdfbox-lucene (in module pdfbox) failed
[GUMP@vmgump]: Project ws-commons-xmlschema (in module ws-axis2-commons) failed
[GUMP@vmgump]: Project jtidy-svn (in module jtidy) failed
[GUMP@vmgump]: Project xstream-test (in module xstream) failed
[GUMP@vmgump]: Project apache-mime4j-reactor (in module james-mime4j) failed
[GUMP@vmgump]: Project commons-jci-reactor (in module apache-commons) failed
[GUMP@vmgump]: Project james-jsieve (in module james-jsieve) failed
[GUMP@vmgump]: Project castor-reactor (in module castor) failed
[GUMP@vmgump]: Project camel-spring-test (in module camel) failed
[GUMP@vmgump]: Project htmlunit (in module htmlunit) failed
[GUMP@vmgump]: Project commons-jelly-tags-ant-test (in module commons-jelly) failed
[GUMP@vmgump]: Project cocoon22-flowscript-impl (in module cocoon) failed
[GUMP@vmgump]: Project tapestry (in module tapestry) failed
[GUMP@vmgump]: Project cocoon22-reactor (in module cocoon) failed
[GUMP@vmgump]: Project ws-commons-axiom (in module ws-axis2-commons) failed
[GUMP@vmgump]: Project ws-axis2 (in module ws-axis2) failed
[GUMP@vmgump]: Project cactus-test (in module jakarta-cactus) failed
[GUMP@vmgump]: Project openjpa-kernel (in module openjpa) failed
[GUMP@vmgump]: Project syncrepl (in module apacheds) failed
[GUMP@vmgump]: Project apacheds-server-tools (in module apacheds) failed
[GUMP@vmgump]: Project portals-bridges-script-test (in module portals-bridges) failed
[GUMP@vmgump]: Project apacheds-server-config (in module apacheds) failed
[GUMP@vmgump]: Project portals-pluto-trunk-test (in module portals-pluto-trunk) failed
[GUMP@vmgump]: Project activemq-jaas (in module activemq) failed
[GUMP@vmgump]: Project james-server (in module james-server) failed
*********************************************************** G U M P
[GUMP@vmgump]: Project expat-configure (in module expat) failed
To whom it may engage...
        
This is an automated request, but not an unsolicited one. For 
more information please visit http://gump.apache.org/nagged.html, 
and/or contact the folk at general@gump.apache.org.

Project expat-configure has an issue affecting its community integration.
This issue affects 22 projects,
 and has been outstanding for 155 runs.
The current state of this project is 'Failed', with reason 'Build Failed'.
For reference only, the following projects are affected by this:
    - apache-httpd-buildconf :  Apache HTTP Server
    - apache-httpd-configure :  Apache HTTP Server
    - apache-httpd-make :  Apache HTTP Server
    - apache-httpd-make-install :  Apache HTTP Server
    - apr-configure :  Apache Portable Runtime
    - apr-iconv-buildconf :  Apache Portable Runtime
    - apr-iconv-configure :  Apache Portable Runtime
    - apr-iconv-make :  Apache Portable Runtime
    - apr-make :  Apache Portable Runtime
    - apr-make-install :  Apache Portable Runtime
    - expat :  The Expat XML Parser
    - expat-configure :  The Expat XML Parser
    - expat-make :  The Expat XML Parser
    - jakarta-tomcat-jk-native :  Connectors to various web servers
    - jakarta-tomcat-jk-native-buildconf :  Connectors to various web servers
    - jakarta-tomcat-jk-native-configure :  Connectors to various web servers
    - logging-log4cxx-ant :  Apache log4cxx
    - logging-log4cxx-ant-no_wchar_t :  Apache log4cxx
    - logging-log4cxx-ant-static :  Apache log4cxx
    - logging-log4cxx-configure :  Apache log4cxx
    - logging-log4cxx-make :  Apache log4cxx
    - logging-log4cxx-make-install :  Apache log4cxx


Full details are available at:
    http://vmgump.apache.org/gump/public/expat/expat-configure/index.html

That said, some information snippets are provided here.

The following annotations (debug/informational/warning/error messages) were provided:
 -INFO- Failed with reason build failed



The following work was performed:
http://vmgump.apache.org/gump/public/expat/expat-configure/gump_work/buildscript_expat_expat-configure.html
Work Name: buildscript_expat_expat-configure (Type: Build)
Work ended in a state of : Failed
Elapsed: 19 secs
Command Line: /srv/gump/public/workspace/expat/configure --prefix=/srv/gump/public/workspace/expat/dest-06112010 
[Working Directory: /srv/gump/public/workspace/expat]
---------------------------------------------
/srv/gump/public/workspace/expat/configure: line 3336: AC_LIBTOOL_WIN32_DLL: command not found
/srv/gump/public/workspace/expat/configure: line 3343: LTOPTIONS_VERSION: command not found
/srv/gump/public/workspace/expat/configure: line 3344: LTSUGAR_VERSION: command not found
/srv/gump/public/workspace/expat/configure: line 3345: LTVERSION_VERSION: command not found
/srv/gump/public/workspace/expat/configure: line 3346: LTOBSOLETE_VERSION: command not found
checking build system type... x86_64-unknown-linux-gnu
checking host system type... x86_64-unknown-linux-gnu
checking for gcc... gcc
checking whether the C compiler works... yes
checking for C compiler default output file name... a.out
checking for suffix of executables... 
checking whether we are cross compiling... no
checking for suffix of object files... o
checking whether we are using the GNU C compiler... yes
checking whether gcc accepts -g... yes
checking for gcc option to accept ISO C89... none needed
checking for a sed that does not truncate output... /bin/sed
/srv/gump/public/workspace/expat/configure: line 4283: syntax error near unexpected token `lt_decl_varnames,'
/srv/gump/public/workspace/expat/configure: line 4283: `lt_if_append_uniq(lt_decl_varnames, SED, , ,'
---------------------------------------------

To subscribe to this information via syndicated feeds:
- RSS: http://vmgump.apache.org/gump/public/expat/expat-configure/rss.xml
- Atom: http://vmgump.apache.org/gump/public/expat/expat-configure/atom.xml

============================== Gump Tracking Only ===
Produced by Gump version 2.3.
Gump Run 11000606112010, vmgump.apache.org:vmgump:11000606112010
Gump E-mail Identifier (unique within run) #1.

*********************************************************** G U M P
[GUMP@vmgump]: Project jmock2-test (in module jmock2) failed
To whom it may engage...
        
This is an automated request, but not an unsolicited one. For 
more information please visit http://gump.apache.org/nagged.html, 
and/or contact the folk at general@gump.apache.org.

Project jmock2-test has an issue affecting its community integration.
This issue affects 1 projects,
 and has been outstanding for 10 runs.
The current state of this project is 'Failed', with reason 'Build Failed'.
For reference only, the following projects are affected by this:
    - jmock2-test :  jMock is a library for testing Java code using mock objects.


Full details are available at:
    http://vmgump.apache.org/gump/public/jmock2/jmock2-test/index.html

That said, some information snippets are provided here.

The following annotations (debug/informational/warning/error messages) were provided:
 -INFO- Failed with reason build failed



The following work was performed:
http://vmgump.apache.org/gump/public/jmock2/jmock2-test/gump_work/build_jmock2_jmock2-test.html
Work Name: build_jmock2_jmock2-test (Type: Build)
Work ended in a state of : Failed
Elapsed: 9 secs
Command Line: /usr/lib/jvm/java-6-openjdk/bin/java -Djava.awt.headless=true -Xbootclasspath/p:/srv/gump/public/workspace/xml-xerces2/build/xercesImpl.jar:/srv/gump/public/workspace/xml-commons/java/external/build/xml-apis.jar org.apache.tools.ant.Main -Dgump.merge=/srv/gump/public/gump/work/merge.xml -Dbuild.sysclasspath=only -Dversion=06112010 run.tests 
[Working Directory: /srv/gump/public/workspace/jmock2]
CLASSPATH: /usr/lib/jvm/java-6-openjdk/lib/tools.jar:/srv/gump/public/workspace/jmock2/build/jmock-06112010/jmock-06112010.jar:/srv/gump/public/workspace/jmock2/build/jmock-06112010/jmock-junit3-06112010.jar:/srv/gump/public/workspace/jmock2/build/jmock-06112010/jmock-junit4-06112010.jar:/srv/gump/public/workspace/jmock2/build/jmock-06112010/jmock-legacy-06112010.jar:/srv/gump/public/workspace/jmock2/build/jmock-06112010/jmock-script-06112010.jar:/srv/gump/public/workspace/jmock2/build/jmock-06112010/jmock-tests-06112010.jar:/srv/gump/public/workspace/ant/dist/lib/ant.jar:/srv/gump/public/workspace/ant/dist/lib/ant-launcher.jar:/srv/gump/public/workspace/ant/dist/lib/ant-jmf.jar:/srv/gump/public/workspace/ant/dist/lib/ant-junit.jar:/srv/gump/public/workspace/ant/dist/lib/ant-swing.jar:/srv/gump/public/workspace/ant/dist/lib/ant-apache-resolver.jar:/srv/gump/public/workspace/ant/dist/lib/ant-apache-xalan2.jar:/srv/gump/packages/bsh-2.0b4/bsh-2.0b4.jar:/srv/gump/packages/bsh-2.
 0b4/bsh-bsf-2.0b4.jar:/srv/gump/packages/bsh-2.0b4/bsh-classpath-2.0b4.jar:/srv/gump/packages/bsh-2.0b4/bsh-commands-2.0b4.jar:/srv/gump/packages/bsh-2.0b4/bsh-core-2.0b4.jar:/srv/gump/packages/bsh-2.0b4/bsh-reflect-2.0b4.jar:/srv/gump/packages/bsh-2.0b4/bsh-util-2.0b4.jar:/srv/gump/packages/cglib/cglib-nodep-2.2.jar:/srv/gump/public/workspace/hamcrest/hamcrest-java/build/hamcrest-core-06112010.jar:/srv/gump/public/workspace/hamcrest/hamcrest-java/build/hamcrest-generator-06112010.jar:/srv/gump/public/workspace/hamcrest/hamcrest-java/build/hamcrest-library-06112010.jar:/srv/gump/public/workspace/hamcrest/hamcrest-java/build/hamcrest-unit-test-06112010.jar:/srv/gump/public/workspace/junit/dist/junit-06112010.jar:/srv/gump/public/workspace/junit/dist/junit-dep-06112010.jar:/srv/gump/packages/junit3.8.1/junit.jar:/srv/gump/public/workspace/xml-commons/java/external/build/xml-apis-ext.jar
---------------------------------------------
Buildfile: /srv/gump/public/workspace/jmock2/build.xml

dir.build:

compile:
    [javac] Compiling 211 source files to /srv/gump/public/workspace/jmock2/build/classes
    [javac] /srv/gump/public/workspace/jmock2/src/org/jmock/lib/legacy/ClassImposteriser.java:23: package org.objenesis does not exist
    [javac] import org.objenesis.Objenesis;
    [javac]                     ^
    [javac] /srv/gump/public/workspace/jmock2/src/org/jmock/lib/legacy/ClassImposteriser.java:24: package org.objenesis does not exist
    [javac] import org.objenesis.ObjenesisStd;
    [javac]                     ^
    [javac] /srv/gump/public/workspace/jmock2/src/org/jmock/lib/legacy/ClassImposteriser.java:50: cannot find symbol
    [javac] symbol  : class Objenesis
    [javac] location: class org.jmock.lib.legacy.ClassImposteriser
    [javac]     private final Objenesis objenesis = new ObjenesisStd();
    [javac]                   ^
    [javac] /srv/gump/public/workspace/jmock2/src/org/jmock/lib/legacy/ClassImposteriser.java:50: cannot find symbol
    [javac] symbol  : class ObjenesisStd
    [javac] location: class org.jmock.lib.legacy.ClassImposteriser
    [javac]     private final Objenesis objenesis = new ObjenesisStd();
    [javac]                                             ^
    [javac] Note: Some input files use or override a deprecated API.
    [javac] Note: Recompile with -Xlint:deprecation for details.
    [javac] 4 errors

BUILD FAILED
/srv/gump/public/workspace/jmock2/build.xml:61: Compile failed; see the compiler error output for details.

Total time: 9 seconds
---------------------------------------------

To subscribe to this information via syndicated feeds:
- RSS: http://vmgump.apache.org/gump/public/jmock2/jmock2-test/rss.xml
- Atom: http://vmgump.apache.org/gump/public/jmock2/jmock2-test/atom.xml

============================== Gump Tracking Only ===
Produced by Gump version 2.3.
Gump Run 11000606112010, vmgump.apache.org:vmgump:11000606112010
Gump E-mail Identifier (unique within run) #4.

*********************************************************** G U M P
[GUMP@vmgump]: Project lucene-java-analyzers-test (in module lucene-java) failed
To whom it may engage...
        
This is an automated request, but not an unsolicited one. For 
more information please visit http://gump.apache.org/nagged.html, 
and/or contact the folk at general@gump.apache.org.

Project lucene-java-analyzers-test has an issue affecting its community integration.
This issue affects 1 projects,
 and has been outstanding for 22 runs.
The current state of this project is 'Failed', with reason 'Build Failed'.
For reference only, the following projects are affected by this:
    - lucene-java-analyzers-test :  Java Based Search Engine


Full details are available at:
    http://vmgump.apache.org/gump/public/lucene-java/lucene-java-analyzers-test/index.html

That said, some information snippets are provided here.

The following annotations (debug/informational/warning/error messages) were provided:
 -INFO- Failed with reason build failed



The following work was performed:
http://vmgump.apache.org/gump/public/lucene-java/lucene-java-analyzers-test/gump_work/build_lucene-java_lucene-java-analyzers-test.html
Work Name: build_lucene-java_lucene-java-analyzers-test (Type: Build)
Work ended in a state of : Failed
Elapsed: 2 mins 2 secs
Command Line: /usr/lib/jvm/java-6-openjdk/bin/java -Djava.awt.headless=true -Xbootclasspath/p:/srv/gump/public/workspace/xml-commons/java/external/build/xml-apis.jar:/srv/gump/public/workspace/xml-xerces2/build/xercesImpl.jar org.apache.tools.ant.Main -Dgump.merge=/srv/gump/public/gump/work/merge.xml -Dbuild.sysclasspath=only -Dversion=06112010 test 
[Working Directory: /srv/gump/public/workspace/lucene-java/modules/analysis]
CLASSPATH: /usr/lib/jvm/java-6-openjdk/lib/tools.jar:/srv/gump/public/workspace/lucene-java/lucene/build/classes/test:/srv/gump/public/workspace/lucene-java/modules/analysis/build/icu/classes/test:/srv/gump/public/workspace/lucene-java/modules/analysis/build/smartcn/classes/test:/srv/gump/public/workspace/lucene-java/modules/analysis/build/common/classes/test:/srv/gump/public/workspace/lucene-java/modules/analysis/build/stempel/classes/test:/srv/gump/public/workspace/lucene-java/modules/analysis/build/phonetic/classes/test:/srv/gump/public/workspace/ant/dist/lib/ant.jar:/srv/gump/public/workspace/ant/dist/lib/ant-launcher.jar:/srv/gump/public/workspace/ant/dist/lib/ant-jmf.jar:/srv/gump/public/workspace/ant/dist/lib/ant-junit.jar:/srv/gump/public/workspace/ant/dist/lib/ant-swing.jar:/srv/gump/public/workspace/ant/dist/lib/ant-apache-resolver.jar:/srv/gump/public/workspace/ant/dist/lib/ant-apache-xalan2.jar:/srv/gump/packages/junit3.8.1/junit.jar:/srv/gump/public/workspace/xml
 -commons/java/build/resolver.jar:/srv/gump/public/workspace/apache-commons/codec/dist/commons-codec-06112010.jar:/srv/gump/public/workspace/icu4j/main/classes/core/out/lib/icu4j-core.jar:/srv/gump/public/workspace/icu4j/main/classes/collate/out/lib/icu4j-collate.jar:/srv/gump/public/workspace/icu4j/main/classes/currdata/out/lib/icu4j-currdata.jar:/srv/gump/public/workspace/icu4j/main/classes/langdata/out/lib/icu4j-langdata.jar:/srv/gump/public/workspace/icu4j/main/classes/regiondata/out/lib/icu4j-regiondata.jar:/srv/gump/public/workspace/icu4j/main/classes/translit/out/lib/icu4j-translit.jar:/srv/gump/public/workspace/icu4j/main/classes/charset/out/lib/icu4j-charset.jar:/srv/gump/public/workspace/icu4j/main/classes/localespi/out/lib/icu4j-localespi.jar:/srv/gump/public/workspace/junit/dist/junit-06112010.jar:/srv/gump/public/workspace/junit/dist/junit-dep-06112010.jar:/srv/gump/public/workspace/lucene-java/lucene/build/lucene-core-06112010.jar:/srv/gump/public/workspace/luce
 ne-java/modules/analysis/build/icu/lucene-analyzers-icu-06112010.jar:/srv/gump/public/workspace/lucene-java/modules/analysis/build/smartcn/lucene-analyzers-smartcn-06112010.jar:/srv/gump/public/workspace/lucene-java/modules/analysis/build/common/lucene-analyzers-common-06112010.jar:/srv/gump/public/workspace/lucene-java/modules/analysis/build/stempel/lucene-analyzers-stempel-06112010.jar:/srv/gump/public/workspace/lucene-java/modules/analysis/build/phonetic/lucene-analyzers-phonetic-06112010.jar:/srv/gump/public/workspace/xml-commons/java/external/build/xml-apis-ext.jar
---------------------------------------------
    [junit] 	at com.ibm.icu.text.RuleBasedCollator.<init>(RuleBasedCollator.java:1838)
    [junit] 	at com.ibm.icu.text.CollatorServiceShim$CService$1CollatorFactory.handleCreate(CollatorServiceShim.java:122)
    [junit] 	at com.ibm.icu.impl.ICULocaleService$LocaleKeyFactory.create(ICULocaleService.java:376)
    [junit] 	at com.ibm.icu.impl.ICUService.getKey(ICUService.java:460)
    [junit] 	at com.ibm.icu.impl.ICUService.getKey(ICUService.java:380)
    [junit] 	at com.ibm.icu.impl.ICULocaleService.get(ICULocaleService.java:71)
    [junit] 	at com.ibm.icu.impl.ICULocaleService.get(ICULocaleService.java:55)
    [junit] 	at com.ibm.icu.text.CollatorServiceShim.getInstance(CollatorServiceShim.java:31)
    [junit] 	at com.ibm.icu.text.Collator.getInstance(Collator.java:500)
    [junit] 	at com.ibm.icu.text.Collator.getInstance(Collator.java:517)
    [junit] 	at org.apache.lucene.collation.TestICUCollationKeyAnalyzer.<init>(TestICUCollationKeyAnalyzer.java:29)
    [junit] 	at java.lang.reflect.Constructor.newInstance(Constructor.java:532)
    [junit] 	at org.apache.lucene.util.LuceneTestCase$LuceneTestCaseRunner.runChild(LuceneTestCase.java:878)
    [junit] 	at org.apache.lucene.util.LuceneTestCase$LuceneTestCaseRunner.runChild(LuceneTestCase.java:844)
    [junit] 
    [junit] 
    [junit] Testcase: testCollationKeySort(org.apache.lucene.collation.TestICUCollationKeyAnalyzer):	Caused an ERROR
    [junit] Could not initialize class com.ibm.icu.text.CollationParsedRuleBuilder
    [junit] java.lang.NoClassDefFoundError: Could not initialize class com.ibm.icu.text.CollationParsedRuleBuilder
    [junit] 	at com.ibm.icu.text.RuleBasedCollator.init(RuleBasedCollator.java:2237)
    [junit] 	at com.ibm.icu.text.RuleBasedCollator.<init>(RuleBasedCollator.java:1838)
    [junit] 	at com.ibm.icu.text.CollatorServiceShim$CService$1CollatorFactory.handleCreate(CollatorServiceShim.java:122)
    [junit] 	at com.ibm.icu.impl.ICULocaleService$LocaleKeyFactory.create(ICULocaleService.java:376)
    [junit] 	at com.ibm.icu.impl.ICUService.getKey(ICUService.java:460)
    [junit] 	at com.ibm.icu.impl.ICUService.getKey(ICUService.java:380)
    [junit] 	at com.ibm.icu.impl.ICULocaleService.get(ICULocaleService.java:71)
    [junit] 	at com.ibm.icu.impl.ICULocaleService.get(ICULocaleService.java:55)
    [junit] 	at com.ibm.icu.text.CollatorServiceShim.getInstance(CollatorServiceShim.java:31)
    [junit] 	at com.ibm.icu.text.Collator.getInstance(Collator.java:500)
    [junit] 	at com.ibm.icu.text.Collator.getInstance(Collator.java:517)
    [junit] 	at org.apache.lucene.collation.TestICUCollationKeyAnalyzer.<init>(TestICUCollationKeyAnalyzer.java:29)
    [junit] 	at java.lang.reflect.Constructor.newInstance(Constructor.java:532)
    [junit] 	at org.apache.lucene.util.LuceneTestCase$LuceneTestCaseRunner.runChild(LuceneTestCase.java:878)
    [junit] 	at org.apache.lucene.util.LuceneTestCase$LuceneTestCaseRunner.runChild(LuceneTestCase.java:844)
    [junit] 
    [junit] 
    [junit] Tests run: 4, Failures: 0, Errors: 4, Time elapsed: 0.495 sec
    [junit] 
    [junit] Test org.apache.lucene.collation.TestICUCollationKeyAnalyzer FAILED

BUILD FAILED
/srv/gump/public/workspace/lucene-java/modules/analysis/build.xml:76: The following error occurred while executing this line:
/srv/gump/public/workspace/lucene-java/lucene/contrib/contrib-build.xml:68: The following error occurred while executing this line:
/srv/gump/public/workspace/lucene-java/lucene/common-build.xml:527: 
The following error occurred while executing this line:
/srv/gump/public/workspace/lucene-java/lucene/common-build.xml:505: Tests failed!
The following error occurred while executing this line:
/srv/gump/public/workspace/lucene-java/lucene/common-build.xml:505: Tests failed!

Total time: 2 minutes 1 second
---------------------------------------------

To subscribe to this information via syndicated feeds:
- RSS: http://vmgump.apache.org/gump/public/lucene-java/lucene-java-analyzers-test/rss.xml
- Atom: http://vmgump.apache.org/gump/public/lucene-java/lucene-java-analyzers-test/atom.xml

============================== Gump Tracking Only ===
Produced by Gump version 2.3.
Gump Run 11000606112010, vmgump.apache.org:vmgump:11000606112010
Gump E-mail Identifier (unique within run) #5.

*********************************************************** G U M P
[GUMP@vmgump]: Module hudson success, but with warnings.
To whom it may engage...
        
This is an automated request, but not an unsolicited one. For 
more information please visit http://gump.apache.org/nagged.html, 
and/or contact the folk at general@gump.apache.org.

Module hudson contains errors.
The current state of this module is 'Success'.

Full details are available at:
    http://vmgump.apache.org/gump/public/hudson/index.html

That said, some information snippets are provided here.

The following annotations (debug/informational/warning/error messages) were provided:
 -ERROR- *** Failed to update from source control.Stale contents ***



The following work was performed:
http://vmgump.apache.org/gump/public/hudson/gump_work/update_hudson.html
Work Name: update_hudson (Type: Update)
Work ended in a state of : Failed
Elapsed: 11 mins 18 secs
Command Line: svn --quiet update --non-interactive --username guest --password guest hudson 
[Working Directory: /srv/gump/public/workspace/cvs]
---------------------------------------------
svn: REPORT of '/svn/hudson/!svn/vcc/default': Could not read response body: Secure connection truncated (https://svn.dev.java.net)
---------------------------------------------

To subscribe to this information via syndicated feeds:
- RSS: http://vmgump.apache.org/gump/public/hudson/rss.xml
- Atom: http://vmgump.apache.org/gump/public/hudson/atom.xml

============================== Gump Tracking Only ===
Produced by Gump version 2.3.
Gump Run 11000606112010, vmgump.apache.org:vmgump:11000606112010
Gump E-mail Identifier (unique within run) #6.

*********************************************************** G U M P
[GUMP@vmgump]: Project santuario-tests (in module santuario) failed
To whom it may engage...
        
This is an automated request, but not an unsolicited one. For 
more information please visit http://gump.apache.org/nagged.html, 
and/or contact the folk at general@gump.apache.org.

Project santuario-tests has an issue affecting its community integration.
This issue affects 1 projects,
 and has been outstanding for 53 runs.
The current state of this project is 'Failed', with reason 'Build Failed'.
For reference only, the following projects are affected by this:
    - santuario-tests :  XML-Signature Syntax and Processing


Full details are available at:
    http://vmgump.apache.org/gump/public/santuario/santuario-tests/index.html

That said, some information snippets are provided here.

The following annotations (debug/informational/warning/error messages) were provided:
 -DEBUG- Dependency on jce exists, no need to add for property lib.jce.
 -DEBUG- Dependency on junit exists, no need to add for property lib.junit.
 -INFO- Failed with reason build failed



The following work was performed:
http://vmgump.apache.org/gump/public/santuario/santuario-tests/gump_work/build_santuario_santuario-tests.html
Work Name: build_santuario_santuario-tests (Type: Build)
Work ended in a state of : Failed
Elapsed: 1 min 28 secs
Command Line: /usr/lib/jvm/java-6-openjdk/bin/java -Djava.awt.headless=true -Dant.build.clonevm=true -Xbootclasspath/p:/srv/gump/public/workspace/xml-commons/java/external/build/xml-apis.jar:/srv/gump/public/workspace/xml-xerces2/build/xercesImpl.jar:/srv/gump/public/workspace/xml-xalan/build/xalan-unbundled.jar:/srv/gump/public/workspace/xml-xalan/build/serializer.jar org.apache.tools.ant.Main -Dgump.merge=/srv/gump/public/gump/work/merge.xml -Dbuild.sysclasspath=only -Djce.download.sha1=c1f0e975e8c8e0a0105787b249a50615b485d109 -Dlib.jce=/srv/gump/packages/jce/jce-jdk13-116.jar -Dlib.junit=/srv/gump/public/workspace/junit/dist/junit-06112010.jar -Djce.download.md5=85c64cd754719a4bc8da7e9aa0e113fd test 
[Working Directory: /srv/gump/public/workspace/santuario]
CLASSPATH: /usr/lib/jvm/java-6-openjdk/lib/tools.jar:/srv/gump/public/workspace/santuario/build/test:/srv/gump/public/workspace/santuario:/srv/gump/public/workspace/santuario/build/xmlsec-06112010.jar:/srv/gump/public/workspace/ant/dist/lib/ant.jar:/srv/gump/public/workspace/ant/dist/lib/ant-launcher.jar:/srv/gump/public/workspace/ant/dist/lib/ant-jmf.jar:/srv/gump/public/workspace/ant/dist/lib/ant-junit.jar:/srv/gump/public/workspace/ant/dist/lib/ant-swing.jar:/srv/gump/public/workspace/ant/dist/lib/ant-apache-resolver.jar:/srv/gump/public/workspace/ant/dist/lib/ant-apache-xalan2.jar:/srv/gump/packages/junit3.8.1/junit.jar:/srv/gump/public/workspace/xml-commons/java/build/resolver.jar:/srv/gump/public/workspace/xml-commons/java/external/build/xml-apis-ext.jar:/srv/gump/packages/jce/jce-jdk13-116.jar:/srv/gump/public/workspace/apache-commons/logging/target/commons-logging-06112010.jar:/srv/gump/public/workspace/apache-commons/logging/target/commons-logging-api-06112010.jar:/s
 rv/gump/public/workspace/junit/dist/junit-06112010.jar:/srv/gump/public/workspace/junit/dist/junit-dep-06112010.jar
---------------------------------------------
    [junit] Testcase: test_signatureAlgorithms_signatures_hMACSignature took 4.136 sec
    [junit] Testcase: test_coreFeatures_signatures_manifestSignature_core took 0.058 sec
    [junit] Testcase: test_coreFeatures_signatures_manifestSignature_manifest took 0.06 sec
    [junit] Testcase: test_coreFeatures_signatures_signatureTypesSignature took 0.169 sec
    [junit] Testcase: test_coreFeatures_signatures_anonymousReferenceSignature took 0.037 sec
    [junit] Testcase: test_signatureAlgorithms_signatures_dSASignature took 0.115 sec
    [junit] Testcase: test_signatureAlgorithms_signatures_rSASignature took 0.024 sec
    [junit] Testcase: test_transforms_signatures_base64DecodeSignature took 0.062 sec
    [junit] Testcase: test_transforms_signatures_c14nSignature took 0.044 sec
    [junit] Testcase: test_transforms_signatures_envelopedSignatureSignature took 0.012 sec
    [junit] Testcase: test_transforms_signatures_xPathSignature took 0.026 sec
    [junit] Testcase: test_enveloping took 0.012 sec
    [junit] Testcase: test_enveloped took 0.01 sec
    [junit] Testcase: test_Y1 took 0.11 sec
    [junit] Testcase: test_Y2 took 0.175 sec
    [junit] Testcase: test_Y3 took 0.221 sec
    [junit] Testcase: test_Y4 took 11.313 sec
    [junit] Testcase: test_xfilter2 took 0.1 sec
    [junit] Testcase: testAES128ElementAES192KWCipherUsingKEK took 0.132 sec
    [junit] Testcase: testAES128ElementRSAKWCipherUsingKEK took 5.533 sec
    [junit] Testcase: testAES192ElementAES256KWCipher took 0.128 sec
    [junit] Testcase: testTrippleDesElementCipher took 0.122 sec
    [junit] Testcase: testAes128ElementCipher took 0.114 sec
    [junit] Testcase: testAes192ElementCipher took 0.121 sec
    [junit] Testcase: testAes265ElementCipher took 0.121 sec
    [junit] Testcase: testTrippleDesDocumentCipher took 0.632 sec
    [junit] Testcase: testSameDocumentCipherReference took 0.01 sec
    [junit] Testcase: testSerializedData took 0.05 sec
    [junit] Testcase: testEncryptedKeyWithRecipient took 0.024 sec
    [junit] Testcase: test_five_content_3des_cbc took 0.057 sec
    [junit] Testcase: test_five_content_aes256_cbc took 0.036 sec
    [junit] Testcase: test_five_content_aes128_cbc_kw_aes192 took 0.034 sec
    [junit] Testcase: test_five_content_3des_cbc_kw_aes128 took 0.032 sec
    [junit] Testcase: test_five_content_aes128_cbc_rsa_15 took 0.132 sec
    [junit] Testcase: test_five_element_aes192_cbc_ref took 0.052 sec
    [junit] Testcase: test_five_data_aes128_cbc took 0.018 sec
    [junit] Testcase: test_five_data_aes256_cbc_3des took 0.024 sec
    [junit] Testcase: test_five_data_aes192_cbc_aes256 took 0.019 sec
    [junit] Testcase: test_five_data_3des_cbc_rsa_oaep took 0.096 sec
    [junit] Testcase: testContentRemoved took 0.007 sec
    [junit] Test org.apache.xml.security.test.AllTests FAILED
[junitreport] Processing /srv/gump/public/workspace/santuario/build/docs/xml/junit/TESTS-TestSuites.xml to /tmp/null31214424
[junitreport] Loading stylesheet jar:file:/srv/gump/public/workspace/ant/dist/lib/ant-junit.jar!/org/apache/tools/ant/taskdefs/optional/junit/xsl/junit-frames.xsl
[junitreport] Transform time: 1773ms
[junitreport] Deleting: /tmp/null31214424

BUILD FAILED
/srv/gump/public/workspace/santuario/build.xml:381: Unit Tests Failed

Total time: 1 minute 27 seconds
---------------------------------------------

To subscribe to this information via syndicated feeds:
- RSS: http://vmgump.apache.org/gump/public/santuario/santuario-tests/rss.xml
- Atom: http://vmgump.apache.org/gump/public/santuario/santuario-tests/atom.xml

============================== Gump Tracking Only ===
Produced by Gump version 2.3.
Gump Run 11000606112010, vmgump.apache.org:vmgump:11000606112010
Gump E-mail Identifier (unique within run) #7.

*********************************************************** G U M P
[GUMP@vmgump]: Project wss4j (in module ws-wss4j) failed
To whom it may engage...
        
This is an automated request, but not an unsolicited one. For 
more information please visit http://gump.apache.org/nagged.html, 
and/or contact the folk at general@gump.apache.org.

Project wss4j has an issue affecting its community integration.
This issue affects 2 projects,
 and has been outstanding for 53 runs.
The current state of this project is 'Failed', with reason 'Build Failed'.
For reference only, the following projects are affected by this:
    - wss4j :  WS-FX Project
    - wss4j-test :  WS-FX Project


Full details are available at:
    http://vmgump.apache.org/gump/public/ws-wss4j/wss4j/index.html

That said, some information snippets are provided here.

The following annotations (debug/informational/warning/error messages) were provided:
 -DEBUG- Sole jar output [wss4j-@DATE@.jar] identifier set to project name
 -INFO- Failed with reason build failed
 -INFO- Failed to extract fallback artifacts from Gump Repository



The following work was performed:
http://vmgump.apache.org/gump/public/ws-wss4j/wss4j/gump_work/build_ws-wss4j_wss4j.html
Work Name: build_ws-wss4j_wss4j (Type: Build)
Work ended in a state of : Failed
Elapsed: 40 secs
Command Line: /usr/lib/jvm/java-6-openjdk/bin/java -Djava.awt.headless=true -Dant.build.clonevm=true -Xbootclasspath/p:/srv/gump/public/workspace/xml-xerces2/build/xercesImpl.jar:/srv/gump/public/workspace/xml-xalan/build/xalan-unbundled.jar:/srv/gump/public/workspace/xml-xalan/build/serializer.jar:/srv/gump/public/workspace/xml-commons/java/external/build/xml-apis.jar org.apache.tools.ant.Main -Dgump.merge=/srv/gump/public/gump/work/merge.xml -Dbuild.sysclasspath=only -Dskip.tests=true -Djar.library=wss4j-@DATE@.jar gump 
[Working Directory: /srv/gump/public/workspace/ws-wss4j]
CLASSPATH: /usr/lib/jvm/java-6-openjdk/lib/tools.jar:/srv/gump/public/workspace/ws-wss4j/build/classes:/srv/gump/public/workspace/ant/dist/lib/ant.jar:/srv/gump/public/workspace/ant/dist/lib/ant-launcher.jar:/srv/gump/public/workspace/ant/dist/lib/ant-jmf.jar:/srv/gump/public/workspace/ant/dist/lib/ant-junit.jar:/srv/gump/public/workspace/ant/dist/lib/ant-swing.jar:/srv/gump/public/workspace/ant/dist/lib/ant-apache-resolver.jar:/srv/gump/public/workspace/ant/dist/lib/ant-apache-xalan2.jar:/srv/gump/packages/junit3.8.1/junit.jar:/srv/gump/public/workspace/xml-commons/java/build/resolver.jar:/srv/gump/public/workspace/ws-addressing/target/addressing-06112010.jar:/srv/gump/packages/bouncycastle-jdk14/bcprov-ext-jdk14-145.jar:/srv/gump/public/workspace/ws-axis/build/lib/axis.jar:/srv/gump/public/workspace/ws-axis/build/lib/axis-ant.jar:/srv/gump/public/workspace/ws-axis/build/lib/jaxrpc.jar:/srv/gump/public/workspace/ws-axis/build/lib/saaj.jar:/srv/gump/public/workspace/apache-co
 mmons/codec/dist/commons-codec-06112010.jar:/srv/gump/public/workspace/apache-commons/discovery/dist/commons-discovery.jar:/srv/gump/public/workspace/httpcomponents/oac.hc3x/dist/commons-httpclient.jar:/srv/gump/public/workspace/apache-commons/logging/target/commons-logging-06112010.jar:/srv/gump/public/workspace/apache-commons/logging/target/commons-logging-api-06112010.jar:/srv/gump/packages/jaf-1.1ea/activation.jar:/srv/gump/packages/javamail-1.4/mail.jar:/srv/gump/packages/javamail-1.4/lib/mailapi.jar:/srv/gump/packages/jce/jce-jdk13-116.jar:/srv/gump/packages/jsse1.0.3/lib/jsse.jar:/srv/gump/packages/jsse1.0.3/lib/jnet.jar:/srv/gump/packages/jsse1.0.3/lib/jcert.jar:/srv/gump/public/workspace/junit/dist/junit-06112010.jar:/srv/gump/public/workspace/junit/dist/junit-dep-06112010.jar:/srv/gump/public/workspace/logging-log4j-12/dist/lib/log4j-06112010.jar:/srv/gump/public/workspace/opensaml/dist/opensaml-06112010.jar:/srv/gump/public/workspace/wsdl4j/build/lib/wsdl4j.jar:/s
 rv/gump/public/workspace/wsdl4j/build/lib/qname.jar:/srv/gump/public/workspace/jakarta-bcel/target/bcel-5.3-SNAPSHOT.jar:/srv/gump/public/workspace/xml-xalan/tools/java_cup.jar:/srv/gump/public/workspace/xml-xalan/lib/runtime.jar:/srv/gump/public/workspace/xml-xalan/tools/JLex.jar:/srv/gump/public/workspace/santuario/build/xmlsec-06112010.jar:/srv/gump/public/workspace/xml-commons/java/external/build/xml-apis-ext.jar
---------------------------------------------

prepare:
    [mkdir] Created dir: /srv/gump/public/workspace/ws-wss4j/build
    [mkdir] Created dir: /srv/gump/public/workspace/ws-wss4j/build/test-reports

prepare-src:
    [mkdir] Created dir: /srv/gump/public/workspace/ws-wss4j/build/classes

javadoc:
    [mkdir] Created dir: /srv/gump/public/workspace/ws-wss4j/build/doc
    [mkdir] Created dir: /srv/gump/public/workspace/ws-wss4j/build/doc/html
    [mkdir] Created dir: /srv/gump/public/workspace/ws-wss4j/build/doc/html/api
  [javadoc] Generating Javadoc
  [javadoc] Javadoc execution
  [javadoc] Loading source files for package org.apache.ws.axis.security...
  [javadoc] Loading source files for package org.apache.ws.security...
  [javadoc] Loading source files for package org.apache.ws.security.components.crypto...
  [javadoc] Loading source files for package org.apache.ws.security.message...
  [javadoc] Loading source files for package org.apache.ws.security.message.token...
  [javadoc] Loading source files for package org.apache.ws.security.util...
  [javadoc] Constructing Javadoc information...
  [javadoc] Standard Doclet version 1.6.0_18
  [javadoc] Building tree for all the packages and classes...
  [javadoc] /srv/gump/public/workspace/ws-wss4j/src/org/apache/ws/security/WSConstants.java:302: warning - Tag @link: reference not found: SKI_KEY_IDENTIFIER
  [javadoc] /srv/gump/public/workspace/ws-wss4j/src/org/apache/ws/security/WSSecurityEngine.java:283: warning - Tag @link: can't find usernameToken in org.apache.ws.security.WSSecurityEngine
  [javadoc] /srv/gump/public/workspace/ws-wss4j/src/org/apache/ws/security/WSSecurityEngine.java:283: warning - Tag @link: can't find timeStamp in org.apache.ws.security.WSSecurityEngine
  [javadoc] /srv/gump/public/workspace/ws-wss4j/src/org/apache/ws/security/components/crypto/CryptoBase.java:200: warning - @param argument "The" is not a parameter name.
  [javadoc] /srv/gump/public/workspace/ws-wss4j/src/org/apache/ws/security/message/WSSecSignatureBase.java:66: warning - @param argument "sig" is not a parameter name.
  [javadoc] /srv/gump/public/workspace/ws-wss4j/src/org/apache/ws/security/message/token/PKIPathSecurity.java:70: warning - @param argument "reverse" is not a parameter name.
  [javadoc] /srv/gump/public/workspace/ws-wss4j/src/org/apache/ws/security/message/token/PKIPathSecurity.java:87: warning - @param argument "reverse" is not a parameter name.
  [javadoc] /srv/gump/public/workspace/ws-wss4j/src/org/apache/ws/security/message/token/SecurityTokenReference.java:549: warning - @param argument "ref" is not a parameter name.
  [javadoc] /srv/gump/public/workspace/ws-wss4j/src/org/apache/ws/security/util/Base64.java:40: warning - @xerces.internal is an unknown tag.
  [javadoc] Building index for all the packages and classes...
  [javadoc] Building index for all classes...
  [javadoc] Generating /srv/gump/public/workspace/ws-wss4j/build/doc/html/api/stylesheet.css...
  [javadoc] 9 warnings

compile.library:
    [javac] Compiling 108 source files to /srv/gump/public/workspace/ws-wss4j/build/classes
    [javac] /srv/gump/public/workspace/ws-wss4j/src/org/apache/ws/security/transform/STRTransform.java:164: incompatible types
    [javac] found   : com.sun.org.apache.xml.internal.security.signature.XMLSignatureInput
    [javac] required: org.apache.xml.security.signature.XMLSignatureInput
    [javac]                 xmlSignatureInput = ((ApacheData) data).getXMLSignatureInput();
    [javac]                                                                             ^
    [javac] 1 error

BUILD FAILED
/srv/gump/public/workspace/ws-wss4j/build.xml:342: Compile failed; see the compiler error output for details.

Total time: 32 seconds
---------------------------------------------

To subscribe to this information via syndicated feeds:
- RSS: http://vmgump.apache.org/gump/public/ws-wss4j/wss4j/rss.xml
- Atom: http://vmgump.apache.org/gump/public/ws-wss4j/wss4j/atom.xml

============================== Gump Tracking Only ===
Produced by Gump version 2.3.
Gump Run 11000606112010, vmgump.apache.org:vmgump:11000606112010
Gump E-mail Identifier (unique within run) #9.

*********************************************************** G U M P
[GUMP@vmgump]: Project apache-james-imap-parent (in module james-imap) failed
To whom it may engage...
        
This is an automated request, but not an unsolicited one. For 
more information please visit http://gump.apache.org/nagged.html, 
and/or contact the folk at general@gump.apache.org.

Project apache-james-imap-parent has an issue affecting its community integration.
This issue affects 3 projects,
 and has been outstanding for 4 runs.
The current state of this project is 'Failed', with reason 'Build Failed'.
For reference only, the following projects are affected by this:
    - apache-james-imap-parent :  A library providing a flexible codec for IMAP, command proce...
    - james-imap :  A library providing a flexible codec for IMAP, command proce...
    - james-imap-test :  A library providing a flexible codec for IMAP, command proce...


Full details are available at:
    http://vmgump.apache.org/gump/public/james-imap/apache-james-imap-parent/index.html

That said, some information snippets are provided here.

The following annotations (debug/informational/warning/error messages) were provided:
 -DEBUG- Sole pom output [pom.xml] identifier set to project name
 -DEBUG- (Gump generated) Maven Settings in: /srv/gump/public/workspace/james-imap/parent/gump_mvn_settings.xml
 -ERROR- failed to parse POM because of mismatched tag: line 544, column 8
 -INFO- Failed with reason build failed
 -DEBUG- Maven POM in: /srv/gump/public/workspace/james-imap/parent/pom.xml
 -DEBUG- Extracted fallback artifacts from Gump Repository



The following work was performed:
http://vmgump.apache.org/gump/public/james-imap/apache-james-imap-parent/gump_work/build_james-imap_apache-james-imap-parent.html
Work Name: build_james-imap_apache-james-imap-parent (Type: Build)
Work ended in a state of : Failed
Elapsed: 2 secs
Command Line: mvn --batch-mode -Dpackaging=pom -DgroupId=org.apache.james -Dfile=pom.xml -DartifactId=apache-james-imap-parent --settings /srv/gump/public/workspace/james-imap/parent/gump_mvn_settings.xml install:install-file 
[Working Directory: /srv/gump/public/workspace/james-imap/parent]
---------------------------------------------
[INFO] ------------------------------------------------------------------------
[ERROR] FATAL ERROR
[INFO] ------------------------------------------------------------------------
[INFO] Error building POM (may not be this project's POM).


Project ID: unknown
POM Location: /srv/gump/public/workspace/james-imap/parent/pom.xml

Reason: Parse error reading POM. Reason: TEXT must be immediately followed by END_TAG and not START_TAG (position: START_TAG seen ...<version>2.1.2/version>\n        <scope>... @543:16)  for project unknown at /srv/gump/public/workspace/james-imap/parent/pom.xml


[INFO] ------------------------------------------------------------------------
[INFO] Trace
org.apache.maven.reactor.MavenExecutionException: Parse error reading POM. Reason: TEXT must be immediately followed by END_TAG and not START_TAG (position: START_TAG seen ...<version>2.1.2/version>\n        <scope>... @543:16)  for project unknown at /srv/gump/public/workspace/james-imap/parent/pom.xml
	at org.apache.maven.DefaultMaven.getProjects(DefaultMaven.java:404)
	at org.apache.maven.DefaultMaven.doExecute(DefaultMaven.java:272)
	at org.apache.maven.DefaultMaven.execute(DefaultMaven.java:138)
	at org.apache.maven.cli.MavenCli.main(MavenCli.java:362)
	at org.apache.maven.cli.compat.CompatibleMain.main(CompatibleMain.java:60)
	at sun.reflect.NativeMethodAccessorImpl.invoke0(Native Method)
	at sun.reflect.NativeMethodAccessorImpl.invoke(NativeMethodAccessorImpl.java:57)
	at sun.reflect.DelegatingMethodAccessorImpl.invoke(DelegatingMethodAccessorImpl.java:43)
	at java.lang.reflect.Method.invoke(Method.java:616)
	at org.codehaus.classworlds.Launcher.launchEnhanced(Launcher.java:315)
	at org.codehaus.classworlds.Launcher.launch(Launcher.java:255)
	at org.codehaus.classworlds.Launcher.mainWithExitCode(Launcher.java:430)
	at org.codehaus.classworlds.Launcher.main(Launcher.java:375)
Caused by: org.apache.maven.project.InvalidProjectModelException: Parse error reading POM. Reason: TEXT must be immediately followed by END_TAG and not START_TAG (position: START_TAG seen ...<version>2.1.2/version>\n        <scope>... @543:16)  for project unknown at /srv/gump/public/workspace/james-imap/parent/pom.xml
	at org.apache.maven.project.DefaultMavenProjectBuilder.readModel(DefaultMavenProjectBuilder.java:1610)
	at org.apache.maven.project.DefaultMavenProjectBuilder.readModel(DefaultMavenProjectBuilder.java:1571)
	at org.apache.maven.project.DefaultMavenProjectBuilder.buildFromSourceFileInternal(DefaultMavenProjectBuilder.java:506)
	at org.apache.maven.project.DefaultMavenProjectBuilder.build(DefaultMavenProjectBuilder.java:200)
	at org.apache.maven.DefaultMaven.getProject(DefaultMaven.java:604)
	at org.apache.maven.DefaultMaven.collectProjects(DefaultMaven.java:487)
	at org.apache.maven.DefaultMaven.getProjects(DefaultMaven.java:391)
	... 12 more
Caused by: org.codehaus.plexus.util.xml.pull.XmlPullParserException: TEXT must be immediately followed by END_TAG and not START_TAG (position: START_TAG seen ...<version>2.1.2/version>\n        <scope>... @543:16) 
	at hidden.org.codehaus.plexus.util.xml.pull.MXParser.nextText(MXParser.java:1075)
	at org.apache.maven.model.io.xpp3.MavenXpp3Reader.parseDependency(MavenXpp3Reader.java:1178)
	at org.apache.maven.model.io.xpp3.MavenXpp3Reader.parseDependencyManagement(MavenXpp3Reader.java:1262)
	at org.apache.maven.model.io.xpp3.MavenXpp3Reader.parseModel(MavenXpp3Reader.java:2117)
	at org.apache.maven.model.io.xpp3.MavenXpp3Reader.read(MavenXpp3Reader.java:3912)
	at org.apache.maven.project.DefaultMavenProjectBuilder.readModel(DefaultMavenProjectBuilder.java:1606)
	... 18 more
[INFO] ------------------------------------------------------------------------
[INFO] Total time: < 1 second
[INFO] Finished at: Sat Nov 06 13:11:23 UTC 2010
[INFO] Final Memory: 2M/15M
[INFO] ------------------------------------------------------------------------
---------------------------------------------

To subscribe to this information via syndicated feeds:
- RSS: http://vmgump.apache.org/gump/public/james-imap/apache-james-imap-parent/rss.xml
- Atom: http://vmgump.apache.org/gump/public/james-imap/apache-james-imap-parent/atom.xml

============================== Gump Tracking Only ===
Produced by Gump version 2.3.
Gump Run 11000606112010, vmgump.apache.org:vmgump:11000606112010
Gump E-mail Identifier (unique within run) #10.

*********************************************************** G U M P
[GUMP@vmgump]: Project pdfbox-lucene (in module pdfbox) failed
To whom it may engage...
        
This is an automated request, but not an unsolicited one. For 
more information please visit http://gump.apache.org/nagged.html, 
and/or contact the folk at general@gump.apache.org.

Project pdfbox-lucene has an issue affecting its community integration.
This issue affects 1 projects,
 and has been outstanding for 74 runs.
The current state of this project is 'Failed', with reason 'Build Failed'.
For reference only, the following projects are affected by this:
    - pdfbox-lucene :  Apache PDFBox is an open source Java PDF library for working...


Full details are available at:
    http://vmgump.apache.org/gump/public/pdfbox/pdfbox-lucene/index.html

That said, some information snippets are provided here.

The following annotations (debug/informational/warning/error messages) were provided:
 -DEBUG- Sole jar output [pdfbox-lucene-*[0-9T].jar] identifier set to project name
 -DEBUG- (Gump generated) Maven Settings in: /srv/gump/public/workspace/pdfbox/lucene/gump_mvn_settings.xml
 -INFO- Failed with reason build failed
 -DEBUG- Maven POM in: /srv/gump/public/workspace/pdfbox/lucene/pom.xml
 -INFO- Failed to extract fallback artifacts from Gump Repository



The following work was performed:
http://vmgump.apache.org/gump/public/pdfbox/pdfbox-lucene/gump_work/build_pdfbox_pdfbox-lucene.html
Work Name: build_pdfbox_pdfbox-lucene (Type: Build)
Work ended in a state of : Failed
Elapsed: 14 secs
Command Line: /opt/maven2/bin/mvn --batch-mode --settings /srv/gump/public/workspace/pdfbox/lucene/gump_mvn_settings.xml package 
[Working Directory: /srv/gump/public/workspace/pdfbox/lucene]
M2_HOME: /opt/maven2
---------------------------------------------
1361K downloaded  (lucene-core-2.4.1.jar)
Downloading: http://localhost:8192/maven2/org/apache/lucene/lucene-demos/2.4.1/lucene-demos-2.4.1.jar
58K downloaded  (lucene-demos-2.4.1.jar)
3370K downloaded  (pdfbox-1.4.0-SNAPSHOT.jar)
[INFO] Setting property: classpath.resource.loader.class => 'org.codehaus.plexus.velocity.ContextClassLoaderResourceLoader'.
[INFO] Setting property: velocimacro.messages.on => 'false'.
[INFO] Setting property: resource.loader => 'classpath'.
[INFO] Setting property: resource.manager.logwhenfound => 'false'.
[INFO] [remote-resources:process {execution: default}]
[INFO] [resources:resources {execution: default-resources}]
[INFO] Using 'ISO-8859-1' encoding to copy filtered resources.
[INFO] skip non existing resourceDirectory /srv/gump/public/workspace/pdfbox/lucene/src/main/resources
[INFO] Copying 3 resources
[INFO] [compiler:compile {execution: default-compile}]
[INFO] Compiling 4 source files to /srv/gump/public/workspace/pdfbox/lucene/target/classes
[INFO] ------------------------------------------------------------------------
[ERROR] BUILD FAILURE
[INFO] ------------------------------------------------------------------------
[INFO] Compilation failure

/srv/gump/public/workspace/pdfbox/lucene/src/main/java/org/apache/pdfbox/lucene/IndexFiles.java:[25,42] package org.apache.lucene.analysis.standard does not exist

/srv/gump/public/workspace/pdfbox/lucene/src/main/java/org/apache/pdfbox/lucene/IndexFiles.java:[34,30] cannot find symbol
symbol  : class TermEnum
location: package org.apache.lucene.index

/srv/gump/public/workspace/pdfbox/lucene/src/main/java/org/apache/pdfbox/lucene/IndexFiles.java:[59,12] cannot find symbol
symbol  : class TermEnum
location: class org.apache.pdfbox.lucene.IndexFiles

/srv/gump/public/workspace/pdfbox/lucene/src/main/java/org/apache/pdfbox/lucene/IndexFiles.java:[120,48] cannot find symbol
symbol  : class StandardAnalyzer
location: class org.apache.pdfbox.lucene.IndexFiles

/srv/gump/public/workspace/pdfbox/lucene/src/main/java/org/apache/pdfbox/lucene/IndexFiles.java:[120,21] internal error; cannot instantiate org.apache.lucene.index.IndexWriter.<init> at org.apache.lucene.index.IndexWriter to ()

/srv/gump/public/workspace/pdfbox/lucene/src/main/java/org/apache/pdfbox/lucene/IndexFiles.java:[163,32] cannot find symbol
symbol  : method open(java.lang.String)
location: class org.apache.lucene.index.IndexReader

/srv/gump/public/workspace/pdfbox/lucene/src/main/java/org/apache/pdfbox/lucene/IndexFiles.java:[164,28] terms(java.lang.String) in org.apache.lucene.index.IndexReader cannot be applied to (org.apache.lucene.index.Term)


[INFO] ------------------------------------------------------------------------
[INFO] For more information, run Maven with the -e switch
[INFO] ------------------------------------------------------------------------
[INFO] Total time: 12 seconds
[INFO] Finished at: Sat Nov 06 13:34:10 UTC 2010
[INFO] Final Memory: 33M/79M
[INFO] ------------------------------------------------------------------------
---------------------------------------------

To subscribe to this information via syndicated feeds:
- RSS: http://vmgump.apache.org/gump/public/pdfbox/pdfbox-lucene/rss.xml
- Atom: http://vmgump.apache.org/gump/public/pdfbox/pdfbox-lucene/atom.xml

============================== Gump Tracking Only ===
Produced by Gump version 2.3.
Gump Run 11000606112010, vmgump.apache.org:vmgump:11000606112010
Gump E-mail Identifier (unique within run) #12.

*********************************************************** G U M P
[GUMP@vmgump]: Project ws-commons-xmlschema (in module ws-axis2-commons) failed
To whom it may engage...
        
This is an automated request, but not an unsolicited one. For 
more information please visit http://gump.apache.org/nagged.html, 
and/or contact the folk at general@gump.apache.org.

Project ws-commons-xmlschema has an issue affecting its community integration.
This issue affects 1 projects.
The current state of this project is 'Failed', with reason 'Build Failed'.
For reference only, the following projects are affected by this:
    - ws-commons-xmlschema :  Common stuff for the WS projects.


Full details are available at:
    http://vmgump.apache.org/gump/public/ws-axis2-commons/ws-commons-xmlschema/index.html

That said, some information snippets are provided here.

The following annotations (debug/informational/warning/error messages) were provided:
 -INFO- Making directory for Maven settings: [/srv/gump/public/workspace/ws-axis2-commons/XmlSchema]
 -DEBUG- (Gump generated) Maven Settings in: /srv/gump/public/workspace/ws-axis2-commons/XmlSchema/gump_mvn_settings.xml
 -INFO- Failed with reason build failed
 -DEBUG- Extracted fallback artifacts from Gump Repository



The following work was performed:
http://vmgump.apache.org/gump/public/ws-axis2-commons/ws-commons-xmlschema/gump_work/build_ws-axis2-commons_ws-commons-xmlschema.html
Work Name: build_ws-axis2-commons_ws-commons-xmlschema (Type: Build)
Work ended in a state of : Failed
Elapsed: 3 secs
Command Line: /opt/maven2/bin/mvn --batch-mode --settings /srv/gump/public/workspace/ws-axis2-commons/XmlSchema/gump_mvn_settings.xml -P!sourcecheck package 
[Working Directory: /srv/gump/public/workspace/ws-axis2-commons/XmlSchema]
M2_HOME: /opt/maven2
---------------------------------------------
[INFO] Scanning for projects...
[INFO] ------------------------------------------------------------------------
[INFO] Building Maven Default Project
[INFO]    task-segment: [package]
[INFO] ------------------------------------------------------------------------
[INFO] ------------------------------------------------------------------------
[ERROR] BUILD ERROR
[INFO] ------------------------------------------------------------------------
[INFO] Cannot execute mojo: resources. It requires a project with an existing pom.xml, but the build is not using one.
[INFO] ------------------------------------------------------------------------
[INFO] For more information, run Maven with the -e switch
[INFO] ------------------------------------------------------------------------
[INFO] Total time: 2 seconds
[INFO] Finished at: Sat Nov 06 14:21:04 UTC 2010
[INFO] Final Memory: 6M/15M
[INFO] ------------------------------------------------------------------------
---------------------------------------------

To subscribe to this information via syndicated feeds:
- RSS: http://vmgump.apache.org/gump/public/ws-axis2-commons/ws-commons-xmlschema/rss.xml
- Atom: http://vmgump.apache.org/gump/public/ws-axis2-commons/ws-commons-xmlschema/atom.xml

============================== Gump Tracking Only ===
Produced by Gump version 2.3.
Gump Run 11000606112010, vmgump.apache.org:vmgump:11000606112010
Gump E-mail Identifier (unique within run) #14.

*********************************************************** G U M P
[GUMP@vmgump]: Project jtidy-svn (in module jtidy) failed
To whom it may engage...
        
This is an automated request, but not an unsolicited one. For 
more information please visit http://gump.apache.org/nagged.html, 
and/or contact the folk at general@gump.apache.org.

Project jtidy-svn has an issue affecting its community integration.
This issue affects 1 projects,
 and has been outstanding for 5 runs.
The current state of this project is 'Failed', with reason 'Build Failed'.
For reference only, the following projects are affected by this:
    - jtidy-svn :  HTML Templates


Full details are available at:
    http://vmgump.apache.org/gump/public/jtidy/jtidy-svn/index.html

That said, some information snippets are provided here.

The following annotations (debug/informational/warning/error messages) were provided:
 -DEBUG- Sole jar output [jtidy-8.0-SNAPSHOT.jar] identifier set to project name
 -DEBUG- (Gump generated) Maven Settings in: /srv/gump/public/workspace/jtidy/gump_mvn_settings.xml
 -INFO- Failed with reason build failed
 -DEBUG- Maven POM in: /srv/gump/public/workspace/jtidy/pom.xml
 -DEBUG- Extracted fallback artifacts from Gump Repository



The following work was performed:
http://vmgump.apache.org/gump/public/jtidy/jtidy-svn/gump_work/build_jtidy_jtidy-svn.html
Work Name: build_jtidy_jtidy-svn (Type: Build)
Work ended in a state of : Failed
Elapsed: 21 secs
Command Line: /opt/maven2/bin/mvn --batch-mode --settings /srv/gump/public/workspace/jtidy/gump_mvn_settings.xml package 
[Working Directory: /srv/gump/public/workspace/jtidy]
M2_HOME: /opt/maven2
---------------------------------------------
[WARNING] Using platform encoding (UTF-8 actually) to copy filtered resources, i.e. build is platform dependent!
[INFO] Copying 678 resources
Downloading: http://jtidy.sourceforge.net/maven2//com/sun/jmx/jmxri/1.2.1/jmxri-1.2.1.jar
Downloading: http://jtidy.sourceforge.net/maven2//com/sun/jdmk/jmxtools/1.2.1/jmxtools-1.2.1.jar
Downloading: http://jtidy.sourceforge.net/maven2//org/slf4j/slf4j-log4j12/1.6.1/slf4j-log4j12-1.6.1.jar
Downloading: http://jtidy.sourceforge.net/maven2//log4j/log4j/1.2.15/log4j-1.2.15.jar
[INFO] Unable to find resource 'com.sun.jmx:jmxri:jar:1.2.1' in repository jtidy (http://jtidy.sourceforge.net/maven2/)
Downloading: https://maven-repository.dev.java.net/nonav/repository/com.sun.jmx/jars/jmxri-1.2.1.jar
353b downloaded  (jmxri-1.2.1.jar)
[INFO] Unable to find resource 'com.sun.jdmk:jmxtools:jar:1.2.1' in repository jtidy (http://jtidy.sourceforge.net/maven2/)
Downloading: https://maven-repository.dev.java.net/nonav/repository/com.sun.jdmk/jars/jmxtools-1.2.1.jar
[INFO] Unable to find resource 'org.slf4j:slf4j-log4j12:jar:1.6.1' in repository jtidy (http://jtidy.sourceforge.net/maven2/)
Downloading: http://localhost:8192/maven2/org/slf4j/slf4j-log4j12/1.6.1/slf4j-log4j12-1.6.1.jar
[INFO] Unable to find resource 'log4j:log4j:jar:1.2.15' in repository jtidy (http://jtidy.sourceforge.net/maven2/)
Downloading: http://localhost:8192/maven2/log4j/log4j/1.2.15/log4j-1.2.15.jar
9K downloaded  (slf4j-log4j12-1.6.1.jar)
[WARNING] *** CHECKSUM FAILED - Checksum failed on download: local = 'a55ce8e95c9bb027e78557acc9e2b973fe3c611e'; remote = '<!DOCTYPE' - RETRYING
Downloading: https://maven-repository.dev.java.net/nonav/repository/com.sun.jmx/jars/jmxri-1.2.1.jar
353b downloaded  (jmxri-1.2.1.jar)
[WARNING] *** CHECKSUM FAILED - Checksum failed on download: local = 'a55ce8e95c9bb027e78557acc9e2b973fe3c611e'; remote = '<!DOCTYPE' - IGNORING
357b downloaded  (jmxtools-1.2.1.jar)
[WARNING] *** CHECKSUM FAILED - Checksum failed on download: local = '9e1dae7682d2b60d5b17b7d47e20d99d70ba65cf'; remote = '<!DOCTYPE' - RETRYING
Downloading: https://maven-repository.dev.java.net/nonav/repository/com.sun.jdmk/jars/jmxtools-1.2.1.jar
409K downloaded  (log4j-1.2.15.jar)
357b downloaded  (jmxtools-1.2.1.jar)
[WARNING] *** CHECKSUM FAILED - Checksum failed on download: local = '9e1dae7682d2b60d5b17b7d47e20d99d70ba65cf'; remote = '<!DOCTYPE' - IGNORING
[INFO] [compiler:testCompile {execution: default-testCompile}]
[INFO] Compiling 21 source files to /srv/gump/public/workspace/jtidy/target/test-classes
[INFO] -------------------------------------------------------------
[ERROR] COMPILATION ERROR : 
[INFO] -------------------------------------------------------------
[ERROR] error: error reading /srv/gump/public/workspace/mvnlocalrepo/shared/com/sun/jdmk/jmxtools/1.2.1/jmxtools-1.2.1.jar; error in opening zip file
[ERROR] error: error reading /srv/gump/public/workspace/mvnlocalrepo/shared/com/sun/jmx/jmxri/1.2.1/jmxri-1.2.1.jar; error in opening zip file
[INFO] 2 errors 
[INFO] -------------------------------------------------------------
[INFO] ------------------------------------------------------------------------
[ERROR] BUILD FAILURE
[INFO] ------------------------------------------------------------------------
[INFO] Compilation failure

error: error reading /srv/gump/public/workspace/mvnlocalrepo/shared/com/sun/jdmk/jmxtools/1.2.1/jmxtools-1.2.1.jar; error in opening zip file
error: error reading /srv/gump/public/workspace/mvnlocalrepo/shared/com/sun/jmx/jmxri/1.2.1/jmxri-1.2.1.jar; error in opening zip file

[INFO] ------------------------------------------------------------------------
[INFO] For more information, run Maven with the -e switch
[INFO] ------------------------------------------------------------------------
[INFO] Total time: 20 seconds
[INFO] Finished at: Sat Nov 06 14:49:20 UTC 2010
[INFO] Final Memory: 31M/88M
[INFO] ------------------------------------------------------------------------
---------------------------------------------

To subscribe to this information via syndicated feeds:
- RSS: http://vmgump.apache.org/gump/public/jtidy/jtidy-svn/rss.xml
- Atom: http://vmgump.apache.org/gump/public/jtidy/jtidy-svn/atom.xml

============================== Gump Tracking Only ===
Produced by Gump version 2.3.
Gump Run 11000606112010, vmgump.apache.org:vmgump:11000606112010
Gump E-mail Identifier (unique within run) #17.

*********************************************************** G U M P
[GUMP@vmgump]: Project xstream-test (in module xstream) failed
To whom it may engage...
        
This is an automated request, but not an unsolicited one. For 
more information please visit http://gump.apache.org/nagged.html, 
and/or contact the folk at general@gump.apache.org.

Project xstream-test has an issue affecting its community integration.
This issue affects 1 projects,
 and has been outstanding for 35 runs.
The current state of this project is 'Failed', with reason 'Build Failed'.
For reference only, the following projects are affected by this:
    - xstream-test :  simple library to serialize object to XML and back
    again


Full details are available at:
    http://vmgump.apache.org/gump/public/xstream/xstream-test/index.html

That said, some information snippets are provided here.

The following annotations (debug/informational/warning/error messages) were provided:
 -WARNING- Overriding Maven settings: [/srv/gump/public/workspace/xstream/xstream/gump_mvn_settings.xml]
 -DEBUG- (Gump generated) Maven Settings in: /srv/gump/public/workspace/xstream/xstream/gump_mvn_settings.xml
 -INFO- Failed with reason build failed
 -DEBUG- Maven POM in: /srv/gump/public/workspace/xstream/xstream/pom.xml
 -INFO- Project Reports in: /srv/gump/public/workspace/xstream/xstream/target/surefire-reports



The following work was performed:
http://vmgump.apache.org/gump/public/xstream/xstream-test/gump_work/build_xstream_xstream-test.html
Work Name: build_xstream_xstream-test (Type: Build)
Work ended in a state of : Failed
Elapsed: 1 min 1 sec
Command Line: /opt/maven2/bin/mvn --batch-mode --settings /srv/gump/public/workspace/xstream/xstream/gump_mvn_settings.xml test 
[Working Directory: /srv/gump/public/workspace/xstream/xstream]
M2_HOME: /opt/maven2
---------------------------------------------
Tests run: 2, Failures: 0, Errors: 0, Skipped: 0, Time elapsed: 0.035 sec
Running com.thoughtworks.acceptance.CustomSerializationTest
Tests run: 11, Failures: 0, Errors: 0, Skipped: 0, Time elapsed: 0.06 sec
Running com.thoughtworks.xstream.core.TreeMarshallerTest
Tests run: 1, Failures: 0, Errors: 0, Skipped: 0, Time elapsed: 0.006 sec
Running com.thoughtworks.acceptance.FinalFieldsTest
Tests run: 2, Failures: 0, Errors: 0, Skipped: 0, Time elapsed: 0.007 sec
Running com.thoughtworks.xstream.io.xml.SjsxpStaxWriterTest
Tests run: 10, Failures: 0, Errors: 0, Skipped: 0, Time elapsed: 0.053 sec
Running com.thoughtworks.acceptance.AbsoluteSingleNodeXPathCircularReferenceTest
Tests run: 7, Failures: 0, Errors: 0, Skipped: 0, Time elapsed: 0.023 sec
Running com.thoughtworks.xstream.core.util.ThreadSafeSimpleDateFormatTest
Tests run: 1, Failures: 0, Errors: 0, Skipped: 0, Time elapsed: 1.524 sec
Running com.thoughtworks.xstream.converters.javabean.JavaBeanConverterTest
Tests run: 8, Failures: 0, Errors: 0, Skipped: 0, Time elapsed: 0.171 sec
Running com.thoughtworks.acceptance.XStream11XmlFriendlyTest
Tests run: 4, Failures: 0, Errors: 0, Skipped: 0, Time elapsed: 0.092 sec
Running com.thoughtworks.xstream.io.xml.XomReaderTest
Tests run: 13, Failures: 0, Errors: 0, Skipped: 0, Time elapsed: 0.037 sec
Running com.thoughtworks.xstream.io.json.JsonHierarchicalStreamDriverTest
Tests run: 22, Failures: 0, Errors: 0, Skipped: 0, Time elapsed: 0.106 sec
Running com.thoughtworks.xstream.io.xml.PrettyPrintWriterTest
Tests run: 18, Failures: 0, Errors: 0, Skipped: 0, Time elapsed: 0.035 sec
Running com.thoughtworks.acceptance.DefaultImplementationTest
Tests run: 2, Failures: 0, Errors: 0, Skipped: 0, Time elapsed: 0.02 sec
Running com.thoughtworks.xstream.core.util.OrderRetainingMapTest
Tests run: 4, Failures: 0, Errors: 0, Skipped: 0, Time elapsed: 0.002 sec
Running com.thoughtworks.acceptance.IDDuplicateReferenceTest
Tests run: 10, Failures: 0, Errors: 0, Skipped: 0, Time elapsed: 0.069 sec

Results :

Failed tests: 
  testEnforceSameSystemHashCodeForGCedObjects(com.thoughtworks.xstream.core.util.ObjectIdDictionaryTest)

Tests run: 1161, Failures: 1, Errors: 0, Skipped: 0

[INFO] ------------------------------------------------------------------------
[ERROR] BUILD FAILURE
[INFO] ------------------------------------------------------------------------
[INFO] There are test failures.

Please refer to /srv/gump/public/workspace/xstream/xstream/target/surefire-reports for the individual test results.
[INFO] ------------------------------------------------------------------------
[INFO] For more information, run Maven with the -e switch
[INFO] ------------------------------------------------------------------------
[INFO] Total time: 1 minute 
[INFO] Finished at: Sat Nov 06 14:54:07 UTC 2010
[INFO] Final Memory: 32M/77M
[INFO] ------------------------------------------------------------------------
---------------------------------------------

To subscribe to this information via syndicated feeds:
- RSS: http://vmgump.apache.org/gump/public/xstream/xstream-test/rss.xml
- Atom: http://vmgump.apache.org/gump/public/xstream/xstream-test/atom.xml

============================== Gump Tracking Only ===
Produced by Gump version 2.3.
Gump Run 11000606112010, vmgump.apache.org:vmgump:11000606112010
Gump E-mail Identifier (unique within run) #18.

*********************************************************** G U M P
[GUMP@vmgump]: Project apache-mime4j-reactor (in module james-mime4j) failed
To whom it may engage...
        
This is an automated request, but not an unsolicited one. For 
more information please visit http://gump.apache.org/nagged.html, 
and/or contact the folk at general@gump.apache.org.

Project apache-mime4j-reactor has an issue affecting its community integration.
This issue affects 1 projects,
 and has been outstanding for 27 runs.
The current state of this project is 'Failed', with reason 'Build Failed'.
For reference only, the following projects are affected by this:
    - apache-mime4j-reactor :  Java stream based MIME message parser


Full details are available at:
    http://vmgump.apache.org/gump/public/james-mime4j/apache-mime4j-reactor/index.html

That said, some information snippets are provided here.

The following annotations (debug/informational/warning/error messages) were provided:
 -WARNING- Overriding Maven settings: [/srv/gump/public/workspace/james-mime4j/gump_mvn_settings.xml]
 -DEBUG- (Gump generated) Maven Settings in: /srv/gump/public/workspace/james-mime4j/gump_mvn_settings.xml
 -INFO- Failed with reason build failed
 -DEBUG- Maven POM in: /srv/gump/public/workspace/james-mime4j/pom.xml



The following work was performed:
http://vmgump.apache.org/gump/public/james-mime4j/apache-mime4j-reactor/gump_work/build_james-mime4j_apache-mime4j-reactor.html
Work Name: build_james-mime4j_apache-mime4j-reactor (Type: Build)
Work ended in a state of : Failed
Elapsed: 59 secs
Command Line: /opt/maven2/bin/mvn --batch-mode --settings /srv/gump/public/workspace/james-mime4j/gump_mvn_settings.xml package 
[Working Directory: /srv/gump/public/workspace/james-mime4j]
M2_HOME: /opt/maven2
---------------------------------------------
Tests run: 1, Failures: 0, Errors: 0, Skipped: 0, Time elapsed: 0.009 sec
Running org.apache.james.mime4j.TestUtil
Tests run: 0, Failures: 0, Errors: 0, Skipped: 0, Time elapsed: 0.003 sec
Running org.apache.james.mime4j.io.PositionInputStreamTest
Tests run: 1, Failures: 0, Errors: 0, Skipped: 0, Time elapsed: 0.005 sec
Running org.apache.james.mime4j.stream.MimeTokenNoRecurseTest
Tests run: 4, Failures: 0, Errors: 0, Skipped: 0, Time elapsed: 0.009 sec
Running org.apache.james.mime4j.parser.MimeStreamParserTest
Tests run: 11, Failures: 0, Errors: 0, Skipped: 0, Time elapsed: 0.024 sec
Running org.apache.james.mime4j.codec.DecoderUtilTest
Tests run: 13, Failures: 0, Errors: 0, Skipped: 0, Time elapsed: 0.054 sec
Running org.apache.james.mime4j.MimeExceptionTest
Tests run: 3, Failures: 0, Errors: 0, Skipped: 0, Time elapsed: 0.003 sec
Running org.apache.james.mime4j.codec.QuotedPrintableEncodeTest
Tests run: 5, Failures: 0, Errors: 0, Skipped: 0, Time elapsed: 0.027 sec
Running org.apache.james.mime4j.MimeIOExceptionTest
Tests run: 1, Failures: 0, Errors: 0, Skipped: 0, Time elapsed: 0.007 sec
Running org.apache.james.mime4j.codec.QuotedPrintableInputStreamTest
Tests run: 19, Failures: 0, Errors: 0, Skipped: 0, Time elapsed: 0.012 sec
Running org.apache.james.mime4j.stream.MimeTokenStreamBodyDescriptorTest
Tests run: 2, Failures: 0, Errors: 0, Skipped: 0, Time elapsed: 0.009 sec
Running org.apache.james.mime4j.codec.CodecUtilTest
Tests run: 5, Failures: 0, Errors: 0, Skipped: 0, Time elapsed: 0.053 sec
Running org.apache.james.mime4j.stream.MultipartStreamTest
Tests run: 2, Failures: 0, Errors: 0, Skipped: 0, Time elapsed: 0.015 sec

Results :

Tests run: 225, Failures: 0, Errors: 0, Skipped: 0

[INFO] [jar:jar {execution: default-jar}]
[INFO] Building jar: /srv/gump/public/workspace/james-mime4j/core/target/apache-mime4j-core-0.7-SNAPSHOT.jar
[INFO] [jar:test-jar {execution: default}]
[INFO] Building jar: /srv/gump/public/workspace/james-mime4j/core/target/apache-mime4j-core-0.7-SNAPSHOT-tests.jar
[INFO] [javadoc:jar {execution: javadoc-jar}]
[ERROR] Error fetching link: http://java.sun.com/j2se/1.5.0/docs/api/package-list. Ignored it.
[INFO] The goal 'org.apache.maven.plugins:maven-javadoc-plugin:2.6.1:javadoc' has not be previously called for the project: 'org.apache.james:apache-mime4j-benchmark:jar:0.7-SNAPSHOT'. Trying to invoke it...
[ERROR] MavenInvocationException: Error when invoking Maven, consult the invoker log file: /srv/gump/public/workspace/james-mime4j/core/target/invoker/maven-javadoc-plugin1161998411.txt
[INFO] ------------------------------------------------------------------------
[ERROR] BUILD ERROR
[INFO] ------------------------------------------------------------------------
[INFO] MavenReportException: Error while creating archive:Error when invoking Maven, consult the invoker log file: /srv/gump/public/workspace/james-mime4j/core/target/invoker/maven-javadoc-plugin1161998411.txt

[INFO] ------------------------------------------------------------------------
[INFO] For more information, run Maven with the -e switch
[INFO] ------------------------------------------------------------------------
[INFO] Total time: 58 seconds
[INFO] Finished at: Sat Nov 06 14:57:15 UTC 2010
[INFO] Final Memory: 61M/147M
[INFO] ------------------------------------------------------------------------
---------------------------------------------

To subscribe to this information via syndicated feeds:
- RSS: http://vmgump.apache.org/gump/public/james-mime4j/apache-mime4j-reactor/rss.xml
- Atom: http://vmgump.apache.org/gump/public/james-mime4j/apache-mime4j-reactor/atom.xml

============================== Gump Tracking Only ===
Produced by Gump version 2.3.
Gump Run 11000606112010, vmgump.apache.org:vmgump:11000606112010
Gump E-mail Identifier (unique within run) #19.

*********************************************************** G U M P
[GUMP@vmgump]: Project commons-jci-reactor (in module apache-commons) failed
To whom it may engage...
        
This is an automated request, but not an unsolicited one. For 
more information please visit http://gump.apache.org/nagged.html, 
and/or contact the folk at general@gump.apache.org.

Project commons-jci-reactor has an issue affecting its community integration.
This issue affects 1 projects,
 and has been outstanding for 2 runs.
The current state of this project is 'Failed', with reason 'Build Failed'.
For reference only, the following projects are affected by this:
    - commons-jci-reactor :  Apache Commons


Full details are available at:
    http://vmgump.apache.org/gump/public/apache-commons/commons-jci-reactor/index.html

That said, some information snippets are provided here.

The following annotations (debug/informational/warning/error messages) were provided:
 -WARNING- Overriding Maven settings: [/srv/gump/public/workspace/apache-commons/jci/gump_mvn_settings.xml]
 -DEBUG- (Gump generated) Maven Settings in: /srv/gump/public/workspace/apache-commons/jci/gump_mvn_settings.xml
 -INFO- Failed with reason build failed
 -DEBUG- Maven POM in: /srv/gump/public/workspace/apache-commons/jci/pom.xml
 -INFO- Project Reports in: /srv/gump/public/workspace/apache-commons/jci/compilers/groovy/target/surefire-reports



The following work was performed:
http://vmgump.apache.org/gump/public/apache-commons/commons-jci-reactor/gump_work/build_apache-commons_commons-jci-reactor.html
Work Name: build_apache-commons_commons-jci-reactor (Type: Build)
Work ended in a state of : Failed
Elapsed: 3 mins 50 secs
Command Line: /opt/maven2/bin/mvn --batch-mode --settings /srv/gump/public/workspace/apache-commons/jci/gump_mvn_settings.xml package 
[Working Directory: /srv/gump/public/workspace/apache-commons/jci]
M2_HOME: /opt/maven2
---------------------------------------------
Downloading: http://localhost:8192/maven2/asm/asm-analysis/2.2.1/asm-analysis-2.2.1.jar
17K downloaded  (asm-analysis-2.2.1.jar)
Downloading: http://localhost:8192/maven2/asm/asm-tree/2.2.1/asm-tree-2.2.1.jar
21K downloaded  (asm-tree-2.2.1.jar)
Downloading: http://localhost:8192/maven2/asm/asm-attrs/2.2.1/asm-attrs-2.2.1.jar


[INFO] [antrun:run {execution: javadoc.resources}]
[INFO] Executing tasks
[INFO] Executed tasks
[INFO] [remote-resources:process {execution: default}]
[INFO] [resources:resources {execution: default-resources}]
[INFO] Using 'iso-8859-1' encoding to copy filtered resources.
[INFO] Copying 0 resource to META-INF
[INFO] [compiler:compile {execution: default-compile}]
[INFO] Compiling 6 source files to /srv/gump/public/workspace/apache-commons/jci/compilers/javac/target/classes
[INFO] -------------------------------------------------------------
[ERROR] COMPILATION ERROR : 
[INFO] -------------------------------------------------------------
[ERROR] /srv/gump/public/workspace/apache-commons/jci/compilers/javac/src/main/java/org/apache/commons/jci/compilers/JavacClassLoader.java:[108,46] cannot find symbol
symbol  : constructor ClassWriter(boolean,boolean)
location: class org.objectweb.asm.ClassWriter

[ERROR] /srv/gump/public/workspace/apache-commons/jci/compilers/javac/src/main/java/org/apache/commons/jci/compilers/JavacClassLoader.java:[109,44] cannot find symbol
symbol  : method accept(org.vafer.dependency.asm.RenamingVisitor,boolean)
location: class org.objectweb.asm.ClassReader

[INFO] 2 errors 
[INFO] -------------------------------------------------------------
[INFO] ------------------------------------------------------------------------
[ERROR] BUILD FAILURE
[INFO] ------------------------------------------------------------------------
[INFO] Compilation failure

/srv/gump/public/workspace/apache-commons/jci/compilers/javac/src/main/java/org/apache/commons/jci/compilers/JavacClassLoader.java:[108,46] cannot find symbol
symbol  : constructor ClassWriter(boolean,boolean)
location: class org.objectweb.asm.ClassWriter

/srv/gump/public/workspace/apache-commons/jci/compilers/javac/src/main/java/org/apache/commons/jci/compilers/JavacClassLoader.java:[109,44] cannot find symbol
symbol  : method accept(org.vafer.dependency.asm.RenamingVisitor,boolean)
location: class org.objectweb.asm.ClassReader


[INFO] ------------------------------------------------------------------------
[INFO] For more information, run Maven with the -e switch
[INFO] ------------------------------------------------------------------------
[INFO] Total time: 3 minutes 48 seconds
[INFO] Finished at: Sat Nov 06 15:16:16 UTC 2010
[INFO] Final Memory: 78M/186M
[INFO] ------------------------------------------------------------------------
---------------------------------------------

To subscribe to this information via syndicated feeds:
- RSS: http://vmgump.apache.org/gump/public/apache-commons/commons-jci-reactor/rss.xml
- Atom: http://vmgump.apache.org/gump/public/apache-commons/commons-jci-reactor/atom.xml

============================== Gump Tracking Only ===
Produced by Gump version 2.3.
Gump Run 11000606112010, vmgump.apache.org:vmgump:11000606112010
Gump E-mail Identifier (unique within run) #20.

*********************************************************** G U M P
[GUMP@vmgump]: Project james-jsieve (in module james-jsieve) failed
To whom it may engage...
        
This is an automated request, but not an unsolicited one. For 
more information please visit http://gump.apache.org/nagged.html, 
and/or contact the folk at general@gump.apache.org.

Project james-jsieve has an issue affecting its community integration.
This issue affects 1 projects,
 and has been outstanding for 222 runs.
The current state of this project is 'Failed', with reason 'Build Failed'.
For reference only, the following projects are affected by this:
    - james-jsieve :  Implements JSIEVE Mail Filtering Language


Full details are available at:
    http://vmgump.apache.org/gump/public/james-jsieve/james-jsieve/index.html

That said, some information snippets are provided here.

The following annotations (debug/informational/warning/error messages) were provided:
 -WARNING- Overriding Maven settings: [/srv/gump/public/workspace/james-jsieve/gump_mvn_settings.xml]
 -DEBUG- (Gump generated) Maven Settings in: /srv/gump/public/workspace/james-jsieve/gump_mvn_settings.xml
 -INFO- Failed with reason build failed
 -DEBUG- Maven POM in: /srv/gump/public/workspace/james-jsieve/pom.xml



The following work was performed:
http://vmgump.apache.org/gump/public/james-jsieve/james-jsieve/gump_work/build_james-jsieve_james-jsieve.html
Work Name: build_james-jsieve_james-jsieve (Type: Build)
Work ended in a state of : Failed
Elapsed: 19 secs
Command Line: /opt/maven2/bin/mvn --batch-mode --settings /srv/gump/public/workspace/james-jsieve/gump_mvn_settings.xml install 
[Working Directory: /srv/gump/public/workspace/james-jsieve]
M2_HOME: /opt/maven2
---------------------------------------------
[INFO]   Apache JAMES jSieve Utilities
[INFO]   Apache JAMES jSieve Assembly
[INFO] ------------------------------------------------------------------------
[INFO] Building Apache JAMES JSieve Project
[INFO]    task-segment: [install]
[INFO] ------------------------------------------------------------------------
[INFO] Setting property: classpath.resource.loader.class => 'org.codehaus.plexus.velocity.ContextClassLoaderResourceLoader'.
[INFO] Setting property: velocimacro.messages.on => 'false'.
[INFO] Setting property: resource.loader => 'classpath'.
[INFO] Setting property: resource.manager.logwhenfound => 'false'.
[INFO] [remote-resources:process {execution: default}]
[INFO] [site:attach-descriptor {execution: default-attach-descriptor}]
[INFO] Unable to load parent project from a relative path: Could not find the model file '/srv/gump/public/workspace/pom.xml'. for project unknown
[INFO] Parent project loaded from repository.
[INFO] [install:install {execution: default-install}]
[INFO] Installing /srv/gump/public/workspace/james-jsieve/pom.xml to /srv/gump/public/workspace/mvnlocalrepo/shared/org/apache/james/jsieve-project/0.5-SNAPSHOT/jsieve-project-0.5-SNAPSHOT.pom
[INFO] ------------------------------------------------------------------------
[INFO] Building Apache JAMES jSieve
[INFO]    task-segment: [install]
[INFO] ------------------------------------------------------------------------
[INFO] [javacc:jjtree-javacc {execution: generate-jjtree}]
[INFO] Skipping - all parsers are up to date
[INFO] [remote-resources:process {execution: default}]
[INFO] [resources:resources {execution: default-resources}]
[INFO] Using 'UTF-8' encoding to copy filtered resources.
[INFO] Copying 3 resources
[INFO] Copying 3 resources
[INFO] [compiler:compile {execution: default-compile}]
[INFO] Nothing to compile - all classes are up to date
[INFO] [bundle:manifest {execution: bundle-manifest}]
[INFO] [resources:testResources {execution: default-testResources}]
[INFO] Using 'UTF-8' encoding to copy filtered resources.
[INFO] Copying 2 resources
[INFO] Copying 3 resources
[INFO] [compiler:testCompile {execution: default-testCompile}]
[INFO] Compiling 50 source files to /srv/gump/public/workspace/james-jsieve/main/target/test-classes
[INFO] ------------------------------------------------------------------------
[ERROR] BUILD FAILURE
[INFO] ------------------------------------------------------------------------
[INFO] Compilation failure
/srv/gump/public/workspace/james-jsieve/main/src/test/java/org/apache/jsieve/AllTests.java:[31,21] package junit.swingui does not exist


[INFO] ------------------------------------------------------------------------
[INFO] For more information, run Maven with the -e switch
[INFO] ------------------------------------------------------------------------
[INFO] Total time: 18 seconds
[INFO] Finished at: Sat Nov 06 15:37:42 UTC 2010
[INFO] Final Memory: 47M/115M
[INFO] ------------------------------------------------------------------------
---------------------------------------------

To subscribe to this information via syndicated feeds:
- RSS: http://vmgump.apache.org/gump/public/james-jsieve/james-jsieve/rss.xml
- Atom: http://vmgump.apache.org/gump/public/james-jsieve/james-jsieve/atom.xml

============================== Gump Tracking Only ===
Produced by Gump version 2.3.
Gump Run 11000606112010, vmgump.apache.org:vmgump:11000606112010
Gump E-mail Identifier (unique within run) #24.

*********************************************************** G U M P
[GUMP@vmgump]: Project castor-reactor (in module castor) failed
To whom it may engage...
        
This is an automated request, but not an unsolicited one. For 
more information please visit http://gump.apache.org/nagged.html, 
and/or contact the folk at general@gump.apache.org.

Project castor-reactor has an issue affecting its community integration.
This issue affects 21 projects,
 and has been outstanding for 15 runs.
The current state of this project is 'Failed', with reason 'Build Failed'.
For reference only, the following projects are affected by this:
    - castor :  Java to XML, SQL, LDAP bindings
    - castor-reactor :  Java to XML, SQL, LDAP bindings
    - castor-test :  Java to XML, SQL, LDAP bindings
    - commons-chain :  GoF "Chain of Responsibility" pattern
    - commons-fileupload :  Commons File Upload Package
    - fulcrum-intake :  Services Framework
    - fulcrum-parser :  Services Framework
    - fulcrum-upload :  Services Framework
    - jakarta-tomcat-4.0 :  Servlet 2.3 and JSP 1.2 Reference Implementation
    - jakarta-tomcat-catalina :  Servlet 2.4 Reference Implementation
    - jakarta-tomcat-coyote-tomcat4 :  Connectors to various web servers
    - jakarta-tomcat-jk :  Connectors to various web servers
    - portals-pluto-api-1.0 :  JSR168 Container
    - portals-pluto-container-1.0 :  JSR168 Container
    - portals-pluto-deploy-1.0 :  JSR168 Container
    - portals-pluto-descriptors-1.0 :  JSR168 Container
    - portals-pluto-portal-1.0 :  JSR168 Container
    - solr :  Java Based Search Engine
    - solr-test :  Java Based Search Engine
    - tomcat-catalina :  Servlet 2.3 and JSP 1.2 Reference Implementation
    - xml-xindice :  native XML database


Full details are available at:
    http://vmgump.apache.org/gump/public/castor/castor-reactor/index.html

That said, some information snippets are provided here.

The following annotations (debug/informational/warning/error messages) were provided:
 -DEBUG- (Gump generated) Maven Settings in: /srv/gump/public/workspace/castor/gump_mvn_settings.xml
 -INFO- Failed with reason build failed
 -DEBUG- Maven POM in: /srv/gump/public/workspace/castor/pom.xml



The following work was performed:
http://vmgump.apache.org/gump/public/castor/castor-reactor/gump_work/build_castor_castor-reactor.html
Work Name: build_castor_castor-reactor (Type: Build)
Work ended in a state of : Failed
Elapsed: 4 mins 39 secs
Command Line: /opt/maven2/bin/mvn --batch-mode -DskipTests=true --settings /srv/gump/public/workspace/castor/gump_mvn_settings.xml package 
[Working Directory: /srv/gump/public/workspace/castor]
M2_HOME: /opt/maven2
---------------------------------------------
[INFO] [compiler:compile {execution: default-compile}]
[INFO] Nothing to compile - all classes are up to date
[INFO] [resources:testResources {execution: default-testResources}]
[INFO] Using 'UTF-8' encoding to copy filtered resources.
[INFO] Copying 6 resources
[INFO] [compiler:testCompile {execution: default-testCompile}]
[INFO] Compiling 32 source files to /srv/gump/public/workspace/castor/xmlctf/target/test-classes
[INFO] [surefire:test {execution: default-test}]
[INFO] Tests are skipped.
[INFO] [jar:jar {execution: default-jar}]
[INFO] Building jar: /srv/gump/public/workspace/castor/xmlctf/target/castor-testsuite-xml-1.3.2-SNAPSHOT.jar
[INFO] Preparing source:jar
[INFO] snapshot org.codehaus.castor:castor-maven-plugins:1.3.2-SNAPSHOT: checking for updates from Maven Codehaus Snapshots
Downloading: http://nexus.codehaus.org/snapshots//org/codehaus/castor/castor-maven-plugins/1.3.2-SNAPSHOT/castor-maven-plugins-1.3.2-SNAPSHOT.jar
[INFO] Unable to find resource 'org.codehaus.castor:castor-maven-plugins:maven-plugin:1.3.2-SNAPSHOT' in repository Maven Codehaus Snapshots (http://nexus.codehaus.org/snapshots/)
[INFO] ------------------------------------------------------------------------
[ERROR] BUILD FAILURE
[INFO] ------------------------------------------------------------------------
[INFO] A required plugin was not found: Plugin could not be found - check that the goal name is correct: Unable to download the artifact from any repository

Try downloading the file manually from the project website.

Then, install it using the command: 
    mvn install:install-file -DgroupId=org.codehaus.castor -DartifactId=castor-maven-plugins -Dversion=1.3.2-SNAPSHOT -Dpackaging=maven-plugin -Dfile=/path/to/file

Alternatively, if you host your own repository you can deploy the file there: 
    mvn deploy:deploy-file -DgroupId=org.codehaus.castor -DartifactId=castor-maven-plugins -Dversion=1.3.2-SNAPSHOT -Dpackaging=maven-plugin -Dfile=/path/to/file -Durl=[url] -DrepositoryId=[id]


  org.codehaus.castor:castor-maven-plugins:maven-plugin:1.3.2-SNAPSHOT

from the specified remote repositories:
  gump-central (http://localhost:8192/maven2),
  Maven Codehaus Snapshots (http://nexus.codehaus.org/snapshots/)


  org.codehaus.castor:castor-maven-plugins:maven-plugin:1.3.2-SNAPSHOT

from the specified remote repositories:
  gump-central (http://localhost:8192/maven2),
  Maven Codehaus Snapshots (http://nexus.codehaus.org/snapshots/)


[INFO] ------------------------------------------------------------------------
[INFO] For more information, run Maven with the -e switch
[INFO] ------------------------------------------------------------------------
[INFO] Total time: 4 minutes 33 seconds
[INFO] Finished at: Sat Nov 06 15:43:22 UTC 2010
[INFO] Final Memory: 151M/361M
[INFO] ------------------------------------------------------------------------
---------------------------------------------

To subscribe to this information via syndicated feeds:
- RSS: http://vmgump.apache.org/gump/public/castor/castor-reactor/rss.xml
- Atom: http://vmgump.apache.org/gump/public/castor/castor-reactor/atom.xml

============================== Gump Tracking Only ===
Produced by Gump version 2.3.
Gump Run 11000606112010, vmgump.apache.org:vmgump:11000606112010
Gump E-mail Identifier (unique within run) #25.

*********************************************************** G U M P
[GUMP@vmgump]: Project camel-spring-test (in module camel) failed
To whom it may engage...
        
This is an automated request, but not an unsolicited one. For 
more information please visit http://gump.apache.org/nagged.html, 
and/or contact the folk at general@gump.apache.org.

Project camel-spring-test has an issue affecting its community integration.
This issue affects 1 projects.
The current state of this project is 'Failed', with reason 'Build Failed'.
For reference only, the following projects are affected by this:
    - camel-spring-test :  Integration framework based on known Enterprise Integration
...


Full details are available at:
    http://vmgump.apache.org/gump/public/camel/camel-spring-test/index.html

That said, some information snippets are provided here.

The following annotations (debug/informational/warning/error messages) were provided:
 -WARNING- Overriding Maven settings: [/srv/gump/public/workspace/camel/components/camel-spring/gump_mvn_settings.xml]
 -DEBUG- (Gump generated) Maven Settings in: /srv/gump/public/workspace/camel/components/camel-spring/gump_mvn_settings.xml
 -INFO- Failed with reason build failed
 -DEBUG- Maven POM in: /srv/gump/public/workspace/camel/components/camel-spring/pom.xml
 -INFO- Project Reports in: /srv/gump/public/workspace/camel/components/camel-spring/target/surefire-reports



The following work was performed:
http://vmgump.apache.org/gump/public/camel/camel-spring-test/gump_work/build_camel_camel-spring-test.html
Work Name: build_camel_camel-spring-test (Type: Build)
Work ended in a state of : Failed
Elapsed: 18 mins 48 secs
Command Line: /opt/maven2/bin/mvn --batch-mode --settings /srv/gump/public/workspace/camel/components/camel-spring/gump_mvn_settings.xml test 
[Working Directory: /srv/gump/public/workspace/camel/components/camel-spring]
M2_HOME: /opt/maven2
---------------------------------------------
Tests run: 2, Failures: 0, Errors: 0, Skipped: 0, Time elapsed: 2.119 sec
Running org.apache.camel.spring.issues.StringDataFormatTest
Tests run: 2, Failures: 0, Errors: 0, Skipped: 0, Time elapsed: 2.339 sec
Running org.apache.camel.spring.issues.contextscan2.SpringRouteIsComponentAnnotated2Test
Tests run: 1, Failures: 0, Errors: 0, Skipped: 0, Time elapsed: 1.119 sec
Running org.apache.camel.spring.processor.SpringTokenizerTest
Tests run: 1, Failures: 0, Errors: 0, Skipped: 0, Time elapsed: 1.052 sec
Running org.apache.camel.spring.processor.SpringSplitterNoStopOnExceptionTest
Tests run: 2, Failures: 0, Errors: 0, Skipped: 0, Time elapsed: 2.512 sec
Running org.apache.camel.component.properties.SpringPropertiesComponentEIPChoiceConvertBodyToTest
Tests run: 2, Failures: 0, Errors: 0, Skipped: 0, Time elapsed: 2.027 sec
Running org.apache.camel.spring.processor.SpringInterceptSendToEndpointTest
Tests run: 1, Failures: 0, Errors: 0, Skipped: 0, Time elapsed: 1.034 sec
Running org.apache.camel.spring.config.SpringProduceInjectedPrototypeBeanTest
Tests run: 2, Failures: 0, Errors: 0, Skipped: 0, Time elapsed: 2.285 sec
Running org.apache.camel.spring.file.SpringFileConsumerPreMoveIssueTest
Tests run: 1, Failures: 0, Errors: 0, Skipped: 0, Time elapsed: 2.076 sec
Running org.apache.camel.spring.processor.onexception.RedeliveryPolicyReTest
Tests run: 2, Failures: 0, Errors: 0, Skipped: 0, Time elapsed: 4.566 sec
Running org.apache.camel.spring.example.PojoConsumerTest
Tests run: 1, Failures: 0, Errors: 0, Skipped: 0, Time elapsed: 1.081 sec
Running org.apache.camel.spring.interceptor.SpringTransactionalClientDataWithOnExceptionAndRollbackUsingTransactedTest
Tests run: 2, Failures: 0, Errors: 0, Skipped: 0, Time elapsed: 2.31 sec
Running org.apache.camel.spring.processor.SpringInterceptSendToEndpointDynamicTest
Tests run: 2, Failures: 0, Errors: 0, Skipped: 0, Time elapsed: 2.088 sec
Running org.apache.camel.spring.processor.SpringCBRHeaderPredicateTest
Tests run: 1, Failures: 0, Errors: 0, Skipped: 0, Time elapsed: 1.018 sec
Running org.apache.camel.spring.config.RouteBuilderRef2Test
Tests run: 1, Failures: 0, Errors: 0, Skipped: 0, Time elapsed: 1.073 sec

Results :

Failed tests: 
  testNoXsltFile(org.apache.camel.component.xslt.XsltFileNotFoundTest)

Tests run: 750, Failures: 1, Errors: 0, Skipped: 1

[INFO] ------------------------------------------------------------------------
[ERROR] BUILD FAILURE
[INFO] ------------------------------------------------------------------------
[INFO] There are test failures.

Please refer to /srv/gump/public/workspace/camel/components/camel-spring/target/surefire-reports for the individual test results.
[INFO] ------------------------------------------------------------------------
[INFO] For more information, run Maven with the -e switch
[INFO] ------------------------------------------------------------------------
[INFO] Total time: 18 minutes 46 seconds
[INFO] Finished at: Sat Nov 06 16:24:59 UTC 2010
[INFO] Final Memory: 71M/170M
[INFO] ------------------------------------------------------------------------
---------------------------------------------

To subscribe to this information via syndicated feeds:
- RSS: http://vmgump.apache.org/gump/public/camel/camel-spring-test/rss.xml
- Atom: http://vmgump.apache.org/gump/public/camel/camel-spring-test/atom.xml

============================== Gump Tracking Only ===
Produced by Gump version 2.3.
Gump Run 11000606112010, vmgump.apache.org:vmgump:11000606112010
Gump E-mail Identifier (unique within run) #27.

*********************************************************** G U M P
[GUMP@vmgump]: Project htmlunit (in module htmlunit) failed
To whom it may engage...
        
This is an automated request, but not an unsolicited one. For 
more information please visit http://gump.apache.org/nagged.html, 
and/or contact the folk at general@gump.apache.org.

Project htmlunit has an issue affecting its community integration.
This issue affects 1 projects,
 and has been outstanding for 242 runs.
The current state of this project is 'Failed', with reason 'Build Failed'.
For reference only, the following projects are affected by this:
    - htmlunit :  A tool for testing web based applications


Full details are available at:
    http://vmgump.apache.org/gump/public/htmlunit/htmlunit/index.html

That said, some information snippets are provided here.

The following annotations (debug/informational/warning/error messages) were provided:
 -DEBUG- Sole jar output [htmlunit-*[0-9T].jar] identifier set to project name
 -INFO- Optional dependency apache-mime4j-reactor failed with reason build failed
 -INFO- Optional dependency commons-fileupload prerequisite failed with reason build failed
 -DEBUG- (Gump generated) Maven Settings in: /srv/gump/public/workspace/htmlunit/htmlunit/gump_mvn_settings.xml
 -INFO- Failed with reason build failed
 -DEBUG- Maven POM in: /srv/gump/public/workspace/htmlunit/htmlunit/pom.xml
 -INFO- Failed to extract fallback artifacts from Gump Repository



The following work was performed:
http://vmgump.apache.org/gump/public/htmlunit/htmlunit/gump_work/build_htmlunit_htmlunit.html
Work Name: build_htmlunit_htmlunit (Type: Build)
Work ended in a state of : Failed
Elapsed: 1 min 26 secs
Command Line: /opt/maven2/bin/mvn --batch-mode --settings /srv/gump/public/workspace/htmlunit/htmlunit/gump_mvn_settings.xml package 
[Working Directory: /srv/gump/public/workspace/htmlunit/htmlunit]
M2_HOME: /opt/maven2
---------------------------------------------

Downloading: http://localhost:8192/maven2/com/google/guava/guava/r07/guava-r07.pom

Downloading: http://localhost:8192/maven2/com/google/google/5/google-5.pom

Downloading: http://localhost:8192/maven2/org/apache/httpcomponents/httpclient/4.0.2/httpclient-4.0.2.pom

Downloading: http://localhost:8192/maven2/org/apache/httpcomponents/httpcomponents-client/4.0.2/httpcomponents-client-4.0.2.pom

Downloading: http://htmlunit.sourceforge.net/m2-repo-snapshots/net/sourceforge/htmlunit/htmlunit-core-js/2.9-SNAPSHOT/htmlunit-core-js-2.9-SNAPSHOT.jar
Downloading: http://localhost:8192/maven2/net/sourceforge/cssparser/cssparser/0.9.5/cssparser-0.9.5.jar
Downloading: http://localhost:8192/maven2/org/apache/httpcomponents/httpclient/4.0.3/httpclient-4.0.3.jar
Downloading: http://build.canoo.com/NekoHTML/artifacts/m2-repo/net/sourceforge/nekohtml/nekohtml/1.9.15-SNAPSHOT/nekohtml-1.9.15-20101026.093020-2.jar
Downloading: http://localhost:8192/maven2/org/w3c/css/sac/1.3/sac-1.3.jar
339K downloaded  (httpclient-4.0.3.jar)
Downloading: http://localhost:8192/maven2/org/apache/httpcomponents/httpcore/4.0.1/httpcore-4.0.1.jar
176K downloaded  (httpcore-4.0.1.jar)
Downloading: http://localhost:8192/maven2/org/apache/httpcomponents/httpmime/4.0.3/httpmime-4.0.3.jar
26K downloaded  (httpmime-4.0.3.jar)



892K downloaded  (htmlunit-core-js-2.9-SNAPSHOT.jar)
[INFO] [compiler:compile {execution: default-compile}]
[INFO] Compiling 442 source files to /srv/gump/public/workspace/htmlunit/htmlunit/target/classes
[INFO] -------------------------------------------------------------
[ERROR] COMPILATION ERROR : 
[INFO] -------------------------------------------------------------
[ERROR] /srv/gump/public/workspace/htmlunit/htmlunit/src/main/java/com/gargoylesoftware/htmlunit/HttpWebConnection.java:[346,65] incompatible types
found   : org.apache.http.entity.mime.FormBodyPart
required: org.apache.james.mime4j.message.BodyPart

[INFO] 1error
[INFO] -------------------------------------------------------------
[INFO] ------------------------------------------------------------------------
[ERROR] BUILD FAILURE
[INFO] ------------------------------------------------------------------------
[INFO] Compilation failure
/srv/gump/public/workspace/htmlunit/htmlunit/src/main/java/com/gargoylesoftware/htmlunit/HttpWebConnection.java:[346,65] incompatible types
found   : org.apache.http.entity.mime.FormBodyPart
required: org.apache.james.mime4j.message.BodyPart


[INFO] ------------------------------------------------------------------------
[INFO] For more information, run Maven with the -e switch
[INFO] ------------------------------------------------------------------------
[INFO] Total time: 1 minute 24 seconds
[INFO] Finished at: Sat Nov 06 16:26:55 UTC 2010
[INFO] Final Memory: 41M/127M
[INFO] ------------------------------------------------------------------------
---------------------------------------------

To subscribe to this information via syndicated feeds:
- RSS: http://vmgump.apache.org/gump/public/htmlunit/htmlunit/rss.xml
- Atom: http://vmgump.apache.org/gump/public/htmlunit/htmlunit/atom.xml

============================== Gump Tracking Only ===
Produced by Gump version 2.3.
Gump Run 11000606112010, vmgump.apache.org:vmgump:11000606112010
Gump E-mail Identifier (unique within run) #28.

*********************************************************** G U M P
[GUMP@vmgump]: Project commons-jelly-tags-ant-test (in module commons-jelly) failed
To whom it may engage...
        
This is an automated request, but not an unsolicited one. For 
more information please visit http://gump.apache.org/nagged.html, 
and/or contact the folk at general@gump.apache.org.

Project commons-jelly-tags-ant-test has an issue affecting its community integration.
This issue affects 1 projects,
 and has been outstanding for 3 runs.
The current state of this project is 'Failed', with reason 'Build Failed'.
For reference only, the following projects are affected by this:
    - commons-jelly-tags-ant-test :  Commons Jelly


Full details are available at:
    http://vmgump.apache.org/gump/public/commons-jelly/commons-jelly-tags-ant-test/index.html

That said, some information snippets are provided here.

The following annotations (debug/informational/warning/error messages) were provided:
 -DEBUG- Dependency on ant exists, no need to add for property maven.jar.ant-optional.
 -DEBUG- Dependency on xml-xerces exists, no need to add for property maven.jar.xerces.
 -DEBUG- Dependency on commons-jexl-1.x exists, no need to add for property maven.jar.commons-jexl.
 -WARNING- Overriding Maven properties: [/srv/gump/public/workspace/commons-jelly/jelly-tags/ant/build.properties]
 -DEBUG- (Gump generated) Maven Properties in: /srv/gump/public/workspace/commons-jelly/jelly-tags/ant/build.properties
 -INFO- Failed with reason build failed
 -DEBUG- Maven POM in: /srv/gump/public/workspace/commons-jelly/jelly-tags/ant/project.xml
 -DEBUG- Maven project properties in: /srv/gump/public/workspace/commons-jelly/jelly-tags/ant/project.properties
 -INFO- Project Reports in: /srv/gump/public/workspace/commons-jelly/jelly-tags/ant/target/test-reports



The following work was performed:
http://vmgump.apache.org/gump/public/commons-jelly/commons-jelly-tags-ant-test/gump_work/build_commons-jelly_commons-jelly-tags-ant-test.html
Work Name: build_commons-jelly_commons-jelly-tags-ant-test (Type: Build)
Work ended in a state of : Failed
Elapsed: 16 secs
Command Line: maven --offline jar 
[Working Directory: /srv/gump/public/workspace/commons-jelly/jelly-tags/ant]
---------------------------------------------
    [junit] Actual expression: (${foo4.1})=(null)
    [junit] 	at org.apache.commons.jelly.tags.junit.AssertTagSupport.fail(AssertTagSupport.java:44)
    [junit] 	at org.apache.commons.jelly.tags.junit.AssertTagSupport.failNotEquals(AssertTagSupport.java:77)
    [junit] 	at org.apache.commons.jelly.tags.junit.AssertEqualsTag.doTag(AssertEqualsTag.java:56)
    [junit] 	at org.apache.commons.jelly.impl.TagScript.run(TagScript.java:267)
    [junit] 	at org.apache.commons.jelly.impl.ScriptBlock.run(ScriptBlock.java:96)
    [junit] 	at org.apache.commons.jelly.tags.junit.CaseTag$1.runTest(CaseTag.java:60)
    [junit] 
    [junit] 
    [junit] Testcase: startUpReadWrite(org.apache.commons.jelly.tags.junit.CaseTag$1):	Caused an ERROR
    [junit] file:/srv/gump/public/workspace/commons-jelly/jelly-tags/ant/target/test-classes/org/apache/commons/jelly/ant/suite.jelly:98:5: <test:assertEquals> file:/srv/gump/public/workspace/commons-jelly/jelly-tags/ant/target/test-classes/org/apache/commons/jelly/ant/suite.jelly:98:5: <test:assertEquals>  expected:[bar5] but was:[null]
    [junit] Expected expression: (bar5)=(bar5)
    [junit] Actual expression: (${foo5.1})=(null)
    [junit] org.apache.commons.jelly.JellyTagException: file:/srv/gump/public/workspace/commons-jelly/jelly-tags/ant/target/test-classes/org/apache/commons/jelly/ant/suite.jelly:98:5: <test:assertEquals> file:/srv/gump/public/workspace/commons-jelly/jelly-tags/ant/target/test-classes/org/apache/commons/jelly/ant/suite.jelly:98:5: <test:assertEquals>  expected:[bar5] but was:[null]
    [junit] Expected expression: (bar5)=(bar5)
    [junit] Actual expression: (${foo5.1})=(null)
    [junit] 	at org.apache.commons.jelly.impl.TagScript.handleException(TagScript.java:732)
    [junit] 	at org.apache.commons.jelly.impl.TagScript.run(TagScript.java:287)
    [junit] 	at org.apache.commons.jelly.impl.ScriptBlock.run(ScriptBlock.java:96)
    [junit] 	at org.apache.commons.jelly.tags.junit.CaseTag$1.runTest(CaseTag.java:60)
    [junit] Caused by: org.apache.commons.jelly.tags.junit.JellyAssertionFailedError: file:/srv/gump/public/workspace/commons-jelly/jelly-tags/ant/target/test-classes/org/apache/commons/jelly/ant/suite.jelly:98:5: <test:assertEquals>  expected:[bar5] but was:[null]
    [junit] Expected expression: (bar5)=(bar5)
    [junit] Actual expression: (${foo5.1})=(null)
    [junit] 	at org.apache.commons.jelly.tags.junit.AssertTagSupport.fail(AssertTagSupport.java:44)
    [junit] 	at org.apache.commons.jelly.tags.junit.AssertTagSupport.failNotEquals(AssertTagSupport.java:77)
    [junit] 	at org.apache.commons.jelly.tags.junit.AssertEqualsTag.doTag(AssertEqualsTag.java:56)
    [junit] 	at org.apache.commons.jelly.impl.TagScript.run(TagScript.java:267)
    [junit] Root cause
    [junit] org.apache.commons.jelly.tags.junit.JellyAssertionFailedError: file:/srv/gump/public/workspace/commons-jelly/jelly-tags/ant/target/test-classes/org/apache/commons/jelly/ant/suite.jelly:98:5: <test:assertEquals>  expected:[bar5] but was:[null]
    [junit] Expected expression: (bar5)=(bar5)
    [junit] Actual expression: (${foo5.1})=(null)
    [junit] 	at org.apache.commons.jelly.tags.junit.AssertTagSupport.fail(AssertTagSupport.java:44)
    [junit] 	at org.apache.commons.jelly.tags.junit.AssertTagSupport.failNotEquals(AssertTagSupport.java:77)
    [junit] 	at org.apache.commons.jelly.tags.junit.AssertEqualsTag.doTag(AssertEqualsTag.java:56)
    [junit] 	at org.apache.commons.jelly.impl.TagScript.run(TagScript.java:267)
    [junit] 	at org.apache.commons.jelly.impl.ScriptBlock.run(ScriptBlock.java:96)
    [junit] 	at org.apache.commons.jelly.tags.junit.CaseTag$1.runTest(CaseTag.java:60)
    [junit] 
    [junit] 
    [junit] [ERROR] TEST org.apache.commons.jelly.ant.TestJelly FAILED

BUILD FAILED
File...... /home/gump/.maven/cache/maven-test-plugin-1.6.2/plugin.jelly
Element... fail
Line...... 181
Column.... 54
There were test failures.
Total time: 16 seconds
Finished at: Sat Nov 06 16:44:11 UTC 2010

---------------------------------------------

To subscribe to this information via syndicated feeds:
- RSS: http://vmgump.apache.org/gump/public/commons-jelly/commons-jelly-tags-ant-test/rss.xml
- Atom: http://vmgump.apache.org/gump/public/commons-jelly/commons-jelly-tags-ant-test/atom.xml

============================== Gump Tracking Only ===
Produced by Gump version 2.3.
Gump Run 11000606112010, vmgump.apache.org:vmgump:11000606112010
Gump E-mail Identifier (unique within run) #29.

*********************************************************** G U M P
[GUMP@vmgump]: Project cocoon22-flowscript-impl (in module cocoon) failed
To whom it may engage...
        
This is an automated request, but not an unsolicited one. For 
more information please visit http://gump.apache.org/nagged.html, 
and/or contact the folk at general@gump.apache.org.

Project cocoon22-flowscript-impl has an issue affecting its community integration.
This issue affects 3 projects,
 and has been outstanding for 53 runs.
The current state of this project is 'Failed', with reason 'Build Failed'.
For reference only, the following projects are affected by this:
    - cocoon22-flowscript-impl :  Java XML Framework
    - lenya-core-api :  Content Management System
    - lenya-reactor :  Content Management System


Full details are available at:
    http://vmgump.apache.org/gump/public/cocoon/cocoon22-flowscript-impl/index.html

That said, some information snippets are provided here.

The following annotations (debug/informational/warning/error messages) were provided:
 -DEBUG- (Gump generated) Maven Settings in: /srv/gump/public/workspace/cocoon/blocks/cocoon-flowscript/cocoon-flowscript-impl/gump_mvn_settings.xml
 -INFO- Failed with reason build failed
 -DEBUG- Maven POM in: /srv/gump/public/workspace/cocoon/blocks/cocoon-flowscript/cocoon-flowscript-impl/pom.xml
 -INFO- Failed to extract fallback artifacts from Gump Repository



The following work was performed:
http://vmgump.apache.org/gump/public/cocoon/cocoon22-flowscript-impl/gump_work/build_cocoon_cocoon22-flowscript-impl.html
Work Name: build_cocoon_cocoon22-flowscript-impl (Type: Build)
Work ended in a state of : Failed
Elapsed: 23 secs
Command Line: /opt/maven2/bin/mvn --batch-mode --settings /srv/gump/public/workspace/cocoon/blocks/cocoon-flowscript/cocoon-flowscript-impl/gump_mvn_settings.xml install 
[Working Directory: /srv/gump/public/workspace/cocoon/blocks/cocoon-flowscript/cocoon-flowscript-impl]
M2_HOME: /opt/maven2
---------------------------------------------
[INFO] Scanning for projects...
[INFO] ------------------------------------------------------------------------
[INFO] Building Cocoon Flowscript Block Implementation
[INFO]    task-segment: [install]
[INFO] ------------------------------------------------------------------------
Downloading: http://localhost:8192/maven2/org/apache/cocoon/cocoon-maven-plugin/1.0.0-M1/cocoon-maven-plugin-1.0.0-M1.pom
4K downloaded  (cocoon-maven-plugin-1.0.0-M1.pom)
Downloading: http://localhost:8192/maven2/org/apache/cocoon/cocoon-maven-plugin/1.0.0-M1/cocoon-maven-plugin-1.0.0-M1.jar

[INFO] [enforcer:enforce-once {execution: enforce-maven}]
[INFO] [resources:resources {execution: default-resources}]
[WARNING] Using platform encoding (UTF-8 actually) to copy filtered resources, i.e. build is platform dependent!
[INFO] Copying 5 resources
[INFO] Copying 2 resources to META-INF
Downloading: http://localhost:8192/maven2/org/apache/cocoon/cocoon-expression-language-api/1.0.0/cocoon-expression-language-api-1.0.0.pom

Downloading: http://localhost:8192/maven2/org/apache/cocoon/cocoon-expression-language-api/1.0.0/cocoon-expression-language-api-1.0.0.jar
11K downloaded  (cocoon-expression-language-api-1.0.0.jar)
[INFO] [compiler:compile {execution: default-compile}]
[INFO] Compiling 20 source files to /srv/gump/public/workspace/cocoon/blocks/cocoon-flowscript/cocoon-flowscript-impl/target/classes
[INFO] ------------------------------------------------------------------------
[ERROR] BUILD FAILURE
[INFO] ------------------------------------------------------------------------
[INFO] Compilation failure
/srv/gump/public/workspace/cocoon/blocks/cocoon-flowscript/cocoon-flowscript-impl/src/main/java/org/apache/cocoon/components/flow/javascript/ScriptablePropertyPointer.java:[163,19] escape(java.lang.String) in org.apache.cocoon.components.flow.javascript.ScriptablePropertyPointer cannot override escape(java.lang.String) in org.apache.commons.jxpath.ri.model.NodePointer; attempting to assign weaker access privileges; was protected


[INFO] ------------------------------------------------------------------------
[INFO] For more information, run Maven with the -e switch
[INFO] ------------------------------------------------------------------------
[INFO] Total time: 21 seconds
[INFO] Finished at: Sat Nov 06 17:02:28 UTC 2010
[INFO] Final Memory: 50M/121M
[INFO] ------------------------------------------------------------------------
---------------------------------------------

To subscribe to this information via syndicated feeds:
- RSS: http://vmgump.apache.org/gump/public/cocoon/cocoon22-flowscript-impl/rss.xml
- Atom: http://vmgump.apache.org/gump/public/cocoon/cocoon22-flowscript-impl/atom.xml

============================== Gump Tracking Only ===
Produced by Gump version 2.3.
Gump Run 11000606112010, vmgump.apache.org:vmgump:11000606112010
Gump E-mail Identifier (unique within run) #30.

*********************************************************** G U M P
[GUMP@vmgump]: Project tapestry (in module tapestry) failed
To whom it may engage...
        
This is an automated request, but not an unsolicited one. For 
more information please visit http://gump.apache.org/nagged.html, 
and/or contact the folk at general@gump.apache.org.

Project tapestry has an issue affecting its community integration.
This issue affects 1 projects,
 and has been outstanding for 158 runs.
The current state of this project is 'Failed', with reason 'Build Failed'.
For reference only, the following projects are affected by this:
    - tapestry :  Component-based web application framework organized around i...


Full details are available at:
    http://vmgump.apache.org/gump/public/tapestry/tapestry/index.html

That said, some information snippets are provided here.

The following annotations (debug/informational/warning/error messages) were provided:
 -INFO- Optional dependency commons-fileupload prerequisite failed with reason build failed
 -DEBUG- (Gump generated) Maven Settings in: /srv/gump/public/workspace/tapestry/gump_mvn_settings.xml
 -INFO- Failed with reason build failed
 -DEBUG- Maven POM in: /srv/gump/public/workspace/tapestry/pom.xml
 -INFO- Failed to extract fallback artifacts from Gump Repository



The following work was performed:
http://vmgump.apache.org/gump/public/tapestry/tapestry/gump_work/build_tapestry_tapestry.html
Work Name: build_tapestry_tapestry (Type: Build)
Work ended in a state of : Failed
Elapsed: 3 mins 39 secs
Command Line: /opt/maven2/bin/mvn --batch-mode -DskipTests=true --settings /srv/gump/public/workspace/tapestry/gump_mvn_settings.xml package 
[Working Directory: /srv/gump/public/workspace/tapestry]
M2_HOME: /opt/maven2
---------------------------------------------
[INFO] Unable to find resource 'org.antlr:antlr:jar:3.1.1' in repository antlr-snapshot (http://antlr.org/antlr-snapshot)
Downloading: http://localhost:8192/maven2/org/antlr/antlr/3.1.1/antlr-3.1.1.jar

Downloading: http://antlr.org/antlr-snapshot/org/antlr/stringtemplate/3.2/stringtemplate-3.2.jar
[INFO] Unable to find resource 'org.antlr:stringtemplate:jar:3.2' in repository antlr-snapshot (http://antlr.org/antlr-snapshot)
Downloading: http://localhost:8192/maven2/org/antlr/stringtemplate/3.2/stringtemplate-3.2.jar

[INFO] [antlr3:antlr {execution: default}]
org/apache/tapestry5/internal/antlr/PropertyExpressionLexer.g
org/apache/tapestry5/internal/antlr/PropertyExpressionParser.g
Downloading: http://localhost:8192/maven2/org/antlr/antlr-runtime/3.1.1/antlr-runtime-3.1.1.pom

Downloading: http://localhost:8192/maven2/org/codehaus/groovy/groovy-all/1.7.4/groovy-all-1.7.4.pom

Downloading: http://localhost:8192/maven2/org/antlr/antlr-runtime/3.1.1/antlr-runtime-3.1.1.jar
Downloading: http://localhost:8192/maven2/org/codehaus/groovy/groovy-all/1.7.4/groovy-all-1.7.4.jar


[INFO] [remote-resources:process {execution: default}]
[INFO] [resources:resources {execution: default-resources}]
[INFO] Using 'UTF-8' encoding to copy filtered resources.
[INFO] Copying 178 resources
[INFO] Copying 3 resources
[INFO] [compiler:compile {execution: default-compile}]
[INFO] Compiling 911 source files to /srv/gump/public/workspace/tapestry/tapestry-core/target/classes
[INFO] ------------------------------------------------------------------------
[ERROR] BUILD FAILURE
[INFO] ------------------------------------------------------------------------
[INFO] Compilation failure

/srv/gump/public/workspace/tapestry/tapestry-core/src/main/java/org/apache/tapestry5/internal/transform/ComponentWorker.java:[124,20] setPublishedParameters(java.util.List<java.lang.String>) in org.apache.tapestry5.model.MutableEmbeddedComponentModel cannot be applied to (java.util.List<java.lang.Object>)

/srv/gump/public/workspace/tapestry/tapestry-core/src/main/java/org/apache/tapestry5/internal/services/MarkupWriterImpl.java:[264,63] incompatible types
found   : java.lang.Object
required: org.apache.tapestry5.MarkupWriterListener

/srv/gump/public/workspace/tapestry/tapestry-core/src/main/java/org/apache/tapestry5/internal/services/MarkupWriterImpl.java:[279,63] incompatible types
found   : java.lang.Object
required: org.apache.tapestry5.MarkupWriterListener

/srv/gump/public/workspace/tapestry/tapestry-core/src/main/java/org/apache/tapestry5/internal/services/FieldValidatorSourceImpl.java:[83,42] expandMacros(java.util.List<org.apache.tapestry5.internal.services.ValidatorSpecification>) in org.apache.tapestry5.internal.services.FieldValidatorSourceImpl cannot be applied to (java.util.List<java.lang.Object>)


[INFO] ------------------------------------------------------------------------
[INFO] For more information, run Maven with the -e switch
[INFO] ------------------------------------------------------------------------
[INFO] Total time: 3 minutes 37 seconds
[INFO] Finished at: Sat Nov 06 17:08:59 UTC 2010
[INFO] Final Memory: 128M/417M
[INFO] ------------------------------------------------------------------------
---------------------------------------------

To subscribe to this information via syndicated feeds:
- RSS: http://vmgump.apache.org/gump/public/tapestry/tapestry/rss.xml
- Atom: http://vmgump.apache.org/gump/public/tapestry/tapestry/atom.xml

============================== Gump Tracking Only ===
Produced by Gump version 2.3.
Gump Run 11000606112010, vmgump.apache.org:vmgump:11000606112010
Gump E-mail Identifier (unique within run) #31.

*********************************************************** G U M P
[GUMP@vmgump]: Project cocoon22-reactor (in module cocoon) failed
To whom it may engage...
        
This is an automated request, but not an unsolicited one. For 
more information please visit http://gump.apache.org/nagged.html, 
and/or contact the folk at general@gump.apache.org.

Project cocoon22-reactor has an issue affecting its community integration.
This issue affects 1 projects,
 and has been outstanding for 204 runs.
The current state of this project is 'Failed', with reason 'Build Failed'.
For reference only, the following projects are affected by this:
    - cocoon22-reactor :  Java XML Framework


Full details are available at:
    http://vmgump.apache.org/gump/public/cocoon/cocoon22-reactor/index.html

That said, some information snippets are provided here.

The following annotations (debug/informational/warning/error messages) were provided:
 -INFO- Optional dependency commons-configuration prerequisite failed with reason missing build outputs
 -INFO- Optional dependency htmlunit failed with reason build failed
 -INFO- Optional dependency cocoon22-flowscript-impl failed with reason build failed
 -INFO- Optional dependency xml-fop prerequisite failed with reason build failed
 -INFO- Optional dependency xml-batik failed with reason build failed
 -DEBUG- (Gump generated) Maven Settings in: /srv/gump/public/workspace/cocoon/gump_mvn_settings.xml
 -INFO- Failed with reason build failed
 -DEBUG- Maven POM in: /srv/gump/public/workspace/cocoon/pom.xml



The following work was performed:
http://vmgump.apache.org/gump/public/cocoon/cocoon22-reactor/gump_work/build_cocoon_cocoon22-reactor.html
Work Name: build_cocoon_cocoon22-reactor (Type: Build)
Work ended in a state of : Failed
Elapsed: 1 min 32 secs
Command Line: /opt/maven2/bin/mvn --batch-mode --settings /srv/gump/public/workspace/cocoon/gump_mvn_settings.xml package 
[Working Directory: /srv/gump/public/workspace/cocoon]
M2_HOME: /opt/maven2
---------------------------------------------
8) daisy:daisy-htmlcleaner:jar:1.5-dev

  Try downloading the file manually from the project website.

  Then, install it using the command: 
      mvn install:install-file -DgroupId=daisy -DartifactId=daisy-htmlcleaner -Dversion=1.5-dev -Dpackaging=jar -Dfile=/path/to/file

  Alternatively, if you host your own repository you can deploy the file there: 
      mvn deploy:deploy-file -DgroupId=daisy -DartifactId=daisy-htmlcleaner -Dversion=1.5-dev -Dpackaging=jar -Dfile=/path/to/file -Durl=[url] -DrepositoryId=[id]

  Path to dependency: 
  	1) org.apache.cocoon:cocoon-sitemaptags2daisy-plugin:maven-plugin:1.0.0-SNAPSHOT
  	2) daisy:daisy-htmlcleaner:jar:1.5-dev

9) daisy:daisy-util:jar:1.5-dev

  Try downloading the file manually from the project website.

  Then, install it using the command: 
      mvn install:install-file -DgroupId=daisy -DartifactId=daisy-util -Dversion=1.5-dev -Dpackaging=jar -Dfile=/path/to/file

  Alternatively, if you host your own repository you can deploy the file there: 
      mvn deploy:deploy-file -DgroupId=daisy -DartifactId=daisy-util -Dversion=1.5-dev -Dpackaging=jar -Dfile=/path/to/file -Durl=[url] -DrepositoryId=[id]

  Path to dependency: 
  	1) org.apache.cocoon:cocoon-sitemaptags2daisy-plugin:maven-plugin:1.0.0-SNAPSHOT
  	2) daisy:daisy-util:jar:1.5-dev

----------
9 required artifacts are missing.

for artifact: 
  org.apache.cocoon:cocoon-sitemaptags2daisy-plugin:maven-plugin:1.0.0-SNAPSHOT

from the specified remote repositories:
  gump-central (http://localhost:8192/maven2),
  maven-snapshot (http://snapshots.maven.codehaus.org/maven2/),
  cocoondev (http://cocoondev.org/repository),
  gump-apache.snapshots (http://localhost:8192/repo/m2-snapshot-repository),
  gkossakowski-maven2 (http://people.apache.org/~gkossakowski/maven2/repository)



[INFO] ------------------------------------------------------------------------
[INFO] For more information, run Maven with the -e switch
[INFO] ------------------------------------------------------------------------
[INFO] Total time: 1 minute 31 seconds
[INFO] Finished at: Sat Nov 06 17:47:37 UTC 2010
[INFO] Final Memory: 95M/229M
[INFO] ------------------------------------------------------------------------
---------------------------------------------

To subscribe to this information via syndicated feeds:
- RSS: http://vmgump.apache.org/gump/public/cocoon/cocoon22-reactor/rss.xml
- Atom: http://vmgump.apache.org/gump/public/cocoon/cocoon22-reactor/atom.xml

============================== Gump Tracking Only ===
Produced by Gump version 2.3.
Gump Run 11000606112010, vmgump.apache.org:vmgump:11000606112010
Gump E-mail Identifier (unique within run) #36.

*********************************************************** G U M P
[GUMP@vmgump]: Project ws-commons-axiom (in module ws-axis2-commons) failed
To whom it may engage...
        
This is an automated request, but not an unsolicited one. For 
more information please visit http://gump.apache.org/nagged.html, 
and/or contact the folk at general@gump.apache.org.

Project ws-commons-axiom has an issue affecting its community integration.
This issue affects 1 projects,
 and has been outstanding for 198 runs.
The current state of this project is 'Failed', with reason 'Build Failed'.
For reference only, the following projects are affected by this:
    - ws-commons-axiom :  Common stuff for the WS projects.


Full details are available at:
    http://vmgump.apache.org/gump/public/ws-axis2-commons/ws-commons-axiom/index.html

That said, some information snippets are provided here.

The following annotations (debug/informational/warning/error messages) were provided:
 -INFO- Optional dependency xml-batik failed with reason build failed
 -DEBUG- (Gump generated) Maven Settings in: /srv/gump/public/workspace/ws-axis2-commons/axiom/gump_mvn_settings.xml
 -INFO- Failed with reason build failed
 -DEBUG- Maven POM in: /srv/gump/public/workspace/ws-axis2-commons/axiom/pom.xml



The following work was performed:
http://vmgump.apache.org/gump/public/ws-axis2-commons/ws-commons-axiom/gump_work/build_ws-axis2-commons_ws-commons-axiom.html
Work Name: build_ws-axis2-commons_ws-commons-axiom (Type: Build)
Work ended in a state of : Failed
Elapsed: 6 mins 39 secs
Command Line: /opt/maven2/bin/mvn --batch-mode --settings /srv/gump/public/workspace/ws-axis2-commons/axiom/gump_mvn_settings.xml install 
[Working Directory: /srv/gump/public/workspace/ws-axis2-commons/axiom]
M2_HOME: /opt/maven2
---------------------------------------------

Tests in error: 
  testIdentity[0](org.apache.axiom.om.impl.jaxp.TransformerTest)
  testIdentity[1](org.apache.axiom.om.impl.jaxp.TransformerTest)
  test(org.apache.axiom.om.impl.builder.SAXOMBuilderJAXBTest)
  testStylesheet[0](org.apache.axiom.om.impl.dom.jaxp.TransformerTest)
  testIdentity[0](org.apache.axiom.om.impl.dom.jaxp.TransformerTest)
  testStylesheet[1](org.apache.axiom.om.impl.dom.jaxp.TransformerTest)
  testIdentity[1](org.apache.axiom.om.impl.dom.jaxp.TransformerTest)
  processingInstruction.xml - crimson(org.apache.axiom.om.impl.builder.SAXOMBuilderSAXParserTest)
  spaces.xml - crimson(org.apache.axiom.om.impl.builder.SAXOMBuilderSAXParserTest)
  cdata.xml - crimson(org.apache.axiom.om.impl.builder.SAXOMBuilderSAXParserTest)
  namespaces2.xml - crimson(org.apache.axiom.om.impl.builder.SAXOMBuilderSAXParserTest)
  null-namespace.xml - crimson(org.apache.axiom.om.impl.builder.SAXOMBuilderSAXParserTest)
  xml-prefix.xml - crimson(org.apache.axiom.om.impl.builder.SAXOMBuilderSAXParserTest)
  namespaces3.xml - crimson(org.apache.axiom.om.impl.builder.SAXOMBuilderSAXParserTest)
  masked-namespace-declaration.xml - crimson(org.apache.axiom.om.impl.builder.SAXOMBuilderSAXParserTest)
  test.xml - crimson(org.apache.axiom.om.impl.builder.SAXOMBuilderSAXParserTest)
  namespaces.xml - crimson(org.apache.axiom.om.impl.builder.SAXOMBuilderSAXParserTest)
  utf-8.xml - crimson(org.apache.axiom.om.impl.builder.SAXOMBuilderSAXParserTest)
  AXIS2-565.xml - crimson(org.apache.axiom.om.impl.builder.SAXOMBuilderSAXParserTest)
  processingInstruction.xml - xerces(org.apache.axiom.om.impl.builder.SAXOMBuilderSAXParserTest)
  spaces.xml - xerces(org.apache.axiom.om.impl.builder.SAXOMBuilderSAXParserTest)
  cdata.xml - xerces(org.apache.axiom.om.impl.builder.SAXOMBuilderSAXParserTest)
  namespaces2.xml - xerces(org.apache.axiom.om.impl.builder.SAXOMBuilderSAXParserTest)
  null-namespace.xml - xerces(org.apache.axiom.om.impl.builder.SAXOMBuilderSAXParserTest)
  xml-prefix.xml - xerces(org.apache.axiom.om.impl.builder.SAXOMBuilderSAXParserTest)
  namespaces3.xml - xerces(org.apache.axiom.om.impl.builder.SAXOMBuilderSAXParserTest)
  masked-namespace-declaration.xml - xerces(org.apache.axiom.om.impl.builder.SAXOMBuilderSAXParserTest)
  test.xml - xerces(org.apache.axiom.om.impl.builder.SAXOMBuilderSAXParserTest)
  namespaces.xml - xerces(org.apache.axiom.om.impl.builder.SAXOMBuilderSAXParserTest)
  utf-8.xml - xerces(org.apache.axiom.om.impl.builder.SAXOMBuilderSAXParserTest)
  AXIS2-565.xml - xerces(org.apache.axiom.om.impl.builder.SAXOMBuilderSAXParserTest)
  test(org.apache.axiom.om.impl.builder.SAXOMBuilderXMLBeansTest)

Tests run: 38, Failures: 0, Errors: 32, Skipped: 0

[INFO] ------------------------------------------------------------------------
[ERROR] BUILD FAILURE
[INFO] ------------------------------------------------------------------------
[INFO] There are test failures.

Please refer to /srv/gump/public/workspace/ws-axis2-commons/axiom/modules/axiom-integration/target/surefire-reports for the individual test results.
[INFO] ------------------------------------------------------------------------
[INFO] For more information, run Maven with the -e switch
[INFO] ------------------------------------------------------------------------
[INFO] Total time: 6 minutes 36 seconds
[INFO] Finished at: Sat Nov 06 17:55:38 UTC 2010
[INFO] Final Memory: 104M/251M
[INFO] ------------------------------------------------------------------------
---------------------------------------------

To subscribe to this information via syndicated feeds:
- RSS: http://vmgump.apache.org/gump/public/ws-axis2-commons/ws-commons-axiom/rss.xml
- Atom: http://vmgump.apache.org/gump/public/ws-axis2-commons/ws-commons-axiom/atom.xml

============================== Gump Tracking Only ===
Produced by Gump version 2.3.
Gump Run 11000606112010, vmgump.apache.org:vmgump:11000606112010
Gump E-mail Identifier (unique within run) #37.

*********************************************************** G U M P
[GUMP@vmgump]: Project ws-axis2 (in module ws-axis2) failed
To whom it may engage...
        
This is an automated request, but not an unsolicited one. For 
more information please visit http://gump.apache.org/nagged.html, 
and/or contact the folk at general@gump.apache.org.

Project ws-axis2 has an issue affecting its community integration.
This issue affects 2 projects,
 and has been outstanding for 588 runs.
The current state of this project is 'Failed', with reason 'Build Failed'.
For reference only, the following projects are affected by this:
    - ws-axis2 :  Apache Axis2 SOAP Stack
    - ws-axis2-test :  Apache Axis2 SOAP Stack


Full details are available at:
    http://vmgump.apache.org/gump/public/ws-axis2/ws-axis2/index.html

That said, some information snippets are provided here.

The following annotations (debug/informational/warning/error messages) were provided:
 -DEBUG- Sole jar output [ws-axis2-06112010] identifier set to project name
 -INFO- Optional dependency ws-commons-xmlschema failed with reason build failed
 -INFO- Optional dependency ws-commons-axiom failed with reason build failed
 -DEBUG- (Gump generated) Maven Settings in: /srv/gump/public/workspace/ws-axis2/gump_mvn_settings.xml
 -INFO- Failed with reason build failed
 -DEBUG- Maven POM in: /srv/gump/public/workspace/ws-axis2/pom.xml
 -INFO- Failed to extract fallback artifacts from Gump Repository



The following work was performed:
http://vmgump.apache.org/gump/public/ws-axis2/ws-axis2/gump_work/build_ws-axis2_ws-axis2.html
Work Name: build_ws-axis2_ws-axis2 (Type: Build)
Work ended in a state of : Failed
Elapsed: 3 mins 15 secs
Command Line: /opt/maven2/bin/mvn --batch-mode -DskipTests=true --settings /srv/gump/public/workspace/ws-axis2/gump_mvn_settings.xml package 
[Working Directory: /srv/gump/public/workspace/ws-axis2]
M2_HOME: /opt/maven2
---------------------------------------------
[INFO] ------------------------------------------------------------------------
[INFO] Failed to resolve dependencies for one or more projects in the reactor. Reason: Missing:
----------
1) org.apache.axis2:axis2-transport-local:jar:SNAPSHOT

  Try downloading the file manually from the project website.

  Then, install it using the command: 
      mvn install:install-file -DgroupId=org.apache.axis2 -DartifactId=axis2-transport-local -Dversion=SNAPSHOT -Dpackaging=jar -Dfile=/path/to/file

  Alternatively, if you host your own repository you can deploy the file there: 
      mvn deploy:deploy-file -DgroupId=org.apache.axis2 -DartifactId=axis2-transport-local -Dversion=SNAPSHOT -Dpackaging=jar -Dfile=/path/to/file -Durl=[url] -DrepositoryId=[id]

  Path to dependency: 
  	1) org.apache.axis2:axis2-codegen:jar:SNAPSHOT
  	2) org.apache.axis2:axis2-transport-local:jar:SNAPSHOT

2) org.apache.axis2:axis2-transport-http:jar:SNAPSHOT

  Try downloading the file manually from the project website.

  Then, install it using the command: 
      mvn install:install-file -DgroupId=org.apache.axis2 -DartifactId=axis2-transport-http -Dversion=SNAPSHOT -Dpackaging=jar -Dfile=/path/to/file

  Alternatively, if you host your own repository you can deploy the file there: 
      mvn deploy:deploy-file -DgroupId=org.apache.axis2 -DartifactId=axis2-transport-http -Dversion=SNAPSHOT -Dpackaging=jar -Dfile=/path/to/file -Durl=[url] -DrepositoryId=[id]

  Path to dependency: 
  	1) org.apache.axis2:axis2-codegen:jar:SNAPSHOT
  	2) org.apache.axis2:axis2-transport-http:jar:SNAPSHOT

----------
2 required artifacts are missing.

for artifact: 
  org.apache.axis2:axis2-codegen:jar:SNAPSHOT

from the specified remote repositories:
  gump-central (http://localhost:8192/maven2),
  gump-apache.snapshots (http://localhost:8192/repo/m2-snapshot-repository)



[INFO] ------------------------------------------------------------------------
[INFO] For more information, run Maven with the -e switch
[INFO] ------------------------------------------------------------------------
[INFO] Total time: 3 minutes 11 seconds
[INFO] Finished at: Sat Nov 06 18:58:22 UTC 2010
[INFO] Final Memory: 97M/233M
[INFO] ------------------------------------------------------------------------
---------------------------------------------

To subscribe to this information via syndicated feeds:
- RSS: http://vmgump.apache.org/gump/public/ws-axis2/ws-axis2/rss.xml
- Atom: http://vmgump.apache.org/gump/public/ws-axis2/ws-axis2/atom.xml

============================== Gump Tracking Only ===
Produced by Gump version 2.3.
Gump Run 11000606112010, vmgump.apache.org:vmgump:11000606112010
Gump E-mail Identifier (unique within run) #39.

*********************************************************** G U M P
[GUMP@vmgump]: Project cactus-test (in module jakarta-cactus) failed
To whom it may engage...
        
This is an automated request, but not an unsolicited one. For 
more information please visit http://gump.apache.org/nagged.html, 
and/or contact the folk at general@gump.apache.org.

Project cactus-test has an issue affecting its community integration.
This issue affects 1 projects,
 and has been outstanding for 54 runs.
The current state of this project is 'Failed', with reason 'Build Failed'.
For reference only, the following projects are affected by this:
    - cactus-test :  Unit test framework for server-side java code


Full details are available at:
    http://vmgump.apache.org/gump/public/jakarta-cactus/cactus-test/index.html

That said, some information snippets are provided here.

The following annotations (debug/informational/warning/error messages) were provided:
 -WARNING- Overriding Maven settings: [/srv/gump/public/workspace/jakarta-cactus/gump_mvn_settings.xml]
 -DEBUG- (Gump generated) Maven Settings in: /srv/gump/public/workspace/jakarta-cactus/gump_mvn_settings.xml
 -INFO- Failed with reason build failed
 -DEBUG- Maven POM in: /srv/gump/public/workspace/jakarta-cactus/pom.xml
 -INFO- Project Reports in: /srv/gump/public/workspace/jakarta-cactus/build-tools/target/surefire-reports
 -WARNING- No directory [/srv/gump/public/workspace/jakarta-cactus/build-tools/target/surefire-reports]
 -INFO- Project Reports in: /srv/gump/public/workspace/jakarta-cactus/framework/framework-12-13-14/target/surefire-reports
 -INFO- Project Reports in: /srv/gump/public/workspace/jakarta-cactus/framework/framework-13-14/target/surefire-reports
 -INFO- Project Reports in: /srv/gump/public/workspace/jakarta-cactus/framework/framework-wrappers/wrapper-javaEE-12/target/surefire-reports
 -INFO- Project Reports in: /srv/gump/public/workspace/jakarta-cactus/framework/framework-wrappers/wrapper-javaEE-13/target/surefire-reports
 -WARNING- No directory [/srv/gump/public/workspace/jakarta-cactus/framework/framework-wrappers/wrapper-javaEE-13/target/surefire-reports]
 -INFO- Project Reports in: /srv/gump/public/workspace/jakarta-cactus/framework/framework-wrappers/wrapper-javaEE-14/target/surefire-reports
 -WARNING- No directory [/srv/gump/public/workspace/jakarta-cactus/framework/framework-wrappers/wrapper-javaEE-14/target/surefire-reports]
 -INFO- Project Reports in: /srv/gump/public/workspace/jakarta-cactus/integration/shared-api/target/surefire-reports
 -WARNING- No directory [/srv/gump/public/workspace/jakarta-cactus/integration/shared-api/target/surefire-reports]
 -INFO- Project Reports in: /srv/gump/public/workspace/jakarta-cactus/integration/ant/target/surefire-reports



The following work was performed:
http://vmgump.apache.org/gump/public/jakarta-cactus/cactus-test/gump_work/build_jakarta-cactus_cactus-test.html
Work Name: build_jakarta-cactus_cactus-test (Type: Build)
Work ended in a state of : Failed
Elapsed: 35 secs
Command Line: /opt/maven2/bin/mvn --batch-mode --settings /srv/gump/public/workspace/jakarta-cactus/gump_mvn_settings.xml -P!sourcecheck test 
[Working Directory: /srv/gump/public/workspace/jakarta-cactus]
M2_HOME: /opt/maven2
---------------------------------------------
  testSetLoginConfigAdding(org.apache.cactus.integration.ant.deployment.webapp.TestWebXml)
  testSetLoginConfigReplacing(org.apache.cactus.integration.ant.deployment.webapp.TestWebXml)
  testHasSecurityConstraintEmpty(org.apache.cactus.integration.ant.deployment.webapp.TestWebXml)
  testGetSingleSecurityConstraint(org.apache.cactus.integration.ant.deployment.webapp.TestWebXml)
  testGetMutlipleSecurityConstraints(org.apache.cactus.integration.ant.deployment.webapp.TestWebXml)
  testGetLoginConfigEmpty(org.apache.cactus.integration.ant.deployment.webapp.TestWebXml)
  testGetLoginConfig(org.apache.cactus.integration.ant.deployment.webapp.TestWebXml)
  testHasSecurityRoleEmpty(org.apache.cactus.integration.ant.deployment.webapp.TestWebXml)
  testGetServletRunAsRole(org.apache.cactus.integration.ant.deployment.webapp.TestWebXml)
  testAddServletRunAsRole(org.apache.cactus.integration.ant.deployment.webapp.TestWebXml)
  testSrcFileWithoutWebXml(org.apache.cactus.integration.ant.TestCactifyWarTask)
  testDefaultRedirectorsNoDoctype(org.apache.cactus.integration.ant.TestCactifyWarTask)
  testDefaultRedirectors22Doctype(org.apache.cactus.integration.ant.TestCactifyWarTask)
  testDefaultRedirectors23Doctype(org.apache.cactus.integration.ant.TestCactifyWarTask)
  testDefaultRedirectorsNewWar22(org.apache.cactus.integration.ant.TestCactifyWarTask)
  testDefaultRedirectorsNewWar23(org.apache.cactus.integration.ant.TestCactifyWarTask)
  testCustomServletRedirectorMapping(org.apache.cactus.integration.ant.TestCactifyWarTask)
  testCustomJspRedirectorMapping(org.apache.cactus.integration.ant.TestCactifyWarTask)
  testCustomFilterRedirectorMapping(org.apache.cactus.integration.ant.TestCactifyWarTask)
  testCustomFilterRedirectorMappingIgnored(org.apache.cactus.integration.ant.TestCactifyWarTask)
  testMultipleNamedServletRedirectors(org.apache.cactus.integration.ant.TestCactifyWarTask)
  testMultipleNamedJspRedirectors(org.apache.cactus.integration.ant.TestCactifyWarTask)
  testMultipleNamedFilterRedirectors(org.apache.cactus.integration.ant.TestCactifyWarTask)
  testSecuredServletRedirector(org.apache.cactus.integration.ant.TestCactifyWarTask)
  testLoginConfigNotOverwritten(org.apache.cactus.integration.ant.TestCactifyWarTask)
  testNoDuplicateJars(org.apache.cactus.integration.ant.TestCactifyWarTask)
  testAddWeblogicEjbRefs(org.apache.cactus.integration.ant.TestCactifyWarTask)
  testWarFileCactified(org.apache.cactus.integration.ant.TestCactusTestTask)
  testEarFileCactified(org.apache.cactus.integration.ant.TestCactusTestTask)
  testWarFileCactified(org.apache.cactus.integration.ant.TestCactusTask)
  testEarFileCactified(org.apache.cactus.integration.ant.TestCactusTask)
  testCanAddCactifiedWar(org.apache.cactus.integration.ant.TestCactifyEarTask)
  testCustomCactusWarContext(org.apache.cactus.integration.ant.TestCactifyEarTask)
  testAddEjbReferences(org.apache.cactus.integration.ant.TestCactifyEarTask)

Tests run: 131, Failures: 5, Errors: 76, Skipped: 0

[INFO] ------------------------------------------------------------------------
[ERROR] BUILD FAILURE
[INFO] ------------------------------------------------------------------------
[INFO] There are test failures.

Please refer to /srv/gump/public/workspace/jakarta-cactus/integration/ant/target/surefire-reports for the individual test results.
[INFO] ------------------------------------------------------------------------
[INFO] For more information, run Maven with the -e switch
[INFO] ------------------------------------------------------------------------
[INFO] Total time: 33 seconds
[INFO] Finished at: Sat Nov 06 19:08:01 UTC 2010
[INFO] Final Memory: 38M/91M
[INFO] ------------------------------------------------------------------------
---------------------------------------------

To subscribe to this information via syndicated feeds:
- RSS: http://vmgump.apache.org/gump/public/jakarta-cactus/cactus-test/rss.xml
- Atom: http://vmgump.apache.org/gump/public/jakarta-cactus/cactus-test/atom.xml

============================== Gump Tracking Only ===
Produced by Gump version 2.3.
Gump Run 11000606112010, vmgump.apache.org:vmgump:11000606112010
Gump E-mail Identifier (unique within run) #40.

*********************************************************** G U M P
[GUMP@vmgump]: Project openjpa-kernel (in module openjpa) failed
To whom it may engage...
        
This is an automated request, but not an unsolicited one. For 
more information please visit http://gump.apache.org/nagged.html, 
and/or contact the folk at general@gump.apache.org.

Project openjpa-kernel has an issue affecting its community integration.
This issue affects 8 projects,
 and has been outstanding for 4 runs.
The current state of this project is 'Failed', with reason 'Build Failed'.
For reference only, the following projects are affected by this:
    - openjpa :  Apache OpenJPA is a Java persistence project that can be use...
    - openjpa-jdbc :  Apache OpenJPA is a Java persistence project that can be use...
    - openjpa-kernel :  Apache OpenJPA is a Java persistence project that can be use...
    - openjpa-persistence :  Apache OpenJPA is a Java persistence project that can be use...
    - openjpa-persistence-jdbc :  Apache OpenJPA is a Java persistence project that can be use...
    - openjpa-slice :  Apache OpenJPA is a Java persistence project that can be use...
    - openjpa-testsupport :  Apache OpenJPA is a Java persistence project that can be use...
    - openjpa-xmlstore :  Apache OpenJPA is a Java persistence project that can be use...


Full details are available at:
    http://vmgump.apache.org/gump/public/openjpa/openjpa-kernel/index.html

That said, some information snippets are provided here.

The following annotations (debug/informational/warning/error messages) were provided:
 -DEBUG- Sole jar output [openjpa-kernel-*[0-9T].jar] identifier set to project name
 -DEBUG- (Gump generated) Maven Settings in: /srv/gump/public/workspace/openjpa/openjpa-kernel/gump_mvn_settings.xml
 -INFO- Failed with reason build failed
 -DEBUG- Maven POM in: /srv/gump/public/workspace/openjpa/openjpa-kernel/pom.xml
 -INFO- Failed to extract fallback artifacts from Gump Repository



The following work was performed:
http://vmgump.apache.org/gump/public/openjpa/openjpa-kernel/gump_work/build_openjpa_openjpa-kernel.html
Work Name: build_openjpa_openjpa-kernel (Type: Build)
Work ended in a state of : Failed
Elapsed: 51 secs
Command Line: /opt/maven2/bin/mvn --batch-mode -Dcheckstyle.skip=true --settings /srv/gump/public/workspace/openjpa/openjpa-kernel/gump_mvn_settings.xml package 
[Working Directory: /srv/gump/public/workspace/openjpa/openjpa-kernel]
M2_HOME: /opt/maven2
---------------------------------------------
/srv/gump/public/workspace/openjpa/openjpa-kernel/src/main/java/org/apache/openjpa/enhance/PCDataGenerator.java:[680,12] cannot find symbol
symbol  : class Instruction
location: class org.apache.openjpa.enhance.PCDataGenerator
/srv/gump/public/workspace/openjpa/openjpa-kernel/src/main/java/org/apache/openjpa/enhance/PCDataGenerator.java:[732,44] cannot find symbol
symbol  : class Code
location: class org.apache.openjpa.enhance.PCDataGenerator
/srv/gump/public/workspace/openjpa/openjpa-kernel/src/main/java/org/apache/openjpa/enhance/PCDataGenerator.java:[733,36] cannot find symbol
symbol  : class Instruction
location: class org.apache.openjpa.enhance.PCDataGenerator
/srv/gump/public/workspace/openjpa/openjpa-kernel/src/main/java/org/apache/openjpa/enhance/PCDataGenerator.java:[732,12] cannot find symbol
symbol  : class Instruction
location: class org.apache.openjpa.enhance.PCDataGenerator
/srv/gump/public/workspace/openjpa/openjpa-kernel/src/main/java/org/apache/openjpa/enhance/PCDataGenerator.java:[762,33] cannot find symbol
symbol  : class BCClass
location: class org.apache.openjpa.enhance.PCDataGenerator
/srv/gump/public/workspace/openjpa/openjpa-kernel/src/main/java/org/apache/openjpa/enhance/PCDataGenerator.java:[769,32] cannot find symbol
symbol  : class BCClass
location: class org.apache.openjpa.enhance.PCDataGenerator
/srv/gump/public/workspace/openjpa/openjpa-kernel/src/main/java/org/apache/openjpa/enhance/PCDataGenerator.java:[855,26] cannot find symbol
symbol  : class BCClass
location: class org.apache.openjpa.enhance.PCDataGenerator
/srv/gump/public/workspace/openjpa/openjpa-kernel/src/main/java/org/apache/openjpa/enhance/PCDataGenerator.java:[855,38] cannot find symbol
symbol  : class Code
location: class org.apache.openjpa.enhance.PCDataGenerator
/srv/gump/public/workspace/openjpa/openjpa-kernel/src/main/java/org/apache/openjpa/enhance/PCDataGenerator.java:[944,32] cannot find symbol
symbol  : class BCClass
location: class org.apache.openjpa.enhance.PCDataGenerator
/srv/gump/public/workspace/openjpa/openjpa-kernel/src/main/java/org/apache/openjpa/enhance/PCDataGenerator.java:[967,28] cannot find symbol
symbol  : class BCClass
location: class org.apache.openjpa.enhance.PCDataGenerator
/srv/gump/public/workspace/openjpa/openjpa-kernel/src/main/java/org/apache/openjpa/enhance/PCDataGenerator.java:[1030,38] cannot find symbol
symbol  : class BCClass
location: class org.apache.openjpa.enhance.PCDataGenerator
/srv/gump/public/workspace/openjpa/openjpa-kernel/src/main/java/org/apache/openjpa/enhance/PCDataGenerator.java:[1049,29] cannot find symbol
symbol  : class Instruction
location: class org.apache.openjpa.enhance.PCDataGenerator
/srv/gump/public/workspace/openjpa/openjpa-kernel/src/main/java/org/apache/openjpa/enhance/PCDataGenerator.java:[1049,57] cannot find symbol
symbol  : class Instruction
location: class org.apache.openjpa.enhance.PCDataGenerator
/srv/gump/public/workspace/openjpa/openjpa-kernel/src/main/java/org/apache/openjpa/enhance/DynamicStorageGenerator.java:[98,18] cannot find symbol
symbol  : class Project
location: class org.apache.openjpa.enhance.DynamicStorageGenerator

[INFO] ------------------------------------------------------------------------
[INFO] For more information, run Maven with the -e switch
[INFO] ------------------------------------------------------------------------
[INFO] Total time: 49 seconds
[INFO] Finished at: Sat Nov 06 19:09:10 UTC 2010
[INFO] Final Memory: 66M/221M
[INFO] ------------------------------------------------------------------------
---------------------------------------------

To subscribe to this information via syndicated feeds:
- RSS: http://vmgump.apache.org/gump/public/openjpa/openjpa-kernel/rss.xml
- Atom: http://vmgump.apache.org/gump/public/openjpa/openjpa-kernel/atom.xml

============================== Gump Tracking Only ===
Produced by Gump version 2.3.
Gump Run 11000606112010, vmgump.apache.org:vmgump:11000606112010
Gump E-mail Identifier (unique within run) #41.

*********************************************************** G U M P
[GUMP@vmgump]: Project syncrepl (in module apacheds) failed
To whom it may engage...
        
This is an automated request, but not an unsolicited one. For 
more information please visit http://gump.apache.org/nagged.html, 
and/or contact the folk at general@gump.apache.org.

Project syncrepl has an issue affecting its community integration.
This issue affects 1 projects,
 and has been outstanding for 10 runs.
The current state of this project is 'Failed', with reason 'Build Failed'.
For reference only, the following projects are affected by this:
    - syncrepl :  Apache Directory Server


Full details are available at:
    http://vmgump.apache.org/gump/public/apacheds/syncrepl/index.html

That said, some information snippets are provided here.

The following annotations (debug/informational/warning/error messages) were provided:
 -DEBUG- Sole jar output [syncrepl-*[0-9T].jar] identifier set to project name
 -DEBUG- (Gump generated) Maven Settings in: /srv/gump/public/workspace/apacheds/syncrepl/gump_mvn_settings.xml
 -INFO- Failed with reason build failed
 -DEBUG- Maven POM in: /srv/gump/public/workspace/apacheds/syncrepl/pom.xml
 -INFO- Failed to extract fallback artifacts from Gump Repository



The following work was performed:
http://vmgump.apache.org/gump/public/apacheds/syncrepl/gump_work/build_apacheds_syncrepl.html
Work Name: build_apacheds_syncrepl (Type: Build)
Work ended in a state of : Failed
Elapsed: 37 secs
Command Line: /opt/maven2/bin/mvn --batch-mode --settings /srv/gump/public/workspace/apacheds/syncrepl/gump_mvn_settings.xml install 
[Working Directory: /srv/gump/public/workspace/apacheds/syncrepl]
M2_HOME: /opt/maven2
---------------------------------------------
location: class org.apache.directory.server.syncrepl.EntryInjector
/srv/gump/public/workspace/apacheds/syncrepl/src/main/java/org/apache/directory/server/syncrepl/EntryInjector.java:[284,27] cannot find symbol
symbol  : class SyncreplConfiguration
location: class org.apache.directory.server.syncrepl.EntryInjector
/srv/gump/public/workspace/apacheds/syncrepl/src/main/java/org/apache/directory/server/syncrepl/SyncreplRunnerUI.java:[81,41] cannot find symbol
symbol  : class SyncReplConsumer
location: class org.apache.directory.server.syncrepl.SyncreplRunnerUI
/srv/gump/public/workspace/apacheds/syncrepl/src/main/java/org/apache/directory/server/syncrepl/SyncreplRunnerUI.java:[115,21] cannot find symbol
symbol  : class SyncreplConfiguration
location: class org.apache.directory.server.syncrepl.SyncreplRunnerUI
/srv/gump/public/workspace/apacheds/syncrepl/src/main/java/org/apache/directory/server/syncrepl/SyncreplRunnerUI.java:[172,26] cannot access org.apache.directory.server.protocol.shared.DirectoryBackedService
class file for org.apache.directory.server.protocol.shared.DirectoryBackedService not found
                ldapServer.stop();
/srv/gump/public/workspace/apacheds/syncrepl/src/main/java/org/apache/directory/server/syncrepl/SyncreplRunnerUI.java:[210,22] cannot find symbol
symbol  : method setWorkingDirectory(java.io.File)
location: interface org.apache.directory.server.core.DirectoryService
/srv/gump/public/workspace/apacheds/syncrepl/src/main/java/org/apache/directory/server/syncrepl/SyncreplRunnerUI.java:[217,42] cannot find symbol
symbol  : class TcpTransport
location: class org.apache.directory.server.syncrepl.SyncreplRunnerUI
/srv/gump/public/workspace/apacheds/syncrepl/src/main/java/org/apache/directory/server/syncrepl/SyncreplRunnerUI.java:[222,21] setSuffix(org.apache.directory.shared.ldap.name.DN) in org.apache.directory.server.core.partition.impl.btree.BTreePartition<java.lang.Long> cannot be applied to (java.lang.String)
/srv/gump/public/workspace/apacheds/syncrepl/src/main/java/org/apache/directory/server/syncrepl/SyncreplRunnerUI.java:[357,41] cannot find symbol
symbol  : method getWorkingDirectory()
location: interface org.apache.directory.server.core.DirectoryService
/srv/gump/public/workspace/apacheds/syncrepl/src/main/java/org/apache/directory/server/syncrepl/SyncreplRunnerUI.java:[382,59] cannot find symbol
symbol  : variable ExceptionUtils
location: class org.apache.directory.server.syncrepl.SyncreplRunnerUI
/srv/gump/public/workspace/apacheds/syncrepl/src/main/java/org/apache/directory/server/syncrepl/SyncreplRunnerUI.java:[397,23] setSuffix(org.apache.directory.shared.ldap.name.DN) in org.apache.directory.server.core.partition.Partition cannot be applied to (java.lang.String)
/srv/gump/public/workspace/apacheds/syncrepl/src/main/java/org/apache/directory/server/syncrepl/SyncreplRunnerUI.java:[399,80] cannot find symbol
symbol  : method getWorkingDirectory()
location: interface org.apache.directory.server.core.DirectoryService
/srv/gump/public/workspace/apacheds/syncrepl/src/main/java/org/apache/directory/server/syncrepl/EntryInjector.java:[111,23] cannot find symbol
symbol  : class SearchResponse
location: class org.apache.directory.server.syncrepl.EntryInjector
/srv/gump/public/workspace/apacheds/syncrepl/src/main/java/org/apache/directory/server/syncrepl/EntryInjector.java:[115,20] cannot find symbol
symbol  : class SearchResponse
location: class org.apache.directory.server.syncrepl.EntryInjector
/srv/gump/public/workspace/apacheds/syncrepl/src/main/java/org/apache/directory/server/syncrepl/EntryInjector.java:[116,39] cannot find symbol
symbol  : class SearchResultEntry
location: class org.apache.directory.server.syncrepl.EntryInjector
/srv/gump/public/workspace/apacheds/syncrepl/src/main/java/org/apache/directory/server/syncrepl/EntryInjector.java:[118,47] cannot find symbol
symbol  : class SearchResultEntry
location: class org.apache.directory.server.syncrepl.EntryInjector

[INFO] ------------------------------------------------------------------------
[INFO] For more information, run Maven with the -e switch
[INFO] ------------------------------------------------------------------------
[INFO] Total time: 36 seconds
[INFO] Finished at: Sat Nov 06 19:11:13 UTC 2010
[INFO] Final Memory: 45M/109M
[INFO] ------------------------------------------------------------------------
---------------------------------------------

To subscribe to this information via syndicated feeds:
- RSS: http://vmgump.apache.org/gump/public/apacheds/syncrepl/rss.xml
- Atom: http://vmgump.apache.org/gump/public/apacheds/syncrepl/atom.xml

============================== Gump Tracking Only ===
Produced by Gump version 2.3.
Gump Run 11000606112010, vmgump.apache.org:vmgump:11000606112010
Gump E-mail Identifier (unique within run) #44.

*********************************************************** G U M P
[GUMP@vmgump]: Project apacheds-server-tools (in module apacheds) failed
To whom it may engage...
        
This is an automated request, but not an unsolicited one. For 
more information please visit http://gump.apache.org/nagged.html, 
and/or contact the folk at general@gump.apache.org.

Project apacheds-server-tools has an issue affecting its community integration.
This issue affects 1 projects,
 and has been outstanding for 10 runs.
The current state of this project is 'Failed', with reason 'Build Failed'.
For reference only, the following projects are affected by this:
    - apacheds-server-tools :  Apache Directory Server


Full details are available at:
    http://vmgump.apache.org/gump/public/apacheds/apacheds-server-tools/index.html

That said, some information snippets are provided here.

The following annotations (debug/informational/warning/error messages) were provided:
 -DEBUG- Sole jar output [apacheds-server-tools-*[0-9T].jar] identifier set to project name
 -DEBUG- (Gump generated) Maven Settings in: /srv/gump/public/workspace/apacheds/server-tools/gump_mvn_settings.xml
 -INFO- Failed with reason build failed
 -DEBUG- Maven POM in: /srv/gump/public/workspace/apacheds/server-tools/pom.xml
 -INFO- Failed to extract fallback artifacts from Gump Repository



The following work was performed:
http://vmgump.apache.org/gump/public/apacheds/apacheds-server-tools/gump_work/build_apacheds_apacheds-server-tools.html
Work Name: build_apacheds_apacheds-server-tools (Type: Build)
Work ended in a state of : Failed
Elapsed: 4 secs
Command Line: /opt/maven2/bin/mvn --batch-mode --settings /srv/gump/public/workspace/apacheds/server-tools/gump_mvn_settings.xml install 
[Working Directory: /srv/gump/public/workspace/apacheds/server-tools]
M2_HOME: /opt/maven2
---------------------------------------------
[INFO] Scanning for projects...
[INFO] ------------------------------------------------------------------------
[ERROR] FATAL ERROR
[INFO] ------------------------------------------------------------------------
[INFO] Error building POM (may not be this project's POM).


Project ID: org.apache.directory.server:apacheds-server-tools
POM Location: /srv/gump/public/workspace/apacheds/server-tools/pom.xml
Validation Messages:

    [0]  'dependencies.dependency.version' is missing for org.apache.directory.daemon:daemon-bootstrappers:jar


Reason: Failed to validate POM for project org.apache.directory.server:apacheds-server-tools at /srv/gump/public/workspace/apacheds/server-tools/pom.xml


[INFO] ------------------------------------------------------------------------
[INFO] Trace
org.apache.maven.reactor.MavenExecutionException: Failed to validate POM for project org.apache.directory.server:apacheds-server-tools at /srv/gump/public/workspace/apacheds/server-tools/pom.xml
	at org.apache.maven.DefaultMaven.getProjects(DefaultMaven.java:404)
	at org.apache.maven.DefaultMaven.doExecute(DefaultMaven.java:272)
	at org.apache.maven.DefaultMaven.execute(DefaultMaven.java:138)
	at org.apache.maven.cli.MavenCli.main(MavenCli.java:362)
	at org.apache.maven.cli.compat.CompatibleMain.main(CompatibleMain.java:60)
	at sun.reflect.NativeMethodAccessorImpl.invoke0(Native Method)
	at sun.reflect.NativeMethodAccessorImpl.invoke(NativeMethodAccessorImpl.java:57)
	at sun.reflect.DelegatingMethodAccessorImpl.invoke(DelegatingMethodAccessorImpl.java:43)
	at java.lang.reflect.Method.invoke(Method.java:616)
	at org.codehaus.classworlds.Launcher.launchEnhanced(Launcher.java:315)
	at org.codehaus.classworlds.Launcher.launch(Launcher.java:255)
	at org.codehaus.classworlds.Launcher.mainWithExitCode(Launcher.java:430)
	at org.codehaus.classworlds.Launcher.main(Launcher.java:375)
Caused by: org.apache.maven.project.InvalidProjectModelException: Failed to validate POM for project org.apache.directory.server:apacheds-server-tools at /srv/gump/public/workspace/apacheds/server-tools/pom.xml
	at org.apache.maven.project.DefaultMavenProjectBuilder.processProjectLogic(DefaultMavenProjectBuilder.java:1077)
	at org.apache.maven.project.DefaultMavenProjectBuilder.buildInternal(DefaultMavenProjectBuilder.java:880)
	at org.apache.maven.project.DefaultMavenProjectBuilder.buildFromSourceFileInternal(DefaultMavenProjectBuilder.java:508)
	at org.apache.maven.project.DefaultMavenProjectBuilder.build(DefaultMavenProjectBuilder.java:200)
	at org.apache.maven.DefaultMaven.getProject(DefaultMaven.java:604)
	at org.apache.maven.DefaultMaven.collectProjects(DefaultMaven.java:487)
	at org.apache.maven.DefaultMaven.getProjects(DefaultMaven.java:391)
	... 12 more
[INFO] ------------------------------------------------------------------------
[INFO] Total time: 1 second
[INFO] Finished at: Sat Nov 06 19:12:39 UTC 2010
[INFO] Final Memory: 3M/15M
[INFO] ------------------------------------------------------------------------
---------------------------------------------

To subscribe to this information via syndicated feeds:
- RSS: http://vmgump.apache.org/gump/public/apacheds/apacheds-server-tools/rss.xml
- Atom: http://vmgump.apache.org/gump/public/apacheds/apacheds-server-tools/atom.xml

============================== Gump Tracking Only ===
Produced by Gump version 2.3.
Gump Run 11000606112010, vmgump.apache.org:vmgump:11000606112010
Gump E-mail Identifier (unique within run) #45.

*********************************************************** G U M P
[GUMP@vmgump]: Project portals-bridges-script-test (in module portals-bridges) failed
To whom it may engage...
        
This is an automated request, but not an unsolicited one. For 
more information please visit http://gump.apache.org/nagged.html, 
and/or contact the folk at general@gump.apache.org.

Project portals-bridges-script-test has an issue affecting its community integration.
This issue affects 1 projects,
 and has been outstanding for 36 runs.
The current state of this project is 'Failed', with reason 'Build Failed'.
For reference only, the following projects are affected by this:
    - portals-bridges-script-test :  Support for JSR168 compliant Portlet development


Full details are available at:
    http://vmgump.apache.org/gump/public/portals-bridges/portals-bridges-script-test/index.html

That said, some information snippets are provided here.

The following annotations (debug/informational/warning/error messages) were provided:
 -WARNING- Overriding Maven settings: [/srv/gump/public/workspace/portals-bridges/bridges-script/trunk/portlet/gump_mvn_settings.xml]
 -DEBUG- (Gump generated) Maven Settings in: /srv/gump/public/workspace/portals-bridges/bridges-script/trunk/portlet/gump_mvn_settings.xml
 -INFO- Failed with reason build failed
 -DEBUG- Maven POM in: /srv/gump/public/workspace/portals-bridges/bridges-script/trunk/portlet/pom.xml



The following work was performed:
http://vmgump.apache.org/gump/public/portals-bridges/portals-bridges-script-test/gump_work/build_portals-bridges_portals-bridges-script-test.html
Work Name: build_portals-bridges_portals-bridges-script-test (Type: Build)
Work ended in a state of : Failed
Elapsed: 50 secs
Command Line: /opt/maven2/bin/mvn --batch-mode --settings /srv/gump/public/workspace/portals-bridges/bridges-script/trunk/portlet/gump_mvn_settings.xml package 
[Working Directory: /srv/gump/public/workspace/portals-bridges/bridges-script/trunk/portlet]
M2_HOME: /opt/maven2
---------------------------------------------
[INFO] Surefire report directory: /srv/gump/public/workspace/portals-bridges/bridges-script/trunk/portlet/target/surefire-reports

-------------------------------------------------------
 T E S T S
-------------------------------------------------------
Running org.apache.portals.bridges.script.TestHelloJythonScriptPortlet
Tests run: 5, Failures: 0, Errors: 5, Skipped: 0, Time elapsed: 10.473 sec <<< FAILURE!
Running org.apache.portals.bridges.script.TestHelloJRubyScriptPortlet
Tests run: 5, Failures: 0, Errors: 0, Skipped: 0, Time elapsed: 5.994 sec
Running org.apache.portals.bridges.script.TestHelloRhinoScriptPortlet
[WARNING] Rhino script engine embedded in the default Java 1.6+ has not fully tested yet.
[WARNING] Rhino script engine embedded in the default Java 1.6+ has not fully tested yet.
[WARNING] Rhino script engine embedded in the default Java 1.6+ has not fully tested yet.
[WARNING] Rhino script engine embedded in the default Java 1.6+ has not fully tested yet.
[WARNING] Rhino script engine embedded in the default Java 1.6+ has not fully tested yet.
[WARNING] Rhino script engine embedded in the default Java 1.6+ has not fully tested yet.
[WARNING] Rhino script engine embedded in the default Java 1.6+ has not fully tested yet.
[WARNING] Rhino script engine embedded in the default Java 1.6+ has not fully tested yet.
[WARNING] Rhino script engine embedded in the default Java 1.6+ has not fully tested yet.
[WARNING] Rhino script engine embedded in the default Java 1.6+ has not fully tested yet.
Tests run: 5, Failures: 0, Errors: 0, Skipped: 0, Time elapsed: 2.315 sec
Running org.apache.portals.bridges.script.TestHelloGroovyScriptPortlet
Tests run: 5, Failures: 0, Errors: 0, Skipped: 0, Time elapsed: 9.009 sec
Running org.apache.portals.bridges.script.TestHelloBeanShellScriptPortlet
Tests run: 5, Failures: 0, Errors: 0, Skipped: 0, Time elapsed: 5.639 sec

Results :

Tests in error: 
  testInit(org.apache.portals.bridges.script.TestHelloJythonScriptPortlet)
  testRender(org.apache.portals.bridges.script.TestHelloJythonScriptPortlet)
  testProcessAction(org.apache.portals.bridges.script.TestHelloJythonScriptPortlet)
  testProcessEvent(org.apache.portals.bridges.script.TestHelloJythonScriptPortlet)
  testServeResource(org.apache.portals.bridges.script.TestHelloJythonScriptPortlet)

Tests run: 25, Failures: 0, Errors: 5, Skipped: 0

[INFO] ------------------------------------------------------------------------
[ERROR] BUILD FAILURE
[INFO] ------------------------------------------------------------------------
[INFO] There are test failures.

Please refer to /srv/gump/public/workspace/portals-bridges/bridges-script/trunk/portlet/target/surefire-reports for the individual test results.
[INFO] ------------------------------------------------------------------------
[INFO] For more information, run Maven with the -e switch
[INFO] ------------------------------------------------------------------------
[INFO] Total time: 48 seconds
[INFO] Finished at: Sat Nov 06 19:25:28 UTC 2010
[INFO] Final Memory: 24M/57M
[INFO] ------------------------------------------------------------------------
---------------------------------------------

To subscribe to this information via syndicated feeds:
- RSS: http://vmgump.apache.org/gump/public/portals-bridges/portals-bridges-script-test/rss.xml
- Atom: http://vmgump.apache.org/gump/public/portals-bridges/portals-bridges-script-test/atom.xml

============================== Gump Tracking Only ===
Produced by Gump version 2.3.
Gump Run 11000606112010, vmgump.apache.org:vmgump:11000606112010
Gump E-mail Identifier (unique within run) #46.

*********************************************************** G U M P
[GUMP@vmgump]: Project apacheds-server-config (in module apacheds) failed
To whom it may engage...
        
This is an automated request, but not an unsolicited one. For 
more information please visit http://gump.apache.org/nagged.html, 
and/or contact the folk at general@gump.apache.org.

Project apacheds-server-config has an issue affecting its community integration.
This issue affects 3 projects,
 and has been outstanding for 10 runs.
The current state of this project is 'Failed', with reason 'Missing Build Outputs'.
For reference only, the following projects are affected by this:
    - apacheds-server-config :  Apache Directory Server
    - apacheds-service :  Apache Directory Server
    - apacheds-wrapper :  Apache Directory Server


Full details are available at:
    http://vmgump.apache.org/gump/public/apacheds/apacheds-server-config/index.html

That said, some information snippets are provided here.

The following annotations (debug/informational/warning/error messages) were provided:
 -DEBUG- Sole jar output [apacheds-server-config-*[0-9T].jar] identifier set to project name
 -DEBUG- (Gump generated) Maven Settings in: /srv/gump/public/workspace/apacheds/server-config/gump_mvn_settings.xml
 -DEBUG- Maven POM in: /srv/gump/public/workspace/apacheds/server-config/pom.xml
 -INFO- Failed with reason missing build outputs
 -ERROR- Missing Output: /srv/gump/public/workspace/apacheds/server-config/target/apacheds-server-config-*[0-9T].jar
 -ERROR- See Directory Listing Work for Missing Outputs
 -INFO- Failed to extract fallback artifacts from Gump Repository



The following work was performed:
http://vmgump.apache.org/gump/public/apacheds/apacheds-server-config/gump_work/build_apacheds_apacheds-server-config.html
Work Name: build_apacheds_apacheds-server-config (Type: Build)
Work ended in a state of : Success
Elapsed: 46 secs
Command Line: /opt/maven2/bin/mvn --batch-mode --settings /srv/gump/public/workspace/apacheds/server-config/gump_mvn_settings.xml install 
[Working Directory: /srv/gump/public/workspace/apacheds/server-config]
M2_HOME: /opt/maven2
---------------------------------------------
[INFO] Copying 1 resource
[INFO] Copying 3 resources
[INFO] [compiler:compile {execution: default-compile}]
[INFO] Compiling 33 source files to /srv/gump/public/workspace/apacheds/server-config/target/classes
[INFO] [resources:testResources {execution: default-testResources}]
[INFO] Using 'UTF-8' encoding to copy filtered resources.
[INFO] Copying 8 resources
[INFO] Copying 3 resources
[INFO] [compiler:testCompile {execution: default-testCompile}]
[INFO] Compiling 8 source files to /srv/gump/public/workspace/apacheds/server-config/target/test-classes
[INFO] [surefire:test {execution: default-test}]
[INFO] Surefire report directory: /srv/gump/public/workspace/apacheds/server-config/target/surefire-reports

-------------------------------------------------------
 T E S T S
-------------------------------------------------------
Running org.apache.directory.server.config.KerberosServerConfigReaderTest
Tests run: 1, Failures: 0, Errors: 0, Skipped: 0, Time elapsed: 4.428 sec
Running org.apache.directory.server.config.DnsServerConfigReaderTest
Tests run: 1, Failures: 0, Errors: 0, Skipped: 0, Time elapsed: 5.532 sec
Running org.apache.directory.server.config.DhcpServerConfigReaderTest
Tests run: 1, Failures: 0, Errors: 0, Skipped: 0, Time elapsed: 1.564 sec
Running org.apache.directory.server.config.HttpServerConfigReaderTest
Tests run: 1, Failures: 0, Errors: 0, Skipped: 0, Time elapsed: 1.755 sec
Running org.apache.directory.server.config.ConfigPartitionReaderTest
Tests run: 1, Failures: 0, Errors: 0, Skipped: 0, Time elapsed: 2.673 sec
Running org.apache.directory.server.config.NtpServerConfigReaderTest
Tests run: 1, Failures: 0, Errors: 0, Skipped: 0, Time elapsed: 1.114 sec
Running org.apache.directory.server.config.ChangePasswordConfigReaderTest
Tests run: 1, Failures: 0, Errors: 0, Skipped: 0, Time elapsed: 1.405 sec
Running org.apache.directory.server.config.LdapServerConfigReaderTest
Tests run: 1, Failures: 0, Errors: 0, Skipped: 0, Time elapsed: 1.695 sec

Results :

Tests run: 8, Failures: 0, Errors: 0, Skipped: 0

[INFO] [jar:jar {execution: default-jar}]
[INFO] Building jar: /srv/gump/public/workspace/apacheds/server-config/target/server-config-1.5.8-SNAPSHOT.jar
[INFO] [tools:verify-legal-files {execution: verify-legal-files}]
[INFO] Checking legal files in: server-config-1.5.8-SNAPSHOT.jar
[INFO] [install:install {execution: default-install}]
[INFO] Installing /srv/gump/public/workspace/apacheds/server-config/target/server-config-1.5.8-SNAPSHOT.jar to /srv/gump/public/workspace/mvnlocalrepo/shared/org/apache/directory/server/server-config/1.5.8-SNAPSHOT/server-config-1.5.8-SNAPSHOT.jar
[INFO] ------------------------------------------------------------------------
[INFO] BUILD SUCCESSFUL
[INFO] ------------------------------------------------------------------------
[INFO] Total time: 45 seconds
[INFO] Finished at: Sat Nov 06 19:26:52 UTC 2010
[INFO] Final Memory: 62M/150M
[INFO] ------------------------------------------------------------------------
---------------------------------------------

To subscribe to this information via syndicated feeds:
- RSS: http://vmgump.apache.org/gump/public/apacheds/apacheds-server-config/rss.xml
- Atom: http://vmgump.apache.org/gump/public/apacheds/apacheds-server-config/atom.xml

============================== Gump Tracking Only ===
Produced by Gump version 2.3.
Gump Run 11000606112010, vmgump.apache.org:vmgump:11000606112010
Gump E-mail Identifier (unique within run) #47.

*********************************************************** G U M P
[GUMP@vmgump]: Project portals-pluto-trunk-test (in module portals-pluto-trunk) failed
To whom it may engage...
        
This is an automated request, but not an unsolicited one. For 
more information please visit http://gump.apache.org/nagged.html, 
and/or contact the folk at general@gump.apache.org.

Project portals-pluto-trunk-test has an issue affecting its community integration.
This issue affects 1 projects,
 and has been outstanding for 77 runs.
The current state of this project is 'Failed', with reason 'Build Failed'.
For reference only, the following projects are affected by this:
    - portals-pluto-trunk-test :  JSR168 Container


Full details are available at:
    http://vmgump.apache.org/gump/public/portals-pluto-trunk/portals-pluto-trunk-test/index.html

That said, some information snippets are provided here.

The following annotations (debug/informational/warning/error messages) were provided:
 -WARNING- Overriding Maven settings: [/srv/gump/public/workspace/portals-pluto-trunk/gump_mvn_settings.xml]
 -DEBUG- (Gump generated) Maven Settings in: /srv/gump/public/workspace/portals-pluto-trunk/gump_mvn_settings.xml
 -INFO- Failed with reason build failed
 -DEBUG- Maven POM in: /srv/gump/public/workspace/portals-pluto-trunk/pom.xml



The following work was performed:
http://vmgump.apache.org/gump/public/portals-pluto-trunk/portals-pluto-trunk-test/gump_work/build_portals-pluto-trunk_portals-pluto-trunk-test.html
Work Name: build_portals-pluto-trunk_portals-pluto-trunk-test (Type: Build)
Work ended in a state of : Failed
Elapsed: 27 secs
Command Line: /opt/maven2/bin/mvn --batch-mode --settings /srv/gump/public/workspace/portals-pluto-trunk/gump_mvn_settings.xml package 
[Working Directory: /srv/gump/public/workspace/portals-pluto-trunk]
M2_HOME: /opt/maven2
---------------------------------------------
[ERROR] FATAL ERROR
[INFO] ------------------------------------------------------------------------
[INFO] org/xmlpull/v1/XmlPullParserFactory
org.xmlpull.v1.XmlPullParserFactory
[INFO] ------------------------------------------------------------------------
[INFO] Trace
java.lang.NoClassDefFoundError: org/xmlpull/v1/XmlPullParserFactory
	at com.thoughtworks.xstream.io.xml.XppDriver.createParser(XppDriver.java:57)
	at com.thoughtworks.xstream.io.xml.AbstractXppDriver.createReader(AbstractXppDriver.java:56)
	at com.thoughtworks.xstream.XStream.fromXML(XStream.java:879)
	at org.apache.maven.plugin.war.util.WebappStructureSerializer.fromXml(WebappStructureSerializer.java:73)
	at org.apache.maven.plugin.war.AbstractWarMojo.buildWebapp(AbstractWarMojo.java:423)
	at org.apache.maven.plugin.war.AbstractWarMojo.buildExplodedWebapp(AbstractWarMojo.java:394)
	at org.apache.maven.plugin.war.WarMojo.performPackaging(WarMojo.java:195)
	at org.apache.maven.plugin.war.WarMojo.execute(WarMojo.java:157)
	at org.apache.maven.plugin.DefaultPluginManager.executeMojo(DefaultPluginManager.java:490)
	at org.apache.maven.lifecycle.DefaultLifecycleExecutor.executeGoals(DefaultLifecycleExecutor.java:694)
	at org.apache.maven.lifecycle.DefaultLifecycleExecutor.executeGoalWithLifecycle(DefaultLifecycleExecutor.java:556)
	at org.apache.maven.lifecycle.DefaultLifecycleExecutor.executeGoal(DefaultLifecycleExecutor.java:535)
	at org.apache.maven.lifecycle.DefaultLifecycleExecutor.executeGoalAndHandleFailures(DefaultLifecycleExecutor.java:387)
	at org.apache.maven.lifecycle.DefaultLifecycleExecutor.executeTaskSegments(DefaultLifecycleExecutor.java:348)
	at org.apache.maven.lifecycle.DefaultLifecycleExecutor.execute(DefaultLifecycleExecutor.java:180)
	at org.apache.maven.DefaultMaven.doExecute(DefaultMaven.java:328)
	at org.apache.maven.DefaultMaven.execute(DefaultMaven.java:138)
	at org.apache.maven.cli.MavenCli.main(MavenCli.java:362)
	at org.apache.maven.cli.compat.CompatibleMain.main(CompatibleMain.java:60)
	at sun.reflect.NativeMethodAccessorImpl.invoke0(Native Method)
	at sun.reflect.NativeMethodAccessorImpl.invoke(NativeMethodAccessorImpl.java:57)
	at sun.reflect.DelegatingMethodAccessorImpl.invoke(DelegatingMethodAccessorImpl.java:43)
	at java.lang.reflect.Method.invoke(Method.java:616)
	at org.codehaus.classworlds.Launcher.launchEnhanced(Launcher.java:315)
	at org.codehaus.classworlds.Launcher.launch(Launcher.java:255)
	at org.codehaus.classworlds.Launcher.mainWithExitCode(Launcher.java:430)
	at org.codehaus.classworlds.Launcher.main(Launcher.java:375)
Caused by: java.lang.ClassNotFoundException: org.xmlpull.v1.XmlPullParserFactory
	at java.net.URLClassLoader$1.run(URLClassLoader.java:217)
	at java.security.AccessController.doPrivileged(Native Method)
	at java.net.URLClassLoader.findClass(URLClassLoader.java:205)
	at java.lang.ClassLoader.loadClass(ClassLoader.java:321)
	at org.codehaus.classworlds.RealmClassLoader.loadClassDirect(RealmClassLoader.java:195)
	at org.codehaus.classworlds.DefaultClassRealm.loadClass(DefaultClassRealm.java:255)
	at org.codehaus.classworlds.DefaultClassRealm.loadClass(DefaultClassRealm.java:274)
	at org.codehaus.classworlds.RealmClassLoader.loadClass(RealmClassLoader.java:214)
	at java.lang.ClassLoader.loadClass(ClassLoader.java:266)
	... 27 more
[INFO] ------------------------------------------------------------------------
[INFO] Total time: 26 seconds
[INFO] Finished at: Sat Nov 06 19:27:55 UTC 2010
[INFO] Final Memory: 51M/122M
[INFO] ------------------------------------------------------------------------
---------------------------------------------

To subscribe to this information via syndicated feeds:
- RSS: http://vmgump.apache.org/gump/public/portals-pluto-trunk/portals-pluto-trunk-test/rss.xml
- Atom: http://vmgump.apache.org/gump/public/portals-pluto-trunk/portals-pluto-trunk-test/atom.xml

============================== Gump Tracking Only ===
Produced by Gump version 2.3.
Gump Run 11000606112010, vmgump.apache.org:vmgump:11000606112010
Gump E-mail Identifier (unique within run) #48.

*********************************************************** G U M P
[GUMP@vmgump]: Project activemq-jaas (in module activemq) failed
To whom it may engage...
        
This is an automated request, but not an unsolicited one. For 
more information please visit http://gump.apache.org/nagged.html, 
and/or contact the folk at general@gump.apache.org.

Project activemq-jaas has an issue affecting its community integration.
This issue affects 5 projects,
 and has been outstanding for 82 runs.
The current state of this project is 'Failed', with reason 'Build Failed'.
For reference only, the following projects are affected by this:
    - activemq-core :  ActiveMQ :: Core
    - activemq-jaas :  ActiveMQ :: JAAS
    - activemq-jaas-test :  ActiveMQ message broker and enterprise integration patterns ...
    - activemq-pool :  ActiveMQ :: Pool
    - activemq-ra :  ActiveMQ :: RA


Full details are available at:
    http://vmgump.apache.org/gump/public/activemq/activemq-jaas/index.html

That said, some information snippets are provided here.

The following annotations (debug/informational/warning/error messages) were provided:
 -DEBUG- Sole jar output [activemq-jaas-*[0-9T].jar] identifier set to project name
 -INFO- Optional dependency castor prerequisite failed with reason build failed
 -DEBUG- (Gump generated) Maven Settings in: /srv/gump/public/workspace/activemq/activemq-jaas/gump_mvn_settings.xml
 -INFO- Failed with reason build failed
 -DEBUG- Maven POM in: /srv/gump/public/workspace/activemq/activemq-jaas/pom.xml
 -INFO- Failed to extract fallback artifacts from Gump Repository



The following work was performed:
http://vmgump.apache.org/gump/public/activemq/activemq-jaas/gump_work/build_activemq_activemq-jaas.html
Work Name: build_activemq_activemq-jaas (Type: Build)
Work ended in a state of : Failed
Elapsed: 31 secs
Command Line: /opt/maven2/bin/mvn --batch-mode -DskipTests=true --settings /srv/gump/public/workspace/activemq/activemq-jaas/gump_mvn_settings.xml install 
[Working Directory: /srv/gump/public/workspace/activemq/activemq-jaas]
M2_HOME: /opt/maven2
---------------------------------------------
[INFO] [remote-resources:process {execution: default}]
[INFO] [resources:resources {execution: default-resources}]
[INFO] Using 'UTF-8' encoding to copy filtered resources.
[INFO] skip non existing resourceDirectory /srv/gump/public/workspace/activemq/activemq-jaas/src/main/resources
[INFO] Copying 3 resources
[INFO] [compiler:compile {execution: default-compile}]
[INFO] Compiling 11 source files to /srv/gump/public/workspace/activemq/activemq-jaas/target/classes
[INFO] [resources:testResources {execution: default-testResources}]
[INFO] Using 'UTF-8' encoding to copy filtered resources.
[INFO] Copying 4 resources
[INFO] Copying 3 resources
[INFO] [compiler:testCompile {execution: default-testCompile}]
[INFO] Compiling 7 source files to /srv/gump/public/workspace/activemq/activemq-jaas/target/test-classes
[INFO] ------------------------------------------------------------------------
[ERROR] BUILD FAILURE
[INFO] ------------------------------------------------------------------------
[INFO] Compilation failure

/srv/gump/public/workspace/activemq/activemq-jaas/src/test/java/org/apache/activemq/jaas/LDAPLoginModuleTest.java:[39,45] cannot find symbol
symbol  : class Level
location: package org.apache.directory.server.core.integ

/srv/gump/public/workspace/activemq/activemq-jaas/src/test/java/org/apache/activemq/jaas/LDAPLoginModuleTest.java:[40,57] package org.apache.directory.server.core.integ.annotations does not exist

/srv/gump/public/workspace/activemq/activemq-jaas/src/test/java/org/apache/activemq/jaas/LDAPLoginModuleTest.java:[41,57] package org.apache.directory.server.core.integ.annotations does not exist

/srv/gump/public/workspace/activemq/activemq-jaas/src/test/java/org/apache/activemq/jaas/LDAPLoginModuleTest.java:[42,40] cannot find symbol
symbol  : class SiRunner
location: package org.apache.directory.server.integ

/srv/gump/public/workspace/activemq/activemq-jaas/src/test/java/org/apache/activemq/jaas/LDAPLoginModuleTest.java:[49,1] cannot find symbol
symbol: class CleanupLevel
@CleanupLevel ( Level.CLASS )

/srv/gump/public/workspace/activemq/activemq-jaas/src/test/java/org/apache/activemq/jaas/LDAPLoginModuleTest.java:[50,1] cannot find symbol
symbol: class ApplyLdifs
@ApplyLdifs( {

/srv/gump/public/workspace/activemq/activemq-jaas/src/test/java/org/apache/activemq/jaas/LDAPLoginModuleTest.java:[48,11] cannot find symbol
symbol: class SiRunner
@RunWith ( SiRunner.class ) 


[INFO] ------------------------------------------------------------------------
[INFO] For more information, run Maven with the -e switch
[INFO] ------------------------------------------------------------------------
[INFO] Total time: 29 seconds
[INFO] Finished at: Sat Nov 06 19:39:53 UTC 2010
[INFO] Final Memory: 59M/141M
[INFO] ------------------------------------------------------------------------
---------------------------------------------

To subscribe to this information via syndicated feeds:
- RSS: http://vmgump.apache.org/gump/public/activemq/activemq-jaas/rss.xml
- Atom: http://vmgump.apache.org/gump/public/activemq/activemq-jaas/atom.xml

============================== Gump Tracking Only ===
Produced by Gump version 2.3.
Gump Run 11000606112010, vmgump.apache.org:vmgump:11000606112010
Gump E-mail Identifier (unique within run) #49.

*********************************************************** G U M P
[GUMP@vmgump]: Project james-server (in module james-server) failed
To whom it may engage...
        
This is an automated request, but not an unsolicited one. For 
more information please visit http://gump.apache.org/nagged.html, 
and/or contact the folk at general@gump.apache.org.

Project james-server has an issue affecting its community integration.
This issue affects 2 projects,
 and has been outstanding for 5 runs.
The current state of this project is 'Failed', with reason 'Build Failed'.
For reference only, the following projects are affected by this:
    - james-server :  James Server
    - james-server-test :  James Server


Full details are available at:
    http://vmgump.apache.org/gump/public/james-server/james-server/index.html

That said, some information snippets are provided here.

The following annotations (debug/informational/warning/error messages) were provided:
 -INFO- Optional dependency james-imap prerequisite failed with reason build failed
 -INFO- Optional dependency jcs prerequisite failed with reason missing build outputs
 -INFO- Optional dependency james-jsieve failed with reason build failed
 -INFO- Optional dependency openjpa prerequisite failed with reason build failed
 -INFO- Optional dependency activemq-pool prerequisite failed with reason build failed
 -INFO- Optional dependency activemq-core prerequisite failed with reason build failed
 -DEBUG- (Gump generated) Maven Settings in: /srv/gump/public/workspace/james-server/gump_mvn_settings.xml
 -INFO- Failed with reason build failed
 -DEBUG- Maven POM in: /srv/gump/public/workspace/james-server/pom.xml
 -INFO- Failed to extract fallback artifacts from Gump Repository



The following work was performed:
http://vmgump.apache.org/gump/public/james-server/james-server/gump_work/build_james-server_james-server.html
Work Name: build_james-server_james-server (Type: Build)
Work ended in a state of : Failed
Elapsed: 5 mins 9 secs
Command Line: /opt/maven2/bin/mvn --batch-mode -DskipTests=true --settings /srv/gump/public/workspace/james-server/gump_mvn_settings.xml install 
[Working Directory: /srv/gump/public/workspace/james-server]
MAVEN_OPTS: -Xmx768m 
M2_HOME: /opt/maven2
---------------------------------------------
[ERROR] BUILD FAILURE
[INFO] ------------------------------------------------------------------------
[INFO] Compilation failure
Failure executing javac, but could not parse the error:


The system is out of resources.
Consult the following stack trace for details.
java.lang.OutOfMemoryError: PermGen space
	at java.lang.ClassLoader.defineClass1(Native Method)
	at java.lang.ClassLoader.defineClass(ClassLoader.java:634)
	at java.security.SecureClassLoader.defineClass(SecureClassLoader.java:142)
	at java.net.URLClassLoader.defineClass(URLClassLoader.java:277)
	at java.net.URLClassLoader.access$000(URLClassLoader.java:73)
	at java.net.URLClassLoader$1.run(URLClassLoader.java:212)
	at java.security.AccessController.doPrivileged(Native Method)
	at java.net.URLClassLoader.findClass(URLClassLoader.java:205)
	at org.codehaus.plexus.compiler.javac.IsolatedClassLoader.loadClass(IsolatedClassLoader.java:56)
	at com.sun.tools.javac.main.JavaCompiler.<init>(JavaCompiler.java:307)
	at com.sun.tools.javac.main.JavaCompiler.instance(JavaCompiler.java:86)
	at com.sun.tools.javac.main.Main.compile(Main.java:367)
	at com.sun.tools.javac.main.Main.compile(Main.java:306)
	at com.sun.tools.javac.main.Main.compile(Main.java:297)
	at com.sun.tools.javac.Main.compile(Main.java:100)
	at sun.reflect.NativeMethodAccessorImpl.invoke0(Native Method)
	at sun.reflect.NativeMethodAccessorImpl.invoke(NativeMethodAccessorImpl.java:57)
	at sun.reflect.DelegatingMethodAccessorImpl.invoke(DelegatingMethodAccessorImpl.java:43)
	at java.lang.reflect.Method.invoke(Method.java:616)
	at org.codehaus.plexus.compiler.javac.JavacCompiler.compileInProcess(JavacCompiler.java:420)
	at org.codehaus.plexus.compiler.javac.JavacCompiler.compile(JavacCompiler.java:141)
	at org.apache.maven.plugin.AbstractCompilerMojo.execute(AbstractCompilerMojo.java:493)
	at org.apache.maven.plugin.CompilerMojo.execute(CompilerMojo.java:114)
	at org.apache.maven.plugin.DefaultPluginManager.executeMojo(DefaultPluginManager.java:490)
	at org.apache.maven.lifecycle.DefaultLifecycleExecutor.executeGoals(DefaultLifecycleExecutor.java:694)
	at org.apache.maven.lifecycle.DefaultLifecycleExecutor.executeGoalWithLifecycle(DefaultLifecycleExecutor.java:556)
	at org.apache.maven.lifecycle.DefaultLifecycleExecutor.executeGoal(DefaultLifecycleExecutor.java:535)
	at org.apache.maven.lifecycle.DefaultLifecycleExecutor.executeGoalAndHandleFailures(DefaultLifecycleExecutor.java:387)
	at org.apache.maven.lifecycle.DefaultLifecycleExecutor.executeTaskSegments(DefaultLifecycleExecutor.java:348)
	at org.apache.maven.lifecycle.DefaultLifecycleExecutor.execute(DefaultLifecycleExecutor.java:180)
	at org.apache.maven.DefaultMaven.doExecute(DefaultMaven.java:328)
	at org.apache.maven.DefaultMaven.execute(DefaultMaven.java:138)


[INFO] ------------------------------------------------------------------------
[INFO] For more information, run Maven with the -e switch
[INFO] ------------------------------------------------------------------------
[INFO] Total time: 5 minutes 7 seconds
[INFO] Finished at: Sat Nov 06 19:51:10 UTC 2010
[INFO] Final Memory: 107M/630M
[INFO] ------------------------------------------------------------------------
---------------------------------------------

To subscribe to this information via syndicated feeds:
- RSS: http://vmgump.apache.org/gump/public/james-server/james-server/rss.xml
- Atom: http://vmgump.apache.org/gump/public/james-server/james-server/atom.xml

============================== Gump Tracking Only ===
Produced by Gump version 2.3.
Gump Run 11000606112010, vmgump.apache.org:vmgump:11000606112010
Gump E-mail Identifier (unique within run) #50.


--
Apache Gump
http://gump.apache.org/ [Instance: vmgump]

---------------------------------------------------------------------
To unsubscribe, e-mail: general-unsubscribe@gump.apache.org
For additional commands, e-mail: general-help@gump.apache.org


Mime
View raw message