gump-general mailing list archives

Site index · List index
Message view « Date » · « Thread »
Top « Date » · « Thread »
From g...@vmgump.apache.org
Subject BATCH: All dressed up, with nowhere to go...
Date Sun, 24 Oct 2010 14:58:54 GMT
Dear Gumpmeisters,
            
The following 30 notifys should have been sent

*********************************************************** G U M P
[GUMP@vmgump]: Project expat-configure (in module expat) failed
[GUMP@vmgump]: Project hamcrest-java-unit-test (in module hamcrest) failed
[GUMP@vmgump]: Project lucene-java-analyzers-test (in module lucene-java) failed
[GUMP@vmgump]: Project santuario-tests (in module santuario) failed
[GUMP@vmgump]: Project wss4j (in module ws-wss4j) failed
[GUMP@vmgump]: Project pdfbox-lucene (in module pdfbox) failed
[GUMP@vmgump]: Project xstream-test (in module xstream) failed
[GUMP@vmgump]: Project apache-mime4j-reactor (in module james-mime4j) failed
[GUMP@vmgump]: Project commons-jci-reactor (in module apache-commons) failed
[GUMP@vmgump]: Project james-jsieve (in module james-jsieve) failed
[GUMP@vmgump]: Project camel-spring-test (in module camel) failed
[GUMP@vmgump]: Project htmlunit (in module htmlunit) failed
[GUMP@vmgump]: Project solr-test (in module lucene-java) failed
[GUMP@vmgump]: Project commons-jelly-tags-ant-test (in module commons-jelly) failed
[GUMP@vmgump]: Project portals-pluto-portal-1.0 (in module portals-pluto-1.0) failed
[GUMP@vmgump]: Project cocoon22-flowscript-impl (in module cocoon) failed
[GUMP@vmgump]: Project tapestry (in module tapestry) failed
[GUMP@vmgump]: Project cocoon22-reactor (in module cocoon) failed
[GUMP@vmgump]: Project ws-commons-axiom (in module ws-axis2-commons) failed
[GUMP@vmgump]: Project ws-axis2 (in module ws-axis2) failed
[GUMP@vmgump]: Project apacheds-protocol-ldap (in module apacheds) failed
[GUMP@vmgump]: Project cactus-test (in module jakarta-cactus) failed
[GUMP@vmgump]: Project openjpa-kernel (in module openjpa) failed
[GUMP@vmgump]: Project cocoon3-reactor (in module cocoon3) failed
[GUMP@vmgump]: Project portals-bridges-script-test (in module portals-bridges) failed
[GUMP@vmgump]: Project cocoon-optional-test (in module cocoon3) failed
[GUMP@vmgump]: Project portals-pluto-trunk-test (in module portals-pluto-trunk) failed
[GUMP@vmgump]: Project activemq-jaas (in module activemq) failed
[GUMP@vmgump]: Project james-imap-test (in module james-imap) failed
[GUMP@vmgump]: Project james-server (in module james-server) failed
*********************************************************** G U M P
[GUMP@vmgump]: Project expat-configure (in module expat) failed
To whom it may engage...
        
This is an automated request, but not an unsolicited one. For 
more information please visit http://gump.apache.org/nagged.html, 
and/or contact the folk at general@gump.apache.org.

Project expat-configure has an issue affecting its community integration.
This issue affects 22 projects,
 and has been outstanding for 139 runs.
The current state of this project is 'Failed', with reason 'Build Failed'.
For reference only, the following projects are affected by this:
    - apache-httpd-buildconf :  Apache HTTP Server
    - apache-httpd-configure :  Apache HTTP Server
    - apache-httpd-make :  Apache HTTP Server
    - apache-httpd-make-install :  Apache HTTP Server
    - apr-configure :  Apache Portable Runtime
    - apr-iconv-buildconf :  Apache Portable Runtime
    - apr-iconv-configure :  Apache Portable Runtime
    - apr-iconv-make :  Apache Portable Runtime
    - apr-make :  Apache Portable Runtime
    - apr-make-install :  Apache Portable Runtime
    - expat :  The Expat XML Parser
    - expat-configure :  The Expat XML Parser
    - expat-make :  The Expat XML Parser
    - jakarta-tomcat-jk-native :  Connectors to various web servers
    - jakarta-tomcat-jk-native-buildconf :  Connectors to various web servers
    - jakarta-tomcat-jk-native-configure :  Connectors to various web servers
    - logging-log4cxx-ant :  Apache log4cxx
    - logging-log4cxx-ant-no_wchar_t :  Apache log4cxx
    - logging-log4cxx-ant-static :  Apache log4cxx
    - logging-log4cxx-configure :  Apache log4cxx
    - logging-log4cxx-make :  Apache log4cxx
    - logging-log4cxx-make-install :  Apache log4cxx


Full details are available at:
    http://vmgump.apache.org/gump/public/expat/expat-configure/index.html

That said, some information snippets are provided here.

The following annotations (debug/informational/warning/error messages) were provided:
 -INFO- Failed with reason build failed



The following work was performed:
http://vmgump.apache.org/gump/public/expat/expat-configure/gump_work/buildscript_expat_expat-configure.html
Work Name: buildscript_expat_expat-configure (Type: Build)
Work ended in a state of : Failed
Elapsed: 1 sec
Command Line: /srv/gump/public/workspace/expat/configure --prefix=/srv/gump/public/workspace/expat/dest-24102010 
[Working Directory: /srv/gump/public/workspace/expat]
---------------------------------------------
/srv/gump/public/workspace/expat/configure: line 3336: AC_LIBTOOL_WIN32_DLL: command not found
/srv/gump/public/workspace/expat/configure: line 3343: LTOPTIONS_VERSION: command not found
/srv/gump/public/workspace/expat/configure: line 3344: LTSUGAR_VERSION: command not found
/srv/gump/public/workspace/expat/configure: line 3345: LTVERSION_VERSION: command not found
/srv/gump/public/workspace/expat/configure: line 3346: LTOBSOLETE_VERSION: command not found
checking build system type... x86_64-unknown-linux-gnu
checking host system type... x86_64-unknown-linux-gnu
checking for gcc... gcc
checking whether the C compiler works... yes
checking for C compiler default output file name... a.out
checking for suffix of executables... 
checking whether we are cross compiling... no
checking for suffix of object files... o
checking whether we are using the GNU C compiler... yes
checking whether gcc accepts -g... yes
checking for gcc option to accept ISO C89... none needed
checking for a sed that does not truncate output... /bin/sed
/srv/gump/public/workspace/expat/configure: line 4283: syntax error near unexpected token `lt_decl_varnames,'
/srv/gump/public/workspace/expat/configure: line 4283: `lt_if_append_uniq(lt_decl_varnames, SED, , ,'
---------------------------------------------

To subscribe to this information via syndicated feeds:
- RSS: http://vmgump.apache.org/gump/public/expat/expat-configure/rss.xml
- Atom: http://vmgump.apache.org/gump/public/expat/expat-configure/atom.xml

============================== Gump Tracking Only ===
Produced by Gump version 2.3.
Gump Run 10000024102010, vmgump.apache.org:vmgump:10000024102010
Gump E-mail Identifier (unique within run) #1.

*********************************************************** G U M P
[GUMP@vmgump]: Project hamcrest-java-unit-test (in module hamcrest) failed
To whom it may engage...
        
This is an automated request, but not an unsolicited one. For 
more information please visit http://gump.apache.org/nagged.html, 
and/or contact the folk at general@gump.apache.org.

Project hamcrest-java-unit-test has an issue affecting its community integration.
This issue affects 2 projects,
 and has been outstanding for 106 runs.
The current state of this project is 'Failed', with reason 'Build Failed'.
For reference only, the following projects are affected by this:
    - hamcrest-java-unit-test :  Provides a library of matcher objects (also known as constra...
    - jmock2 :  jMock is a library for testing Java code using mock objects.


Full details are available at:
    http://vmgump.apache.org/gump/public/hamcrest/hamcrest-java-unit-test/index.html

That said, some information snippets are provided here.

The following annotations (debug/informational/warning/error messages) were provided:
 -INFO- Failed with reason build failed
 -INFO- Failed to extract fallback artifacts from Gump Repository



The following work was performed:
http://vmgump.apache.org/gump/public/hamcrest/hamcrest-java-unit-test/gump_work/build_hamcrest_hamcrest-java-unit-test.html
Work Name: build_hamcrest_hamcrest-java-unit-test (Type: Build)
Work ended in a state of : Failed
Elapsed: 19 secs
Command Line: /usr/lib/jvm/java-6-openjdk/bin/java -Djava.awt.headless=true -Xbootclasspath/p:/srv/gump/public/workspace/xml-commons/java/external/build/xml-apis.jar:/srv/gump/public/workspace/xml-xerces2/build/xercesImpl.jar org.apache.tools.ant.Main -Dgump.merge=/srv/gump/public/gump/work/merge.xml -Dbuild.sysclasspath=only -Dversion=24102010 unit-test 
[Working Directory: /srv/gump/public/workspace/hamcrest/hamcrest-java]
CLASSPATH: /usr/lib/jvm/java-6-openjdk/lib/tools.jar:/srv/gump/public/workspace/hamcrest/hamcrest-java/lib/integration/easymock-2.2.jar:/srv/gump/public/workspace/hamcrest/hamcrest-java/build/temp/build/hamcrest-unit-test-24102010.jar.contents:/srv/gump/public/workspace/ant/dist/lib/ant.jar:/srv/gump/public/workspace/ant/dist/lib/ant-launcher.jar:/srv/gump/public/workspace/ant/dist/lib/ant-jmf.jar:/srv/gump/public/workspace/ant/dist/lib/ant-junit.jar:/srv/gump/public/workspace/ant/dist/lib/ant-swing.jar:/srv/gump/public/workspace/ant/dist/lib/ant-apache-resolver.jar:/srv/gump/public/workspace/ant/dist/lib/ant-apache-xalan2.jar:/srv/gump/public/workspace/hamcrest/hamcrest-java/build/hamcrest-integration-24102010.jar:/srv/gump/public/workspace/hamcrest/hamcrest-java/build/hamcrest-all-24102010.jar:/srv/gump/packages/jarjar/jarjar-0.6.jar:/srv/gump/public/workspace/jmock/build/dist/jmock-core-24102010.jar:/srv/gump/public/workspace/jmock/build/dist/jmock-cglib-24102010.jar:/srv/
 gump/public/workspace/junit/dist/junit-24102010.jar:/srv/gump/public/workspace/junit/dist/junit-dep-24102010.jar:/srv/gump/packages/qdox-1.6.3/qdox-1.6.3.jar:/srv/gump/public/workspace/xml-commons/java/external/build/xml-apis-ext.jar
---------------------------------------------
    [junit] 	at org.hamcrest.xml.HasXPathTest.testThrowsIllegalArgumentExceptionIfGivenIllegalExpression(HasXPathTest.java:100)
    [junit] 
    [junit] 
    [junit] Testcase: testDescribesMissingNodeMismatch(org.hamcrest.xml.HasXPathTest):	Caused an ERROR
    [junit] XPathFactory#newInstance() failed to create an XPathFactory for the default object model: http://java.sun.com/jaxp/xpath/dom with the XPathFactoryConfigurationException: javax.xml.xpath.XPathFactoryConfigurationException: No XPathFctory implementation found for the object model: http://java.sun.com/jaxp/xpath/dom
    [junit] java.lang.RuntimeException: XPathFactory#newInstance() failed to create an XPathFactory for the default object model: http://java.sun.com/jaxp/xpath/dom with the XPathFactoryConfigurationException: javax.xml.xpath.XPathFactoryConfigurationException: No XPathFctory implementation found for the object model: http://java.sun.com/jaxp/xpath/dom
    [junit] 	at javax.xml.xpath.XPathFactory.newInstance(Unknown Source)
    [junit] 	at org.hamcrest.xml.HasXPath.<init>(HasXPath.java:49)
    [junit] 	at org.hamcrest.xml.HasXPath.hasXPath(HasXPath.java:111)
    [junit] 	at org.hamcrest.xml.HasXPath.hasXPath(HasXPath.java:106)
    [junit] 	at org.hamcrest.xml.HasXPathTest.testDescribesMissingNodeMismatch(HasXPathTest.java:115)
    [junit] 
    [junit] 
    [junit] Testcase: testDescribesIncorrectNodeValueMismatch(org.hamcrest.xml.HasXPathTest):	Caused an ERROR
    [junit] XPathFactory#newInstance() failed to create an XPathFactory for the default object model: http://java.sun.com/jaxp/xpath/dom with the XPathFactoryConfigurationException: javax.xml.xpath.XPathFactoryConfigurationException: No XPathFctory implementation found for the object model: http://java.sun.com/jaxp/xpath/dom
    [junit] java.lang.RuntimeException: XPathFactory#newInstance() failed to create an XPathFactory for the default object model: http://java.sun.com/jaxp/xpath/dom with the XPathFactoryConfigurationException: javax.xml.xpath.XPathFactoryConfigurationException: No XPathFctory implementation found for the object model: http://java.sun.com/jaxp/xpath/dom
    [junit] 	at javax.xml.xpath.XPathFactory.newInstance(Unknown Source)
    [junit] 	at org.hamcrest.xml.HasXPath.<init>(HasXPath.java:49)
    [junit] 	at org.hamcrest.xml.HasXPath.hasXPath(HasXPath.java:101)
    [junit] 	at org.hamcrest.xml.HasXPath.hasXPath(HasXPath.java:96)
    [junit] 	at org.hamcrest.xml.HasXPathTest.testDescribesIncorrectNodeValueMismatch(HasXPathTest.java:119)
    [junit] 
    [junit] 
    [junit] Testcase: testIsNullSafe(org.hamcrest.xml.HasXPathTest):	Caused an ERROR
    [junit] XPathFactory#newInstance() failed to create an XPathFactory for the default object model: http://java.sun.com/jaxp/xpath/dom with the XPathFactoryConfigurationException: javax.xml.xpath.XPathFactoryConfigurationException: No XPathFctory implementation found for the object model: http://java.sun.com/jaxp/xpath/dom
    [junit] java.lang.RuntimeException: XPathFactory#newInstance() failed to create an XPathFactory for the default object model: http://java.sun.com/jaxp/xpath/dom with the XPathFactoryConfigurationException: javax.xml.xpath.XPathFactoryConfigurationException: No XPathFctory implementation found for the object model: http://java.sun.com/jaxp/xpath/dom
    [junit] 	at javax.xml.xpath.XPathFactory.newInstance(Unknown Source)
    [junit] 	at org.hamcrest.xml.HasXPath.<init>(HasXPath.java:49)
    [junit] 	at org.hamcrest.xml.HasXPath.hasXPath(HasXPath.java:111)
    [junit] 	at org.hamcrest.xml.HasXPath.hasXPath(HasXPath.java:106)
    [junit] 	at org.hamcrest.xml.HasXPathTest.createMatcher(HasXPathTest.java:62)
    [junit] 	at org.hamcrest.AbstractMatcherTest.testIsNullSafe(AbstractMatcherTest.java:37)
    [junit] 
    [junit] 
    [junit] Testcase: testCopesWithUnknownTypes(org.hamcrest.xml.HasXPathTest):	Caused an ERROR
    [junit] XPathFactory#newInstance() failed to create an XPathFactory for the default object model: http://java.sun.com/jaxp/xpath/dom with the XPathFactoryConfigurationException: javax.xml.xpath.XPathFactoryConfigurationException: No XPathFctory implementation found for the object model: http://java.sun.com/jaxp/xpath/dom
    [junit] java.lang.RuntimeException: XPathFactory#newInstance() failed to create an XPathFactory for the default object model: http://java.sun.com/jaxp/xpath/dom with the XPathFactoryConfigurationException: javax.xml.xpath.XPathFactoryConfigurationException: No XPathFctory implementation found for the object model: http://java.sun.com/jaxp/xpath/dom
    [junit] 	at javax.xml.xpath.XPathFactory.newInstance(Unknown Source)
    [junit] 	at org.hamcrest.xml.HasXPath.<init>(HasXPath.java:49)
    [junit] 	at org.hamcrest.xml.HasXPath.hasXPath(HasXPath.java:111)
    [junit] 	at org.hamcrest.xml.HasXPath.hasXPath(HasXPath.java:106)
    [junit] 	at org.hamcrest.xml.HasXPathTest.createMatcher(HasXPathTest.java:62)
    [junit] 	at org.hamcrest.AbstractMatcherTest.testCopesWithUnknownTypes(AbstractMatcherTest.java:42)
    [junit] 
    [junit] 

BUILD FAILED
/srv/gump/public/workspace/hamcrest/hamcrest-java/build.xml:118: Test org.hamcrest.xml.HasXPathTest failed

Total time: 19 seconds
---------------------------------------------

To subscribe to this information via syndicated feeds:
- RSS: http://vmgump.apache.org/gump/public/hamcrest/hamcrest-java-unit-test/rss.xml
- Atom: http://vmgump.apache.org/gump/public/hamcrest/hamcrest-java-unit-test/atom.xml

============================== Gump Tracking Only ===
Produced by Gump version 2.3.
Gump Run 10000024102010, vmgump.apache.org:vmgump:10000024102010
Gump E-mail Identifier (unique within run) #2.

*********************************************************** G U M P
[GUMP@vmgump]: Project lucene-java-analyzers-test (in module lucene-java) failed
To whom it may engage...
        
This is an automated request, but not an unsolicited one. For 
more information please visit http://gump.apache.org/nagged.html, 
and/or contact the folk at general@gump.apache.org.

Project lucene-java-analyzers-test has an issue affecting its community integration.
This issue affects 1 projects,
 and has been outstanding for 6 runs.
The current state of this project is 'Failed', with reason 'Build Failed'.
For reference only, the following projects are affected by this:
    - lucene-java-analyzers-test :  Java Based Search Engine


Full details are available at:
    http://vmgump.apache.org/gump/public/lucene-java/lucene-java-analyzers-test/index.html

That said, some information snippets are provided here.

The following annotations (debug/informational/warning/error messages) were provided:
 -INFO- Failed with reason build failed



The following work was performed:
http://vmgump.apache.org/gump/public/lucene-java/lucene-java-analyzers-test/gump_work/build_lucene-java_lucene-java-analyzers-test.html
Work Name: build_lucene-java_lucene-java-analyzers-test (Type: Build)
Work ended in a state of : Failed
Elapsed: 1 min 57 secs
Command Line: /usr/lib/jvm/java-6-openjdk/bin/java -Djava.awt.headless=true -Xbootclasspath/p:/srv/gump/public/workspace/xml-commons/java/external/build/xml-apis.jar:/srv/gump/public/workspace/xml-xerces2/build/xercesImpl.jar org.apache.tools.ant.Main -Dgump.merge=/srv/gump/public/gump/work/merge.xml -Dbuild.sysclasspath=only -Dversion=24102010 test 
[Working Directory: /srv/gump/public/workspace/lucene-java/modules/analysis]
CLASSPATH: /usr/lib/jvm/java-6-openjdk/lib/tools.jar:/srv/gump/public/workspace/lucene-java/lucene/build/classes/test:/srv/gump/public/workspace/lucene-java/modules/analysis/build/icu/classes/test:/srv/gump/public/workspace/lucene-java/modules/analysis/build/smartcn/classes/test:/srv/gump/public/workspace/lucene-java/modules/analysis/build/common/classes/test:/srv/gump/public/workspace/lucene-java/modules/analysis/build/stempel/classes/test:/srv/gump/public/workspace/lucene-java/modules/analysis/build/phonetic/classes/test:/srv/gump/public/workspace/ant/dist/lib/ant.jar:/srv/gump/public/workspace/ant/dist/lib/ant-launcher.jar:/srv/gump/public/workspace/ant/dist/lib/ant-jmf.jar:/srv/gump/public/workspace/ant/dist/lib/ant-junit.jar:/srv/gump/public/workspace/ant/dist/lib/ant-swing.jar:/srv/gump/public/workspace/ant/dist/lib/ant-apache-resolver.jar:/srv/gump/public/workspace/ant/dist/lib/ant-apache-xalan2.jar:/srv/gump/packages/junit3.8.1/junit.jar:/srv/gump/public/workspace/xml
 -commons/java/build/resolver.jar:/srv/gump/public/workspace/apache-commons/codec/dist/commons-codec-24102010.jar:/srv/gump/public/workspace/icu4j/main/classes/core/out/lib/icu4j-core.jar:/srv/gump/public/workspace/icu4j/main/classes/collate/out/lib/icu4j-collate.jar:/srv/gump/public/workspace/icu4j/main/classes/currdata/out/lib/icu4j-currdata.jar:/srv/gump/public/workspace/icu4j/main/classes/langdata/out/lib/icu4j-langdata.jar:/srv/gump/public/workspace/icu4j/main/classes/regiondata/out/lib/icu4j-regiondata.jar:/srv/gump/public/workspace/icu4j/main/classes/translit/out/lib/icu4j-translit.jar:/srv/gump/public/workspace/icu4j/main/classes/charset/out/lib/icu4j-charset.jar:/srv/gump/public/workspace/icu4j/main/classes/localespi/out/lib/icu4j-localespi.jar:/srv/gump/public/workspace/junit/dist/junit-24102010.jar:/srv/gump/public/workspace/junit/dist/junit-dep-24102010.jar:/srv/gump/public/workspace/lucene-java/lucene/build/lucene-core-24102010.jar:/srv/gump/public/workspace/luce
 ne-java/modules/analysis/build/icu/lucene-analyzers-icu-24102010.jar:/srv/gump/public/workspace/lucene-java/modules/analysis/build/smartcn/lucene-analyzers-smartcn-24102010.jar:/srv/gump/public/workspace/lucene-java/modules/analysis/build/common/lucene-analyzers-common-24102010.jar:/srv/gump/public/workspace/lucene-java/modules/analysis/build/stempel/lucene-analyzers-stempel-24102010.jar:/srv/gump/public/workspace/lucene-java/modules/analysis/build/phonetic/lucene-analyzers-phonetic-24102010.jar:/srv/gump/public/workspace/xml-commons/java/external/build/xml-apis-ext.jar
---------------------------------------------
    [junit] 	at org.apache.lucene.collation.CollationTestBase.testCollationKeySort(CollationTestBase.java:223)
    [junit] 	at org.apache.lucene.collation.TestICUCollationKeyFilter.testCollationKeySort(TestICUCollationKeyFilter.java:93)
    [junit] 	at org.apache.lucene.util.LuceneTestCase$LuceneTestCaseRunner.runChild(LuceneTestCase.java:882)
    [junit] 	at org.apache.lucene.util.LuceneTestCase$LuceneTestCaseRunner.runChild(LuceneTestCase.java:848)
    [junit] 
    [junit] 
    [junit] Tests run: 4, Failures: 1, Errors: 0, Time elapsed: 4.044 sec
    [junit] 
    [junit] ------------- Standard Output ---------------
    [junit] NOTE: reproduce with: ant test -Dtestcase=TestICUCollationKeyFilter -Dtestmethod=testCollationKeySort -Dtests.seed=-2376157009092716954:4594630260175430573
    [junit] NOTE: test params are: codec=MockVariableIntBlock(baseBlockSize=29), locale=es_NI, timezone=America/St_Barthelemy
    [junit] ------------- ---------------- ---------------
    [junit] ------------- Standard Error -----------------
    [junit] NOTE: all tests run in this JVM:
    [junit] [TestICUCollationKeyFilter]
    [junit] ------------- ---------------- ---------------
    [junit] Test org.apache.lucene.collation.TestICUCollationKeyFilter FAILED
    [junit] Testsuite: org.apache.lucene.collation.TestICUCollationKeyAnalyzer
    [junit] Testcase: testCollationKeySort(org.apache.lucene.collation.TestICUCollationKeyAnalyzer):	FAILED
    [junit] expected:<E[AC]GI> but was:<E[CA]GI>
    [junit] junit.framework.AssertionFailedError: expected:<E[AC]GI> but was:<E[CA]GI>
    [junit] 	at org.apache.lucene.collation.CollationTestBase.assertMatches(CollationTestBase.java:246)
    [junit] 	at org.apache.lucene.collation.CollationTestBase.testCollationKeySort(CollationTestBase.java:223)
    [junit] 	at org.apache.lucene.collation.TestICUCollationKeyAnalyzer.testCollationKeySort(TestICUCollationKeyAnalyzer.java:75)
    [junit] 	at org.apache.lucene.util.LuceneTestCase$LuceneTestCaseRunner.runChild(LuceneTestCase.java:882)
    [junit] 	at org.apache.lucene.util.LuceneTestCase$LuceneTestCaseRunner.runChild(LuceneTestCase.java:848)
    [junit] 
    [junit] 
    [junit] Tests run: 4, Failures: 1, Errors: 0, Time elapsed: 2.457 sec
    [junit] 
    [junit] ------------- Standard Output ---------------
    [junit] NOTE: reproduce with: ant test -Dtestcase=TestICUCollationKeyAnalyzer -Dtestmethod=testCollationKeySort -Dtests.seed=-5693354008440661959:2880392534644646116
    [junit] NOTE: test params are: codec=MockFixedIntBlock(blockSize=1918), locale=ar_SY, timezone=America/Lima
    [junit] ------------- ---------------- ---------------
    [junit] ------------- Standard Error -----------------
    [junit] NOTE: all tests run in this JVM:
    [junit] [TestICUCollationKeyAnalyzer]
    [junit] ------------- ---------------- ---------------
    [junit] Test org.apache.lucene.collation.TestICUCollationKeyAnalyzer FAILED

BUILD FAILED
/srv/gump/public/workspace/lucene-java/modules/analysis/build.xml:76: The following error occurred while executing this line:
/srv/gump/public/workspace/lucene-java/lucene/contrib/contrib-build.xml:68: The following error occurred while executing this line:
/srv/gump/public/workspace/lucene-java/lucene/common-build.xml:527: 
The following error occurred while executing this line:
/srv/gump/public/workspace/lucene-java/lucene/common-build.xml:505: Tests failed!
The following error occurred while executing this line:
/srv/gump/public/workspace/lucene-java/lucene/common-build.xml:505: Tests failed!

Total time: 1 minute 56 seconds
---------------------------------------------

To subscribe to this information via syndicated feeds:
- RSS: http://vmgump.apache.org/gump/public/lucene-java/lucene-java-analyzers-test/rss.xml
- Atom: http://vmgump.apache.org/gump/public/lucene-java/lucene-java-analyzers-test/atom.xml

============================== Gump Tracking Only ===
Produced by Gump version 2.3.
Gump Run 10000024102010, vmgump.apache.org:vmgump:10000024102010
Gump E-mail Identifier (unique within run) #5.

*********************************************************** G U M P
[GUMP@vmgump]: Project santuario-tests (in module santuario) failed
To whom it may engage...
        
This is an automated request, but not an unsolicited one. For 
more information please visit http://gump.apache.org/nagged.html, 
and/or contact the folk at general@gump.apache.org.

Project santuario-tests has an issue affecting its community integration.
This issue affects 1 projects,
 and has been outstanding for 37 runs.
The current state of this project is 'Failed', with reason 'Build Failed'.
For reference only, the following projects are affected by this:
    - santuario-tests :  XML-Signature Syntax and Processing


Full details are available at:
    http://vmgump.apache.org/gump/public/santuario/santuario-tests/index.html

That said, some information snippets are provided here.

The following annotations (debug/informational/warning/error messages) were provided:
 -DEBUG- Dependency on jce exists, no need to add for property lib.jce.
 -DEBUG- Dependency on junit exists, no need to add for property lib.junit.
 -INFO- Failed with reason build failed



The following work was performed:
http://vmgump.apache.org/gump/public/santuario/santuario-tests/gump_work/build_santuario_santuario-tests.html
Work Name: build_santuario_santuario-tests (Type: Build)
Work ended in a state of : Failed
Elapsed: 1 min 31 secs
Command Line: /usr/lib/jvm/java-6-openjdk/bin/java -Djava.awt.headless=true -Dant.build.clonevm=true -Xbootclasspath/p:/srv/gump/public/workspace/xml-commons/java/external/build/xml-apis.jar:/srv/gump/public/workspace/xml-xerces2/build/xercesImpl.jar:/srv/gump/public/workspace/xml-xalan/build/xalan-unbundled.jar:/srv/gump/public/workspace/xml-xalan/build/serializer.jar org.apache.tools.ant.Main -Dgump.merge=/srv/gump/public/gump/work/merge.xml -Dbuild.sysclasspath=only -Djce.download.sha1=c1f0e975e8c8e0a0105787b249a50615b485d109 -Dlib.jce=/srv/gump/packages/jce/jce-jdk13-116.jar -Dlib.junit=/srv/gump/public/workspace/junit/dist/junit-24102010.jar -Djce.download.md5=85c64cd754719a4bc8da7e9aa0e113fd test 
[Working Directory: /srv/gump/public/workspace/santuario]
CLASSPATH: /usr/lib/jvm/java-6-openjdk/lib/tools.jar:/srv/gump/public/workspace/santuario/build/test:/srv/gump/public/workspace/santuario:/srv/gump/public/workspace/santuario/build/xmlsec-24102010.jar:/srv/gump/public/workspace/ant/dist/lib/ant.jar:/srv/gump/public/workspace/ant/dist/lib/ant-launcher.jar:/srv/gump/public/workspace/ant/dist/lib/ant-jmf.jar:/srv/gump/public/workspace/ant/dist/lib/ant-junit.jar:/srv/gump/public/workspace/ant/dist/lib/ant-swing.jar:/srv/gump/public/workspace/ant/dist/lib/ant-apache-resolver.jar:/srv/gump/public/workspace/ant/dist/lib/ant-apache-xalan2.jar:/srv/gump/packages/junit3.8.1/junit.jar:/srv/gump/public/workspace/xml-commons/java/build/resolver.jar:/srv/gump/public/workspace/xml-commons/java/external/build/xml-apis-ext.jar:/srv/gump/packages/jce/jce-jdk13-116.jar:/srv/gump/public/workspace/apache-commons/logging/target/commons-logging-24102010.jar:/srv/gump/public/workspace/apache-commons/logging/target/commons-logging-api-24102010.jar:/s
 rv/gump/public/workspace/junit/dist/junit-24102010.jar:/srv/gump/public/workspace/junit/dist/junit-dep-24102010.jar
---------------------------------------------
    [junit] Testcase: test_signatureAlgorithms_signatures_hMACSignature took 0.009 sec
    [junit] Testcase: test_coreFeatures_signatures_manifestSignature_core took 0.026 sec
    [junit] Testcase: test_coreFeatures_signatures_manifestSignature_manifest took 0.031 sec
    [junit] Testcase: test_coreFeatures_signatures_signatureTypesSignature took 0.15 sec
    [junit] Testcase: test_coreFeatures_signatures_anonymousReferenceSignature took 0.028 sec
    [junit] Testcase: test_signatureAlgorithms_signatures_dSASignature took 0.086 sec
    [junit] Testcase: test_signatureAlgorithms_signatures_rSASignature took 0.019 sec
    [junit] Testcase: test_transforms_signatures_base64DecodeSignature took 0.045 sec
    [junit] Testcase: test_transforms_signatures_c14nSignature took 0.045 sec
    [junit] Testcase: test_transforms_signatures_envelopedSignatureSignature took 0.01 sec
    [junit] Testcase: test_transforms_signatures_xPathSignature took 0.019 sec
    [junit] Testcase: test_enveloping took 0.011 sec
    [junit] Testcase: test_enveloped took 0.01 sec
    [junit] Testcase: test_Y1 took 0.091 sec
    [junit] Testcase: test_Y2 took 0.164 sec
    [junit] Testcase: test_Y3 took 0.21 sec
    [junit] Testcase: test_Y4 took 11.156 sec
    [junit] Testcase: test_xfilter2 took 0.097 sec
    [junit] Testcase: testAES128ElementAES192KWCipherUsingKEK took 0.118 sec
    [junit] Testcase: testAES128ElementRSAKWCipherUsingKEK took 7.372 sec
    [junit] Testcase: testAES192ElementAES256KWCipher took 1.117 sec
    [junit] Testcase: testTrippleDesElementCipher took 0.118 sec
    [junit] Testcase: testAes128ElementCipher took 0.113 sec
    [junit] Testcase: testAes192ElementCipher took 0.179 sec
    [junit] Testcase: testAes265ElementCipher took 0.113 sec
    [junit] Testcase: testTrippleDesDocumentCipher took 0.656 sec
    [junit] Testcase: testSameDocumentCipherReference took 0.01 sec
    [junit] Testcase: testSerializedData took 0.049 sec
    [junit] Testcase: testEncryptedKeyWithRecipient took 0.014 sec
    [junit] Testcase: test_five_content_3des_cbc took 0.068 sec
    [junit] Testcase: test_five_content_aes256_cbc took 0.042 sec
    [junit] Testcase: test_five_content_aes128_cbc_kw_aes192 took 0.029 sec
    [junit] Testcase: test_five_content_3des_cbc_kw_aes128 took 0.028 sec
    [junit] Testcase: test_five_content_aes128_cbc_rsa_15 took 0.119 sec
    [junit] Testcase: test_five_element_aes192_cbc_ref took 0.039 sec
    [junit] Testcase: test_five_data_aes128_cbc took 0.017 sec
    [junit] Testcase: test_five_data_aes256_cbc_3des took 0.019 sec
    [junit] Testcase: test_five_data_aes192_cbc_aes256 took 0.022 sec
    [junit] Testcase: test_five_data_3des_cbc_rsa_oaep took 0.124 sec
    [junit] Testcase: testContentRemoved took 0.007 sec
    [junit] Test org.apache.xml.security.test.AllTests FAILED
[junitreport] Processing /srv/gump/public/workspace/santuario/build/docs/xml/junit/TESTS-TestSuites.xml to /tmp/null1595578210
[junitreport] Loading stylesheet jar:file:/srv/gump/public/workspace/ant/dist/lib/ant-junit.jar!/org/apache/tools/ant/taskdefs/optional/junit/xsl/junit-frames.xsl
[junitreport] Transform time: 1739ms
[junitreport] Deleting: /tmp/null1595578210

BUILD FAILED
/srv/gump/public/workspace/santuario/build.xml:381: Unit Tests Failed

Total time: 1 minute 30 seconds
---------------------------------------------

To subscribe to this information via syndicated feeds:
- RSS: http://vmgump.apache.org/gump/public/santuario/santuario-tests/rss.xml
- Atom: http://vmgump.apache.org/gump/public/santuario/santuario-tests/atom.xml

============================== Gump Tracking Only ===
Produced by Gump version 2.3.
Gump Run 10000024102010, vmgump.apache.org:vmgump:10000024102010
Gump E-mail Identifier (unique within run) #7.

*********************************************************** G U M P
[GUMP@vmgump]: Project wss4j (in module ws-wss4j) failed
To whom it may engage...
        
This is an automated request, but not an unsolicited one. For 
more information please visit http://gump.apache.org/nagged.html, 
and/or contact the folk at general@gump.apache.org.

Project wss4j has an issue affecting its community integration.
This issue affects 2 projects,
 and has been outstanding for 37 runs.
The current state of this project is 'Failed', with reason 'Build Failed'.
For reference only, the following projects are affected by this:
    - wss4j :  WS-FX Project
    - wss4j-test :  WS-FX Project


Full details are available at:
    http://vmgump.apache.org/gump/public/ws-wss4j/wss4j/index.html

That said, some information snippets are provided here.

The following annotations (debug/informational/warning/error messages) were provided:
 -DEBUG- Sole jar output [wss4j-@DATE@.jar] identifier set to project name
 -INFO- Failed with reason build failed
 -INFO- Failed to extract fallback artifacts from Gump Repository



The following work was performed:
http://vmgump.apache.org/gump/public/ws-wss4j/wss4j/gump_work/build_ws-wss4j_wss4j.html
Work Name: build_ws-wss4j_wss4j (Type: Build)
Work ended in a state of : Failed
Elapsed: 43 secs
Command Line: /usr/lib/jvm/java-6-openjdk/bin/java -Djava.awt.headless=true -Dant.build.clonevm=true -Xbootclasspath/p:/srv/gump/public/workspace/xml-xerces2/build/xercesImpl.jar:/srv/gump/public/workspace/xml-xalan/build/xalan-unbundled.jar:/srv/gump/public/workspace/xml-xalan/build/serializer.jar:/srv/gump/public/workspace/xml-commons/java/external/build/xml-apis.jar org.apache.tools.ant.Main -Dgump.merge=/srv/gump/public/gump/work/merge.xml -Dbuild.sysclasspath=only -Dskip.tests=true -Djar.library=wss4j-@DATE@.jar gump 
[Working Directory: /srv/gump/public/workspace/ws-wss4j]
CLASSPATH: /usr/lib/jvm/java-6-openjdk/lib/tools.jar:/srv/gump/public/workspace/ws-wss4j/build/classes:/srv/gump/public/workspace/ant/dist/lib/ant.jar:/srv/gump/public/workspace/ant/dist/lib/ant-launcher.jar:/srv/gump/public/workspace/ant/dist/lib/ant-jmf.jar:/srv/gump/public/workspace/ant/dist/lib/ant-junit.jar:/srv/gump/public/workspace/ant/dist/lib/ant-swing.jar:/srv/gump/public/workspace/ant/dist/lib/ant-apache-resolver.jar:/srv/gump/public/workspace/ant/dist/lib/ant-apache-xalan2.jar:/srv/gump/packages/junit3.8.1/junit.jar:/srv/gump/public/workspace/xml-commons/java/build/resolver.jar:/srv/gump/public/workspace/ws-addressing/target/addressing-24102010.jar:/srv/gump/packages/bouncycastle-jdk14/bcprov-ext-jdk14-145.jar:/srv/gump/public/workspace/ws-axis/build/lib/axis.jar:/srv/gump/public/workspace/ws-axis/build/lib/axis-ant.jar:/srv/gump/public/workspace/ws-axis/build/lib/jaxrpc.jar:/srv/gump/public/workspace/ws-axis/build/lib/saaj.jar:/srv/gump/public/workspace/apache-co
 mmons/codec/dist/commons-codec-24102010.jar:/srv/gump/public/workspace/apache-commons/discovery/dist/commons-discovery.jar:/srv/gump/public/workspace/httpcomponents/oac.hc3x/dist/commons-httpclient.jar:/srv/gump/public/workspace/apache-commons/logging/target/commons-logging-24102010.jar:/srv/gump/public/workspace/apache-commons/logging/target/commons-logging-api-24102010.jar:/srv/gump/packages/jaf-1.1ea/activation.jar:/srv/gump/packages/javamail-1.4/mail.jar:/srv/gump/packages/javamail-1.4/lib/mailapi.jar:/srv/gump/packages/jce/jce-jdk13-116.jar:/srv/gump/packages/jsse1.0.3/lib/jsse.jar:/srv/gump/packages/jsse1.0.3/lib/jnet.jar:/srv/gump/packages/jsse1.0.3/lib/jcert.jar:/srv/gump/public/workspace/junit/dist/junit-24102010.jar:/srv/gump/public/workspace/junit/dist/junit-dep-24102010.jar:/srv/gump/public/workspace/logging-log4j-12/dist/lib/log4j-24102010.jar:/srv/gump/public/workspace/opensaml/dist/opensaml-24102010.jar:/srv/gump/public/workspace/wsdl4j/build/lib/wsdl4j.jar:/s
 rv/gump/public/workspace/wsdl4j/build/lib/qname.jar:/srv/gump/public/workspace/jakarta-bcel/target/bcel-5.3-SNAPSHOT.jar:/srv/gump/public/workspace/xml-xalan/tools/java_cup.jar:/srv/gump/public/workspace/xml-xalan/lib/runtime.jar:/srv/gump/public/workspace/xml-xalan/tools/JLex.jar:/srv/gump/public/workspace/santuario/build/xmlsec-24102010.jar:/srv/gump/public/workspace/xml-commons/java/external/build/xml-apis-ext.jar
---------------------------------------------

prepare:
    [mkdir] Created dir: /srv/gump/public/workspace/ws-wss4j/build
    [mkdir] Created dir: /srv/gump/public/workspace/ws-wss4j/build/test-reports

prepare-src:
    [mkdir] Created dir: /srv/gump/public/workspace/ws-wss4j/build/classes

javadoc:
    [mkdir] Created dir: /srv/gump/public/workspace/ws-wss4j/build/doc
    [mkdir] Created dir: /srv/gump/public/workspace/ws-wss4j/build/doc/html
    [mkdir] Created dir: /srv/gump/public/workspace/ws-wss4j/build/doc/html/api
  [javadoc] Generating Javadoc
  [javadoc] Javadoc execution
  [javadoc] Loading source files for package org.apache.ws.axis.security...
  [javadoc] Loading source files for package org.apache.ws.security...
  [javadoc] Loading source files for package org.apache.ws.security.components.crypto...
  [javadoc] Loading source files for package org.apache.ws.security.message...
  [javadoc] Loading source files for package org.apache.ws.security.message.token...
  [javadoc] Loading source files for package org.apache.ws.security.util...
  [javadoc] Constructing Javadoc information...
  [javadoc] Standard Doclet version 1.6.0_18
  [javadoc] Building tree for all the packages and classes...
  [javadoc] /srv/gump/public/workspace/ws-wss4j/src/org/apache/ws/security/WSConstants.java:302: warning - Tag @link: reference not found: SKI_KEY_IDENTIFIER
  [javadoc] /srv/gump/public/workspace/ws-wss4j/src/org/apache/ws/security/WSSecurityEngine.java:283: warning - Tag @link: can't find usernameToken in org.apache.ws.security.WSSecurityEngine
  [javadoc] /srv/gump/public/workspace/ws-wss4j/src/org/apache/ws/security/WSSecurityEngine.java:283: warning - Tag @link: can't find timeStamp in org.apache.ws.security.WSSecurityEngine
  [javadoc] /srv/gump/public/workspace/ws-wss4j/src/org/apache/ws/security/components/crypto/CryptoBase.java:200: warning - @param argument "The" is not a parameter name.
  [javadoc] /srv/gump/public/workspace/ws-wss4j/src/org/apache/ws/security/message/WSSecSignatureBase.java:66: warning - @param argument "sig" is not a parameter name.
  [javadoc] /srv/gump/public/workspace/ws-wss4j/src/org/apache/ws/security/message/token/PKIPathSecurity.java:70: warning - @param argument "reverse" is not a parameter name.
  [javadoc] /srv/gump/public/workspace/ws-wss4j/src/org/apache/ws/security/message/token/PKIPathSecurity.java:87: warning - @param argument "reverse" is not a parameter name.
  [javadoc] /srv/gump/public/workspace/ws-wss4j/src/org/apache/ws/security/message/token/SecurityTokenReference.java:549: warning - @param argument "ref" is not a parameter name.
  [javadoc] /srv/gump/public/workspace/ws-wss4j/src/org/apache/ws/security/util/Base64.java:40: warning - @xerces.internal is an unknown tag.
  [javadoc] Building index for all the packages and classes...
  [javadoc] Building index for all classes...
  [javadoc] Generating /srv/gump/public/workspace/ws-wss4j/build/doc/html/api/stylesheet.css...
  [javadoc] 9 warnings

compile.library:
    [javac] Compiling 108 source files to /srv/gump/public/workspace/ws-wss4j/build/classes
    [javac] /srv/gump/public/workspace/ws-wss4j/src/org/apache/ws/security/transform/STRTransform.java:152: incompatible types
    [javac] found   : com.sun.org.apache.xml.internal.security.signature.XMLSignatureInput
    [javac] required: org.apache.xml.security.signature.XMLSignatureInput
    [javac]                 xmlSignatureInput = ((ApacheData) data).getXMLSignatureInput();
    [javac]                                                                             ^
    [javac] 1 error

BUILD FAILED
/srv/gump/public/workspace/ws-wss4j/build.xml:342: Compile failed; see the compiler error output for details.

Total time: 43 seconds
---------------------------------------------

To subscribe to this information via syndicated feeds:
- RSS: http://vmgump.apache.org/gump/public/ws-wss4j/wss4j/rss.xml
- Atom: http://vmgump.apache.org/gump/public/ws-wss4j/wss4j/atom.xml

============================== Gump Tracking Only ===
Produced by Gump version 2.3.
Gump Run 10000024102010, vmgump.apache.org:vmgump:10000024102010
Gump E-mail Identifier (unique within run) #9.

*********************************************************** G U M P
[GUMP@vmgump]: Project pdfbox-lucene (in module pdfbox) failed
To whom it may engage...
        
This is an automated request, but not an unsolicited one. For 
more information please visit http://gump.apache.org/nagged.html, 
and/or contact the folk at general@gump.apache.org.

Project pdfbox-lucene has an issue affecting its community integration.
This issue affects 1 projects,
 and has been outstanding for 58 runs.
The current state of this project is 'Failed', with reason 'Build Failed'.
For reference only, the following projects are affected by this:
    - pdfbox-lucene :  Apache PDFBox is an open source Java PDF library for working...


Full details are available at:
    http://vmgump.apache.org/gump/public/pdfbox/pdfbox-lucene/index.html

That said, some information snippets are provided here.

The following annotations (debug/informational/warning/error messages) were provided:
 -DEBUG- Sole jar output [pdfbox-lucene-*[0-9T].jar] identifier set to project name
 -DEBUG- (Gump generated) Maven2 Settings in: /srv/gump/public/workspace/pdfbox/lucene/gump_mvn_settings.xml
 -INFO- Failed with reason build failed
 -DEBUG- Maven POM in: /srv/gump/public/workspace/pdfbox/lucene/pom.xml
 -INFO- Failed to extract fallback artifacts from Gump Repository



The following work was performed:
http://vmgump.apache.org/gump/public/pdfbox/pdfbox-lucene/gump_work/build_pdfbox_pdfbox-lucene.html
Work Name: build_pdfbox_pdfbox-lucene (Type: Build)
Work ended in a state of : Failed
Elapsed: 12 secs
Command Line: mvn --batch-mode --settings /srv/gump/public/workspace/pdfbox/lucene/gump_mvn_settings.xml package 
[Working Directory: /srv/gump/public/workspace/pdfbox/lucene]
---------------------------------------------
1352K downloaded  (lucene-core-2.4.1.jar)
Downloading: http://localhost:8192/maven2/org/apache/lucene/lucene-demos/2.4.1/lucene-demos-2.4.1.jar
57K downloaded  (lucene-demos-2.4.1.jar)
3370K downloaded  (pdfbox-1.4.0-SNAPSHOT.jar)
[INFO] Setting property: classpath.resource.loader.class => 'org.codehaus.plexus.velocity.ContextClassLoaderResourceLoader'.
[INFO] Setting property: velocimacro.messages.on => 'false'.
[INFO] Setting property: resource.loader => 'classpath'.
[INFO] Setting property: resource.manager.logwhenfound => 'false'.
[INFO] [remote-resources:process {execution: default}]
[INFO] [resources:resources {execution: default-resources}]
[INFO] Using 'ISO-8859-1' encoding to copy filtered resources.
[INFO] skip non existing resourceDirectory /srv/gump/public/workspace/pdfbox/lucene/src/main/resources
[INFO] Copying 3 resources
[INFO] [compiler:compile {execution: default-compile}]
[INFO] Compiling 4 source files to /srv/gump/public/workspace/pdfbox/lucene/target/classes
[INFO] ------------------------------------------------------------------------
[ERROR] BUILD FAILURE
[INFO] ------------------------------------------------------------------------
[INFO] Compilation failure

/srv/gump/public/workspace/pdfbox/lucene/src/main/java/org/apache/pdfbox/lucene/IndexFiles.java:[25,42] package org.apache.lucene.analysis.standard does not exist

/srv/gump/public/workspace/pdfbox/lucene/src/main/java/org/apache/pdfbox/lucene/IndexFiles.java:[34,30] cannot find symbol
symbol  : class TermEnum
location: package org.apache.lucene.index

/srv/gump/public/workspace/pdfbox/lucene/src/main/java/org/apache/pdfbox/lucene/IndexFiles.java:[59,12] cannot find symbol
symbol  : class TermEnum
location: class org.apache.pdfbox.lucene.IndexFiles

/srv/gump/public/workspace/pdfbox/lucene/src/main/java/org/apache/pdfbox/lucene/IndexFiles.java:[120,48] cannot find symbol
symbol  : class StandardAnalyzer
location: class org.apache.pdfbox.lucene.IndexFiles

/srv/gump/public/workspace/pdfbox/lucene/src/main/java/org/apache/pdfbox/lucene/IndexFiles.java:[120,21] internal error; cannot instantiate org.apache.lucene.index.IndexWriter.<init> at org.apache.lucene.index.IndexWriter to ()

/srv/gump/public/workspace/pdfbox/lucene/src/main/java/org/apache/pdfbox/lucene/IndexFiles.java:[163,32] cannot find symbol
symbol  : method open(java.lang.String)
location: class org.apache.lucene.index.IndexReader

/srv/gump/public/workspace/pdfbox/lucene/src/main/java/org/apache/pdfbox/lucene/IndexFiles.java:[164,28] terms(java.lang.String) in org.apache.lucene.index.IndexReader cannot be applied to (org.apache.lucene.index.Term)


[INFO] ------------------------------------------------------------------------
[INFO] For more information, run Maven with the -e switch
[INFO] ------------------------------------------------------------------------
[INFO] Total time: 10 seconds
[INFO] Finished at: Sun Oct 24 06:12:32 UTC 2010
[INFO] Final Memory: 33M/79M
[INFO] ------------------------------------------------------------------------
---------------------------------------------

To subscribe to this information via syndicated feeds:
- RSS: http://vmgump.apache.org/gump/public/pdfbox/pdfbox-lucene/rss.xml
- Atom: http://vmgump.apache.org/gump/public/pdfbox/pdfbox-lucene/atom.xml

============================== Gump Tracking Only ===
Produced by Gump version 2.3.
Gump Run 10000024102010, vmgump.apache.org:vmgump:10000024102010
Gump E-mail Identifier (unique within run) #10.

*********************************************************** G U M P
[GUMP@vmgump]: Project xstream-test (in module xstream) failed
To whom it may engage...
        
This is an automated request, but not an unsolicited one. For 
more information please visit http://gump.apache.org/nagged.html, 
and/or contact the folk at general@gump.apache.org.

Project xstream-test has an issue affecting its community integration.
This issue affects 1 projects,
 and has been outstanding for 19 runs.
The current state of this project is 'Failed', with reason 'Build Failed'.
For reference only, the following projects are affected by this:
    - xstream-test :  simple library to serialize object to XML and back
    again


Full details are available at:
    http://vmgump.apache.org/gump/public/xstream/xstream-test/index.html

That said, some information snippets are provided here.

The following annotations (debug/informational/warning/error messages) were provided:
 -WARNING- Overriding Maven2 settings: [/srv/gump/public/workspace/xstream/xstream/gump_mvn_settings.xml]
 -DEBUG- (Gump generated) Maven2 Settings in: /srv/gump/public/workspace/xstream/xstream/gump_mvn_settings.xml
 -INFO- Failed with reason build failed
 -DEBUG- Maven POM in: /srv/gump/public/workspace/xstream/xstream/pom.xml
 -INFO- Project Reports in: /srv/gump/public/workspace/xstream/xstream/target/surefire-reports



The following work was performed:
http://vmgump.apache.org/gump/public/xstream/xstream-test/gump_work/build_xstream_xstream-test.html
Work Name: build_xstream_xstream-test (Type: Build)
Work ended in a state of : Failed
Elapsed: 1 min 16 secs
Command Line: mvn --batch-mode --settings /srv/gump/public/workspace/xstream/xstream/gump_mvn_settings.xml test 
[Working Directory: /srv/gump/public/workspace/xstream/xstream]
---------------------------------------------
Tests run: 2, Failures: 0, Errors: 0, Skipped: 0, Time elapsed: 0.043 sec
Running com.thoughtworks.acceptance.CustomSerializationTest
Tests run: 11, Failures: 0, Errors: 0, Skipped: 0, Time elapsed: 0.167 sec
Running com.thoughtworks.xstream.core.TreeMarshallerTest
Tests run: 1, Failures: 0, Errors: 0, Skipped: 0, Time elapsed: 0.003 sec
Running com.thoughtworks.acceptance.FinalFieldsTest
Tests run: 2, Failures: 0, Errors: 0, Skipped: 0, Time elapsed: 0.009 sec
Running com.thoughtworks.xstream.io.xml.SjsxpStaxWriterTest
Tests run: 10, Failures: 0, Errors: 0, Skipped: 0, Time elapsed: 0.121 sec
Running com.thoughtworks.acceptance.AbsoluteSingleNodeXPathCircularReferenceTest
Tests run: 7, Failures: 0, Errors: 0, Skipped: 0, Time elapsed: 0.024 sec
Running com.thoughtworks.xstream.core.util.ThreadSafeSimpleDateFormatTest
Tests run: 1, Failures: 0, Errors: 0, Skipped: 0, Time elapsed: 1.515 sec
Running com.thoughtworks.xstream.converters.javabean.JavaBeanConverterTest
Tests run: 8, Failures: 0, Errors: 0, Skipped: 0, Time elapsed: 0.243 sec
Running com.thoughtworks.acceptance.XStream11XmlFriendlyTest
Tests run: 4, Failures: 0, Errors: 0, Skipped: 0, Time elapsed: 0.063 sec
Running com.thoughtworks.xstream.io.xml.XomReaderTest
Tests run: 13, Failures: 0, Errors: 0, Skipped: 0, Time elapsed: 0.036 sec
Running com.thoughtworks.xstream.io.json.JsonHierarchicalStreamDriverTest
Tests run: 22, Failures: 0, Errors: 0, Skipped: 0, Time elapsed: 0.109 sec
Running com.thoughtworks.xstream.io.xml.PrettyPrintWriterTest
Tests run: 18, Failures: 0, Errors: 0, Skipped: 0, Time elapsed: 0.055 sec
Running com.thoughtworks.acceptance.DefaultImplementationTest
Tests run: 2, Failures: 0, Errors: 0, Skipped: 0, Time elapsed: 0.034 sec
Running com.thoughtworks.xstream.core.util.OrderRetainingMapTest
Tests run: 4, Failures: 0, Errors: 0, Skipped: 0, Time elapsed: 0.002 sec
Running com.thoughtworks.acceptance.IDDuplicateReferenceTest
Tests run: 10, Failures: 0, Errors: 0, Skipped: 0, Time elapsed: 0.062 sec

Results :

Failed tests: 
  testEnforceSameSystemHashCodeForGCedObjects(com.thoughtworks.xstream.core.util.ObjectIdDictionaryTest)

Tests run: 1161, Failures: 1, Errors: 0, Skipped: 0

[INFO] ------------------------------------------------------------------------
[ERROR] BUILD FAILURE
[INFO] ------------------------------------------------------------------------
[INFO] There are test failures.

Please refer to /srv/gump/public/workspace/xstream/xstream/target/surefire-reports for the individual test results.
[INFO] ------------------------------------------------------------------------
[INFO] For more information, run Maven with the -e switch
[INFO] ------------------------------------------------------------------------
[INFO] Total time: 1 minute 14 seconds
[INFO] Finished at: Sun Oct 24 08:03:40 UTC 2010
[INFO] Final Memory: 32M/77M
[INFO] ------------------------------------------------------------------------
---------------------------------------------

To subscribe to this information via syndicated feeds:
- RSS: http://vmgump.apache.org/gump/public/xstream/xstream-test/rss.xml
- Atom: http://vmgump.apache.org/gump/public/xstream/xstream-test/atom.xml

============================== Gump Tracking Only ===
Produced by Gump version 2.3.
Gump Run 10000024102010, vmgump.apache.org:vmgump:10000024102010
Gump E-mail Identifier (unique within run) #13.

*********************************************************** G U M P
[GUMP@vmgump]: Project apache-mime4j-reactor (in module james-mime4j) failed
To whom it may engage...
        
This is an automated request, but not an unsolicited one. For 
more information please visit http://gump.apache.org/nagged.html, 
and/or contact the folk at general@gump.apache.org.

Project apache-mime4j-reactor has an issue affecting its community integration.
This issue affects 1 projects,
 and has been outstanding for 11 runs.
The current state of this project is 'Failed', with reason 'Build Failed'.
For reference only, the following projects are affected by this:
    - apache-mime4j-reactor :  Java stream based MIME message parser


Full details are available at:
    http://vmgump.apache.org/gump/public/james-mime4j/apache-mime4j-reactor/index.html

That said, some information snippets are provided here.

The following annotations (debug/informational/warning/error messages) were provided:
 -WARNING- Overriding Maven2 settings: [/srv/gump/public/workspace/james-mime4j/gump_mvn_settings.xml]
 -DEBUG- (Gump generated) Maven2 Settings in: /srv/gump/public/workspace/james-mime4j/gump_mvn_settings.xml
 -INFO- Failed with reason build failed
 -DEBUG- Maven POM in: /srv/gump/public/workspace/james-mime4j/pom.xml



The following work was performed:
http://vmgump.apache.org/gump/public/james-mime4j/apache-mime4j-reactor/gump_work/build_james-mime4j_apache-mime4j-reactor.html
Work Name: build_james-mime4j_apache-mime4j-reactor (Type: Build)
Work ended in a state of : Failed
Elapsed: 60 secs
Command Line: mvn --batch-mode --settings /srv/gump/public/workspace/james-mime4j/gump_mvn_settings.xml package 
[Working Directory: /srv/gump/public/workspace/james-mime4j]
---------------------------------------------
Running org.apache.james.mime4j.stream.MimeTokenStreamTest
Tests run: 1, Failures: 0, Errors: 0, Skipped: 0, Time elapsed: 0.009 sec
Running org.apache.james.mime4j.TestUtil
Tests run: 0, Failures: 0, Errors: 0, Skipped: 0, Time elapsed: 0.011 sec
Running org.apache.james.mime4j.io.PositionInputStreamTest
Tests run: 1, Failures: 0, Errors: 0, Skipped: 0, Time elapsed: 0.003 sec
Running org.apache.james.mime4j.stream.MimeTokenNoRecurseTest
Tests run: 4, Failures: 0, Errors: 0, Skipped: 0, Time elapsed: 0.008 sec
Running org.apache.james.mime4j.parser.MimeStreamParserTest
Tests run: 11, Failures: 0, Errors: 0, Skipped: 0, Time elapsed: 0.033 sec
Running org.apache.james.mime4j.codec.DecoderUtilTest
Tests run: 13, Failures: 0, Errors: 0, Skipped: 0, Time elapsed: 0.048 sec
Running org.apache.james.mime4j.MimeExceptionTest
Tests run: 3, Failures: 0, Errors: 0, Skipped: 0, Time elapsed: 0.003 sec
Running org.apache.james.mime4j.codec.QuotedPrintableEncodeTest
Tests run: 5, Failures: 0, Errors: 0, Skipped: 0, Time elapsed: 0.012 sec
Running org.apache.james.mime4j.MimeIOExceptionTest
Tests run: 1, Failures: 0, Errors: 0, Skipped: 0, Time elapsed: 0.007 sec
Running org.apache.james.mime4j.codec.QuotedPrintableInputStreamTest
Tests run: 19, Failures: 0, Errors: 0, Skipped: 0, Time elapsed: 0.011 sec
Running org.apache.james.mime4j.stream.MimeTokenStreamBodyDescriptorTest
Tests run: 2, Failures: 0, Errors: 0, Skipped: 0, Time elapsed: 0.01 sec
Running org.apache.james.mime4j.codec.CodecUtilTest
Tests run: 5, Failures: 0, Errors: 0, Skipped: 0, Time elapsed: 0.064 sec
Running org.apache.james.mime4j.stream.MultipartStreamTest
Tests run: 2, Failures: 0, Errors: 0, Skipped: 0, Time elapsed: 0.015 sec

Results :

Tests run: 225, Failures: 0, Errors: 0, Skipped: 0

[INFO] [jar:jar {execution: default-jar}]
[INFO] Building jar: /srv/gump/public/workspace/james-mime4j/core/target/apache-mime4j-core-0.7-SNAPSHOT.jar
[INFO] [jar:test-jar {execution: default}]
[INFO] Building jar: /srv/gump/public/workspace/james-mime4j/core/target/apache-mime4j-core-0.7-SNAPSHOT-tests.jar
[INFO] [javadoc:jar {execution: javadoc-jar}]
[INFO] The goal 'org.apache.maven.plugins:maven-javadoc-plugin:2.6.1:javadoc' has not be previously called for the project: 'org.apache.james:apache-mime4j-benchmark:jar:0.7-SNAPSHOT'. Trying to invoke it...
[ERROR] MavenInvocationException: Error when invoking Maven, consult the invoker log file: /srv/gump/public/workspace/james-mime4j/core/target/invoker/maven-javadoc-plugin1121803353.txt
[INFO] ------------------------------------------------------------------------
[ERROR] BUILD ERROR
[INFO] ------------------------------------------------------------------------
[INFO] MavenReportException: Error while creating archive:Error when invoking Maven, consult the invoker log file: /srv/gump/public/workspace/james-mime4j/core/target/invoker/maven-javadoc-plugin1121803353.txt

[INFO] ------------------------------------------------------------------------
[INFO] For more information, run Maven with the -e switch
[INFO] ------------------------------------------------------------------------
[INFO] Total time: 58 seconds
[INFO] Finished at: Sun Oct 24 08:12:14 UTC 2010
[INFO] Final Memory: 61M/146M
[INFO] ------------------------------------------------------------------------
---------------------------------------------

To subscribe to this information via syndicated feeds:
- RSS: http://vmgump.apache.org/gump/public/james-mime4j/apache-mime4j-reactor/rss.xml
- Atom: http://vmgump.apache.org/gump/public/james-mime4j/apache-mime4j-reactor/atom.xml

============================== Gump Tracking Only ===
Produced by Gump version 2.3.
Gump Run 10000024102010, vmgump.apache.org:vmgump:10000024102010
Gump E-mail Identifier (unique within run) #14.

*********************************************************** G U M P
[GUMP@vmgump]: Project commons-jci-reactor (in module apache-commons) failed
To whom it may engage...
        
This is an automated request, but not an unsolicited one. For 
more information please visit http://gump.apache.org/nagged.html, 
and/or contact the folk at general@gump.apache.org.

Project commons-jci-reactor has an issue affecting its community integration.
This issue affects 1 projects,
 and has been outstanding for 120 runs.
The current state of this project is 'Failed', with reason 'Build Failed'.
For reference only, the following projects are affected by this:
    - commons-jci-reactor :  Apache Commons


Full details are available at:
    http://vmgump.apache.org/gump/public/apache-commons/commons-jci-reactor/index.html

That said, some information snippets are provided here.

The following annotations (debug/informational/warning/error messages) were provided:
 -WARNING- Overriding Maven2 settings: [/srv/gump/public/workspace/apache-commons/jci/gump_mvn_settings.xml]
 -DEBUG- (Gump generated) Maven2 Settings in: /srv/gump/public/workspace/apache-commons/jci/gump_mvn_settings.xml
 -INFO- Failed with reason build failed
 -DEBUG- Maven POM in: /srv/gump/public/workspace/apache-commons/jci/pom.xml
 -INFO- Project Reports in: /srv/gump/public/workspace/apache-commons/jci/compilers/groovy/target/surefire-reports



The following work was performed:
http://vmgump.apache.org/gump/public/apache-commons/commons-jci-reactor/gump_work/build_apache-commons_commons-jci-reactor.html
Work Name: build_apache-commons_commons-jci-reactor (Type: Build)
Work ended in a state of : Failed
Elapsed: 3 mins 28 secs
Command Line: mvn --batch-mode --settings /srv/gump/public/workspace/apache-commons/jci/gump_mvn_settings.xml package 
[Working Directory: /srv/gump/public/workspace/apache-commons/jci]
---------------------------------------------
Downloading: http://localhost:8192/maven2/asm/asm-analysis/2.2.1/asm-analysis-2.2.1.jar
17K downloaded  (asm-analysis-2.2.1.jar)
Downloading: http://localhost:8192/maven2/asm/asm-tree/2.2.1/asm-tree-2.2.1.jar
21K downloaded  (asm-tree-2.2.1.jar)
Downloading: http://localhost:8192/maven2/asm/asm-attrs/2.2.1/asm-attrs-2.2.1.jar


[INFO] [antrun:run {execution: javadoc.resources}]
[INFO] Executing tasks
[INFO] Executed tasks
[INFO] [remote-resources:process {execution: default}]
[INFO] [resources:resources {execution: default-resources}]
[INFO] Using 'iso-8859-1' encoding to copy filtered resources.
[INFO] Copying 0 resource to META-INF
[INFO] [compiler:compile {execution: default-compile}]
[INFO] Compiling 6 source files to /srv/gump/public/workspace/apache-commons/jci/compilers/javac/target/classes
[INFO] -------------------------------------------------------------
[ERROR] COMPILATION ERROR : 
[INFO] -------------------------------------------------------------
[ERROR] /srv/gump/public/workspace/apache-commons/jci/compilers/javac/src/main/java/org/apache/commons/jci/compilers/JavacClassLoader.java:[108,46] cannot find symbol
symbol  : constructor ClassWriter(boolean,boolean)
location: class org.objectweb.asm.ClassWriter

[ERROR] /srv/gump/public/workspace/apache-commons/jci/compilers/javac/src/main/java/org/apache/commons/jci/compilers/JavacClassLoader.java:[109,44] cannot find symbol
symbol  : method accept(org.vafer.dependency.asm.RenamingVisitor,boolean)
location: class org.objectweb.asm.ClassReader

[INFO] 2 errors 
[INFO] -------------------------------------------------------------
[INFO] ------------------------------------------------------------------------
[ERROR] BUILD FAILURE
[INFO] ------------------------------------------------------------------------
[INFO] Compilation failure

/srv/gump/public/workspace/apache-commons/jci/compilers/javac/src/main/java/org/apache/commons/jci/compilers/JavacClassLoader.java:[108,46] cannot find symbol
symbol  : constructor ClassWriter(boolean,boolean)
location: class org.objectweb.asm.ClassWriter

/srv/gump/public/workspace/apache-commons/jci/compilers/javac/src/main/java/org/apache/commons/jci/compilers/JavacClassLoader.java:[109,44] cannot find symbol
symbol  : method accept(org.vafer.dependency.asm.RenamingVisitor,boolean)
location: class org.objectweb.asm.ClassReader


[INFO] ------------------------------------------------------------------------
[INFO] For more information, run Maven with the -e switch
[INFO] ------------------------------------------------------------------------
[INFO] Total time: 3 minutes 27 seconds
[INFO] Finished at: Sun Oct 24 08:32:05 UTC 2010
[INFO] Final Memory: 78M/186M
[INFO] ------------------------------------------------------------------------
---------------------------------------------

To subscribe to this information via syndicated feeds:
- RSS: http://vmgump.apache.org/gump/public/apache-commons/commons-jci-reactor/rss.xml
- Atom: http://vmgump.apache.org/gump/public/apache-commons/commons-jci-reactor/atom.xml

============================== Gump Tracking Only ===
Produced by Gump version 2.3.
Gump Run 10000024102010, vmgump.apache.org:vmgump:10000024102010
Gump E-mail Identifier (unique within run) #15.

*********************************************************** G U M P
[GUMP@vmgump]: Project james-jsieve (in module james-jsieve) failed
To whom it may engage...
        
This is an automated request, but not an unsolicited one. For 
more information please visit http://gump.apache.org/nagged.html, 
and/or contact the folk at general@gump.apache.org.

Project james-jsieve has an issue affecting its community integration.
This issue affects 1 projects,
 and has been outstanding for 206 runs.
The current state of this project is 'Failed', with reason 'Build Failed'.
For reference only, the following projects are affected by this:
    - james-jsieve :  Implements JSIEVE Mail Filtering Language


Full details are available at:
    http://vmgump.apache.org/gump/public/james-jsieve/james-jsieve/index.html

That said, some information snippets are provided here.

The following annotations (debug/informational/warning/error messages) were provided:
 -WARNING- Overriding Maven2 settings: [/srv/gump/public/workspace/james-jsieve/gump_mvn_settings.xml]
 -DEBUG- (Gump generated) Maven2 Settings in: /srv/gump/public/workspace/james-jsieve/gump_mvn_settings.xml
 -INFO- Failed with reason build failed
 -DEBUG- Maven POM in: /srv/gump/public/workspace/james-jsieve/pom.xml



The following work was performed:
http://vmgump.apache.org/gump/public/james-jsieve/james-jsieve/gump_work/build_james-jsieve_james-jsieve.html
Work Name: build_james-jsieve_james-jsieve (Type: Build)
Work ended in a state of : Failed
Elapsed: 18 secs
Command Line: mvn --batch-mode --settings /srv/gump/public/workspace/james-jsieve/gump_mvn_settings.xml install 
[Working Directory: /srv/gump/public/workspace/james-jsieve]
---------------------------------------------
[INFO]   Apache JAMES jSieve Utilities
[INFO]   Apache JAMES jSieve Assembly
[INFO] ------------------------------------------------------------------------
[INFO] Building Apache JAMES JSieve Project
[INFO]    task-segment: [install]
[INFO] ------------------------------------------------------------------------
[INFO] Setting property: classpath.resource.loader.class => 'org.codehaus.plexus.velocity.ContextClassLoaderResourceLoader'.
[INFO] Setting property: velocimacro.messages.on => 'false'.
[INFO] Setting property: resource.loader => 'classpath'.
[INFO] Setting property: resource.manager.logwhenfound => 'false'.
[INFO] [remote-resources:process {execution: default}]
[INFO] [site:attach-descriptor {execution: default-attach-descriptor}]
[INFO] Unable to load parent project from a relative path: Could not find the model file '/srv/gump/public/workspace/pom.xml'. for project unknown
[INFO] Parent project loaded from repository.
[INFO] [install:install {execution: default-install}]
[INFO] Installing /srv/gump/public/workspace/james-jsieve/pom.xml to /srv/gump/public/workspace/mvnlocalrepo/shared/org/apache/james/jsieve-project/0.5-SNAPSHOT/jsieve-project-0.5-SNAPSHOT.pom
[INFO] ------------------------------------------------------------------------
[INFO] Building Apache JAMES jSieve
[INFO]    task-segment: [install]
[INFO] ------------------------------------------------------------------------
[INFO] [javacc:jjtree-javacc {execution: generate-jjtree}]
[INFO] Skipping - all parsers are up to date
[INFO] [remote-resources:process {execution: default}]
[INFO] [resources:resources {execution: default-resources}]
[INFO] Using 'UTF-8' encoding to copy filtered resources.
[INFO] Copying 3 resources
[INFO] Copying 3 resources
[INFO] [compiler:compile {execution: default-compile}]
[INFO] Nothing to compile - all classes are up to date
[INFO] [bundle:manifest {execution: bundle-manifest}]
[INFO] [resources:testResources {execution: default-testResources}]
[INFO] Using 'UTF-8' encoding to copy filtered resources.
[INFO] Copying 2 resources
[INFO] Copying 3 resources
[INFO] [compiler:testCompile {execution: default-testCompile}]
[INFO] Compiling 50 source files to /srv/gump/public/workspace/james-jsieve/main/target/test-classes
[INFO] ------------------------------------------------------------------------
[ERROR] BUILD FAILURE
[INFO] ------------------------------------------------------------------------
[INFO] Compilation failure
/srv/gump/public/workspace/james-jsieve/main/src/test/java/org/apache/jsieve/AllTests.java:[31,21] package junit.swingui does not exist


[INFO] ------------------------------------------------------------------------
[INFO] For more information, run Maven with the -e switch
[INFO] ------------------------------------------------------------------------
[INFO] Total time: 16 seconds
[INFO] Finished at: Sun Oct 24 08:59:13 UTC 2010
[INFO] Final Memory: 47M/115M
[INFO] ------------------------------------------------------------------------
---------------------------------------------

To subscribe to this information via syndicated feeds:
- RSS: http://vmgump.apache.org/gump/public/james-jsieve/james-jsieve/rss.xml
- Atom: http://vmgump.apache.org/gump/public/james-jsieve/james-jsieve/atom.xml

============================== Gump Tracking Only ===
Produced by Gump version 2.3.
Gump Run 10000024102010, vmgump.apache.org:vmgump:10000024102010
Gump E-mail Identifier (unique within run) #18.

*********************************************************** G U M P
[GUMP@vmgump]: Project camel-spring-test (in module camel) failed
To whom it may engage...
        
This is an automated request, but not an unsolicited one. For 
more information please visit http://gump.apache.org/nagged.html, 
and/or contact the folk at general@gump.apache.org.

Project camel-spring-test has an issue affecting its community integration.
This issue affects 1 projects,
 and has been outstanding for 9 runs.
The current state of this project is 'Failed', with reason 'Build Failed'.
For reference only, the following projects are affected by this:
    - camel-spring-test :  Integration framework based on known Enterprise Integration
...


Full details are available at:
    http://vmgump.apache.org/gump/public/camel/camel-spring-test/index.html

That said, some information snippets are provided here.

The following annotations (debug/informational/warning/error messages) were provided:
 -WARNING- Overriding Maven2 settings: [/srv/gump/public/workspace/camel/components/camel-spring/gump_mvn_settings.xml]
 -DEBUG- (Gump generated) Maven2 Settings in: /srv/gump/public/workspace/camel/components/camel-spring/gump_mvn_settings.xml
 -INFO- Failed with reason build failed
 -DEBUG- Maven POM in: /srv/gump/public/workspace/camel/components/camel-spring/pom.xml
 -INFO- Project Reports in: /srv/gump/public/workspace/camel/components/camel-spring/target/surefire-reports



The following work was performed:
http://vmgump.apache.org/gump/public/camel/camel-spring-test/gump_work/build_camel_camel-spring-test.html
Work Name: build_camel_camel-spring-test (Type: Build)
Work ended in a state of : Failed
Elapsed: 16 mins 9 secs
Command Line: mvn --batch-mode --settings /srv/gump/public/workspace/camel/components/camel-spring/gump_mvn_settings.xml test 
[Working Directory: /srv/gump/public/workspace/camel/components/camel-spring]
---------------------------------------------
Tests run: 5, Failures: 0, Errors: 0, Skipped: 0, Time elapsed: 5.228 sec
Running org.apache.camel.spring.processor.SpringValidateSimpleTest
Tests run: 2, Failures: 0, Errors: 0, Skipped: 0, Time elapsed: 1.987 sec
Running org.apache.camel.spring.issues.StringDataFormatTest
Tests run: 2, Failures: 0, Errors: 0, Skipped: 0, Time elapsed: 2.125 sec
Running org.apache.camel.spring.issues.contextscan2.SpringRouteIsComponentAnnotated2Test
Tests run: 1, Failures: 0, Errors: 0, Skipped: 0, Time elapsed: 1.05 sec
Running org.apache.camel.spring.processor.SpringTokenizerTest
Tests run: 1, Failures: 0, Errors: 0, Skipped: 0, Time elapsed: 1.007 sec
Running org.apache.camel.spring.processor.SpringSplitterNoStopOnExceptionTest
Tests run: 2, Failures: 0, Errors: 0, Skipped: 0, Time elapsed: 1.994 sec
Running org.apache.camel.spring.processor.SpringInterceptSendToEndpointTest
Tests run: 1, Failures: 0, Errors: 0, Skipped: 0, Time elapsed: 1.032 sec
Running org.apache.camel.spring.config.SpringProduceInjectedPrototypeBeanTest
Tests run: 2, Failures: 0, Errors: 0, Skipped: 0, Time elapsed: 2.079 sec
Running org.apache.camel.spring.file.SpringFileConsumerPreMoveIssueTest
Tests run: 1, Failures: 0, Errors: 0, Skipped: 0, Time elapsed: 2.003 sec
Running org.apache.camel.spring.processor.onexception.RedeliveryPolicyReTest
Tests run: 2, Failures: 0, Errors: 0, Skipped: 0, Time elapsed: 2.605 sec
Running org.apache.camel.spring.example.PojoConsumerTest
Tests run: 1, Failures: 0, Errors: 0, Skipped: 0, Time elapsed: 1.399 sec
Running org.apache.camel.spring.interceptor.SpringTransactionalClientDataWithOnExceptionAndRollbackUsingTransactedTest
Tests run: 2, Failures: 0, Errors: 0, Skipped: 0, Time elapsed: 2.501 sec
Running org.apache.camel.spring.processor.SpringInterceptSendToEndpointDynamicTest
Tests run: 2, Failures: 0, Errors: 0, Skipped: 0, Time elapsed: 1.436 sec
Running org.apache.camel.spring.processor.SpringCBRHeaderPredicateTest
Tests run: 1, Failures: 0, Errors: 0, Skipped: 0, Time elapsed: 0.741 sec
Running org.apache.camel.spring.config.RouteBuilderRef2Test
Tests run: 1, Failures: 0, Errors: 0, Skipped: 0, Time elapsed: 0.725 sec

Results :

Failed tests: 
  testAggregateDiscardOnTimeout(org.apache.camel.spring.processor.aggregator.SpringAggregateDiscardOnTimeoutTest)

Tests run: 747, Failures: 1, Errors: 0, Skipped: 1

[INFO] ------------------------------------------------------------------------
[ERROR] BUILD FAILURE
[INFO] ------------------------------------------------------------------------
[INFO] There are test failures.

Please refer to /srv/gump/public/workspace/camel/components/camel-spring/target/surefire-reports for the individual test results.
[INFO] ------------------------------------------------------------------------
[INFO] For more information, run Maven with the -e switch
[INFO] ------------------------------------------------------------------------
[INFO] Total time: 16 minutes 8 seconds
[INFO] Finished at: Sun Oct 24 10:01:01 UTC 2010
[INFO] Final Memory: 71M/170M
[INFO] ------------------------------------------------------------------------
---------------------------------------------

To subscribe to this information via syndicated feeds:
- RSS: http://vmgump.apache.org/gump/public/camel/camel-spring-test/rss.xml
- Atom: http://vmgump.apache.org/gump/public/camel/camel-spring-test/atom.xml

============================== Gump Tracking Only ===
Produced by Gump version 2.3.
Gump Run 10000024102010, vmgump.apache.org:vmgump:10000024102010
Gump E-mail Identifier (unique within run) #20.

*********************************************************** G U M P
[GUMP@vmgump]: Project htmlunit (in module htmlunit) failed
To whom it may engage...
        
This is an automated request, but not an unsolicited one. For 
more information please visit http://gump.apache.org/nagged.html, 
and/or contact the folk at general@gump.apache.org.

Project htmlunit has an issue affecting its community integration.
This issue affects 1 projects,
 and has been outstanding for 226 runs.
The current state of this project is 'Failed', with reason 'Build Failed'.
For reference only, the following projects are affected by this:
    - htmlunit :  A tool for testing web based applications


Full details are available at:
    http://vmgump.apache.org/gump/public/htmlunit/htmlunit/index.html

That said, some information snippets are provided here.

The following annotations (debug/informational/warning/error messages) were provided:
 -DEBUG- Sole jar output [htmlunit-*[0-9T].jar] identifier set to project name
 -INFO- Optional dependency apache-mime4j-reactor failed with reason build failed
 -DEBUG- (Gump generated) Maven2 Settings in: /srv/gump/public/workspace/htmlunit/htmlunit/gump_mvn_settings.xml
 -INFO- Failed with reason build failed
 -DEBUG- Maven POM in: /srv/gump/public/workspace/htmlunit/htmlunit/pom.xml
 -INFO- Failed to extract fallback artifacts from Gump Repository



The following work was performed:
http://vmgump.apache.org/gump/public/htmlunit/htmlunit/gump_work/build_htmlunit_htmlunit.html
Work Name: build_htmlunit_htmlunit (Type: Build)
Work ended in a state of : Failed
Elapsed: 1 min 28 secs
Command Line: mvn --batch-mode --settings /srv/gump/public/workspace/htmlunit/htmlunit/gump_mvn_settings.xml package 
[Working Directory: /srv/gump/public/workspace/htmlunit/htmlunit]
---------------------------------------------

Downloading: http://localhost:8192/maven2/com/google/guava/guava/r07/guava-r07.pom

Downloading: http://localhost:8192/maven2/com/google/google/5/google-5.pom

Downloading: http://localhost:8192/maven2/org/apache/httpcomponents/httpclient/4.0.2/httpclient-4.0.2.pom

Downloading: http://localhost:8192/maven2/org/apache/httpcomponents/httpcomponents-client/4.0.2/httpcomponents-client-4.0.2.pom

Downloading: http://htmlunit.sourceforge.net/m2-repo-snapshots/net/sourceforge/htmlunit/htmlunit-core-js/2.9-SNAPSHOT/htmlunit-core-js-2.9-SNAPSHOT.jar
Downloading: http://localhost:8192/maven2/net/sourceforge/cssparser/cssparser/0.9.5/cssparser-0.9.5.jar
Downloading: http://localhost:8192/maven2/org/apache/httpcomponents/httpclient/4.0.3/httpclient-4.0.3.jar
Downloading: http://build.canoo.com/NekoHTML/artifacts/m2-repo/net/sourceforge/nekohtml/nekohtml/1.9.15-SNAPSHOT/nekohtml-1.9.15-20101007.124211-1.jar
Downloading: http://localhost:8192/maven2/org/w3c/css/sac/1.3/sac-1.3.jar

339K downloaded  (httpclient-4.0.3.jar)
Downloading: http://localhost:8192/maven2/org/apache/httpcomponents/httpcore/4.0.1/httpcore-4.0.1.jar
176K downloaded  (httpcore-4.0.1.jar)
Downloading: http://localhost:8192/maven2/org/apache/httpcomponents/httpmime/4.0.3/httpmime-4.0.3.jar
26K downloaded  (httpmime-4.0.3.jar)


892K downloaded  (htmlunit-core-js-2.9-SNAPSHOT.jar)
[INFO] [compiler:compile {execution: default-compile}]
[INFO] Compiling 441 source files to /srv/gump/public/workspace/htmlunit/htmlunit/target/classes
[INFO] -------------------------------------------------------------
[ERROR] COMPILATION ERROR : 
[INFO] -------------------------------------------------------------
[ERROR] /srv/gump/public/workspace/htmlunit/htmlunit/src/main/java/com/gargoylesoftware/htmlunit/HttpWebConnection.java:[346,65] incompatible types
found   : org.apache.http.entity.mime.FormBodyPart
required: org.apache.james.mime4j.message.BodyPart

[INFO] 1error
[INFO] -------------------------------------------------------------
[INFO] ------------------------------------------------------------------------
[ERROR] BUILD FAILURE
[INFO] ------------------------------------------------------------------------
[INFO] Compilation failure
/srv/gump/public/workspace/htmlunit/htmlunit/src/main/java/com/gargoylesoftware/htmlunit/HttpWebConnection.java:[346,65] incompatible types
found   : org.apache.http.entity.mime.FormBodyPart
required: org.apache.james.mime4j.message.BodyPart


[INFO] ------------------------------------------------------------------------
[INFO] For more information, run Maven with the -e switch
[INFO] ------------------------------------------------------------------------
[INFO] Total time: 1 minute 27 seconds
[INFO] Finished at: Sun Oct 24 10:05:52 UTC 2010
[INFO] Final Memory: 39M/126M
[INFO] ------------------------------------------------------------------------
---------------------------------------------

To subscribe to this information via syndicated feeds:
- RSS: http://vmgump.apache.org/gump/public/htmlunit/htmlunit/rss.xml
- Atom: http://vmgump.apache.org/gump/public/htmlunit/htmlunit/atom.xml

============================== Gump Tracking Only ===
Produced by Gump version 2.3.
Gump Run 10000024102010, vmgump.apache.org:vmgump:10000024102010
Gump E-mail Identifier (unique within run) #21.

*********************************************************** G U M P
[GUMP@vmgump]: Project solr-test (in module lucene-java) failed
To whom it may engage...
        
This is an automated request, but not an unsolicited one. For 
more information please visit http://gump.apache.org/nagged.html, 
and/or contact the folk at general@gump.apache.org.

Project solr-test has an issue affecting its community integration.
This issue affects 1 projects,
 and has been outstanding for 6 runs.
The current state of this project is 'Failed', with reason 'Build Failed'.
For reference only, the following projects are affected by this:
    - solr-test :  Java Based Search Engine


Full details are available at:
    http://vmgump.apache.org/gump/public/lucene-java/solr-test/index.html

That said, some information snippets are provided here.

The following annotations (debug/informational/warning/error messages) were provided:
 -INFO- Failed with reason build failed



The following work was performed:
http://vmgump.apache.org/gump/public/lucene-java/solr-test/gump_work/build_lucene-java_solr-test.html
Work Name: build_lucene-java_solr-test (Type: Build)
Work ended in a state of : Failed
Elapsed: 2 mins 26 secs
Command Line: /usr/lib/jvm/java-6-openjdk/bin/java -Djava.awt.headless=true -Xbootclasspath/p:/srv/gump/public/workspace/xml-commons/java/external/build/xml-apis.jar:/srv/gump/public/workspace/xml-xerces2/build/xercesImpl.jar org.apache.tools.ant.Main -Dgump.merge=/srv/gump/public/gump/work/merge.xml -Dbuild.sysclasspath=only -Dversion=24102010 test 
[Working Directory: /srv/gump/public/workspace/lucene-java/solr]
CLASSPATH: /usr/lib/jvm/java-6-openjdk/lib/tools.jar:/srv/gump/public/workspace/lucene-java/lucene/build/classes/test:/srv/gump/public/workspace/lucene-java/solr/build/tests:/srv/gump/public/workspace/lucene-java/solr/contrib/clustering/lib/carrot2-core-3.4.0.jar:/srv/gump/public/workspace/lucene-java/solr/contrib/clustering/lib/jackson-core-asl-1.5.2.jar:/srv/gump/public/workspace/lucene-java/solr/contrib/clustering/lib/simple-xml-2.3.5.jar:/srv/gump/public/workspace/lucene-java/solr/lib/apache-solr-noggit-r944541.jar:/srv/gump/public/workspace/lucene-java/solr/lib/easymock.jar:/srv/gump/public/workspace/lucene-java/solr/lib/guava-r05.jar:/srv/gump/public/workspace/ant/dist/lib/ant.jar:/srv/gump/public/workspace/ant/dist/lib/ant-launcher.jar:/srv/gump/public/workspace/ant/dist/lib/ant-jmf.jar:/srv/gump/public/workspace/ant/dist/lib/ant-junit.jar:/srv/gump/public/workspace/ant/dist/lib/ant-swing.jar:/srv/gump/public/workspace/ant/dist/lib/ant-apache-resolver.jar:/srv/gump/pub
 lic/workspace/ant/dist/lib/ant-apache-xalan2.jar:/srv/gump/packages/junit3.8.1/junit.jar:/srv/gump/public/workspace/xml-commons/java/build/resolver.jar:/srv/gump/public/workspace/apache-commons/codec/dist/commons-codec-24102010.jar:/srv/gump/public/workspace/commons-collections-3.x/target/commons-collections-3.3-SNAPSHOT.jar:/srv/gump/public/workspace/commons-sandbox/csv/target/commons-csv-1.0-SNAPSHOT.jar:/srv/gump/public/workspace/apache-commons/fileupload/target/commons-fileupload-24102010.jar:/srv/gump/public/workspace/httpcomponents/oac.hc3x/dist/commons-httpclient.jar:/srv/gump/public/workspace/apache-commons/io/target/commons-io-2.1-SNAPSHOT.jar:/srv/gump/public/workspace/commons-lang-2.x/target/commons-lang-2.6-SNAPSHOT.jar:/srv/gump/public/workspace/apache-commons/logging/target/commons-logging-24102010.jar:/srv/gump/public/workspace/apache-commons/logging/target/commons-logging-api-24102010.jar:/srv/gump/public/workspace/jakarta-servletapi-5/jsr154/dist/lib/servlet
 -api.jar:/srv/gump/packages/javamail-1.4/mail.jar:/srv/gump/packages/javamail-1.4/lib/mailapi.jar:/srv/gump/public/workspace/junit/dist/junit-24102010.jar:/srv/gump/public/workspace/junit/dist/junit-dep-24102010.jar:/srv/gump/public/workspace/lucene-java/lucene/build/lucene-core-24102010.jar:/srv/gump/public/workspace/lucene-java/modules/analysis/build/icu/lucene-analyzers-icu-24102010.jar:/srv/gump/public/workspace/lucene-java/modules/analysis/build/smartcn/lucene-analyzers-smartcn-24102010.jar:/srv/gump/public/workspace/lucene-java/modules/analysis/build/common/lucene-analyzers-common-24102010.jar:/srv/gump/public/workspace/lucene-java/modules/analysis/build/stempel/lucene-analyzers-stempel-24102010.jar:/srv/gump/public/workspace/lucene-java/modules/analysis/build/phonetic/lucene-analyzers-phonetic-24102010.jar:/srv/gump/public/workspace/lucene-java/lucene/build/contrib/ant/lucene-ant-24102010.jar:/srv/gump/public/workspace/lucene-java/lucene/build/contrib/demo/lucene-demo
 -24102010.jar:/srv/gump/public/workspace/lucene-java/lucene/build/contrib/memory/lucene-memory-24102010.jar:/srv/gump/public/workspace/lucene-java/lucene/build/contrib/queries/lucene-queries-24102010.jar:/srv/gump/public/workspace/lucene-java/lucene/build/contrib/highlighter/lucene-highlighter-24102010.jar:/srv/gump/public/workspace/lucene-java/lucene/build/contrib/benchmark/lucene-benchmark-24102010.jar:/srv/gump/public/workspace/lucene-java/lucene/build/contrib/db/bdb/lucene-bdb-24102010.jar:/srv/gump/public/workspace/lucene-java/lucene/build/contrib/db/bdb-je/lucene-bdb-je-24102010.jar:/srv/gump/public/workspace/lucene-java/lucene/build/contrib/instantiated/lucene-instantiated-24102010.jar:/srv/gump/public/workspace/lucene-java/lucene/build/contrib/lucli/lucene-lucli-24102010.jar:/srv/gump/public/workspace/lucene-java/lucene/build/contrib/misc/lucene-misc-24102010.jar:/srv/gump/public/workspace/lucene-java/lucene/build/contrib/queryparser/lucene-queryparser-24102010.jar:/
 srv/gump/public/workspace/lucene-java/lucene/build/contrib/remote/lucene-remote-24102010.jar:/srv/gump/public/workspace/lucene-java/lucene/build/contrib/spatial/lucene-spatial-24102010.jar:/srv/gump/public/workspace/lucene-java/lucene/build/contrib/spellchecker/lucene-spellchecker-24102010.jar:/srv/gump/public/workspace/lucene-java/lucene/build/contrib/swing/lucene-swing-24102010.jar:/srv/gump/public/workspace/lucene-java/lucene/build/contrib/wordnet/lucene-wordnet-24102010.jar:/srv/gump/public/workspace/lucene-java/lucene/build/contrib/xml-query-parser/lucene-xml-query-parser-24102010.jar:/srv/gump/packages/jetty6/jetty-6.1.25.jar:/srv/gump/packages/jetty6/jetty-util-6.1.25.jar:/srv/gump/public/workspace/slf4j/slf4j-api/target/slf4j-api-1.5.9-SNAPSHOT.jar:/srv/gump/public/workspace/slf4j/slf4j-simple/target/slf4j-simple-1.5.9-SNAPSHOT.jar:/srv/gump/public/workspace/slf4j/slf4j-nop/target/slf4j-nop-1.5.9-SNAPSHOT.jar:/srv/gump/public/workspace/slf4j/slf4j-jdk14/target/slf4j-
 jdk14-1.5.9-SNAPSHOT.jar:/srv/gump/public/workspace/slf4j/slf4j-log4j12/target/slf4j-log4j12-1.5.9-SNAPSHOT.jar:/srv/gump/public/workspace/slf4j/slf4j-jcl/target/slf4j-jcl-1.5.9-SNAPSHOT.jar:/srv/gump/public/workspace/slf4j/slf4j-ext/target/slf4j-ext-1.5.9-SNAPSHOT.jar:/srv/gump/public/workspace/slf4j/jcl-over-slf4j/target/jcl-over-slf4j-1.5.9-SNAPSHOT.jar:/srv/gump/public/workspace/slf4j/jcl104-over-slf4j/target/jcl104-over-slf4j-1.5.9-SNAPSHOT.jar:/srv/gump/public/workspace/slf4j/log4j-over-slf4j/target/log4j-over-slf4j-1.5.9-SNAPSHOT.jar:/srv/gump/public/workspace/slf4j/jul-to-slf4j/target/jul-to-slf4j-1.5.9-SNAPSHOT.jar:/srv/gump/public/workspace/slf4j/slf4j-migrator/target/slf4j-migrator-1.5.9-SNAPSHOT.jar:/srv/gump/public/workspace/lucene-java/solr/dist/apache-solr-solrj-24102010.jar:/srv/gump/public/workspace/lucene-java/solr/dist/apache-solr-core-24102010.jar:/srv/gump/public/workspace/lucene-java/solr/dist/apache-solr-cell-24102010.jar:/srv/gump/public/workspace/luc
 ene-java/solr/dist/apache-solr-clustering-24102010.jar:/srv/gump/public/workspace/lucene-java/solr/dist/apache-solr-dataimporthandler-extras-24102010.jar:/srv/gump/public/workspace/lucene-java/solr/dist/apache-solr-dataimporthandler-24102010.jar:/srv/gump/public/workspace/tika/tika-core/target/tika-core-0.8-SNAPSHOT.jar:/srv/gump/public/workspace/tika/tika-parsers/target/tika-parsers-0.8-SNAPSHOT.jar:/srv/gump/public/workspace/velocity-engine/bin/velocity-24102010.jar:/srv/gump/public/workspace/velocity-engine/bin/velocity-24102010-dep.jar:/srv/gump/public/workspace/velocity-tools/velocity-tools-generic/target/velocity-tools-generic-2.1.0-SNAPSHOT.jar:/srv/gump/public/workspace/xml-commons/java/external/build/xml-apis-ext.jar
---------------------------------------------
    [junit] 13911 [main] INFO org.apache.solr.util.plugin.AbstractPluginLoader - created : org.apache.solr.analysis.EnglishPorterFilterFactory
    [junit] 13912 [main] INFO org.apache.solr.util.plugin.AbstractPluginLoader - created : org.apache.solr.analysis.RemoveDuplicatesTokenFilterFactory
    [junit] 13912 [main] INFO org.apache.solr.util.plugin.AbstractPluginLoader - created dedup: org.apache.solr.schema.TextField
    [junit] 13925 [main] INFO org.apache.solr.util.plugin.AbstractPluginLoader - created unstored: org.apache.solr.schema.StrField
    [junit] 13929 [main] INFO org.apache.solr.util.plugin.AbstractPluginLoader - created : org.apache.solr.analysis.WhitespaceTokenizerFactory
    [junit] 13930 [main] INFO org.apache.solr.util.plugin.AbstractPluginLoader - created : org.apache.solr.analysis.LowerCaseFilterFactory
    [junit] 13930 [main] INFO org.apache.solr.util.plugin.AbstractPluginLoader - created textgap: org.apache.solr.schema.TextField
    [junit] 13933 [main] INFO org.apache.solr.util.plugin.AbstractPluginLoader - created uuid: org.apache.solr.schema.UUIDField
    [junit] 13937 [main] INFO org.apache.solr.util.plugin.AbstractPluginLoader - created ignored: org.apache.solr.schema.StrField
    [junit] 13939 [main] INFO org.apache.solr.util.plugin.AbstractPluginLoader - created random: org.apache.solr.schema.RandomSortField
    [junit] 13941 [main] INFO org.apache.solr.util.plugin.AbstractPluginLoader - created xy: org.apache.solr.schema.PointType
    [junit] 13944 [main] INFO org.apache.solr.util.plugin.AbstractPluginLoader - created xyd: org.apache.solr.schema.PointType
    [junit] 13946 [main] INFO org.apache.solr.util.plugin.AbstractPluginLoader - created geohash: org.apache.solr.schema.GeoHashField
    [junit] 13949 [main] INFO org.apache.solr.util.plugin.AbstractPluginLoader - created point: org.apache.solr.schema.PointType
    [junit] 13951 [main] INFO org.apache.solr.util.plugin.AbstractPluginLoader - created location: org.apache.solr.schema.LatLonType
    [junit] 13974 [main] INFO org.apache.solr.schema.IndexSchema - default search field is text
    [junit] 13976 [main] INFO org.apache.solr.schema.IndexSchema - unique key field: id
    [junit] 13978 [main] WARN org.apache.solr.schema.IndexSchema - Field text is not multivalued and destination for multiple copyFields (2)
    [junit] 14005 [main] INFO org.apache.solr.util.AbstractSolrTestCase - ####TEARDOWN_START testIndexingPerf
    [junit] NOTE: all tests run in this JVM:
    [junit] [LengthFilterTest, TestCapitalizationFilterFactory, TestChineseTokenizerFactory, TestDictionaryCompoundWordTokenFilterFactory, TestKeepFilterFactory, TestLuceneMatchVersion, TestPatternReplaceCharFilterFactory, TestStopFilterFactory, SolrQueryTest, MultiCoreEmbeddedTest, TestSpellCheckResponse, ContentStreamTest, IndexReaderFactoryTest, TestBadConfig, TestLegacyMergeSchedulerPolicyConfig, MoreLikeThisHandlerTest, TermsComponentTest, TestFaceting, BadIndexSchemaTest, DateFieldTest, TestExtendedDismaxParser, TestSolrQueryParser, NoCacheHeaderTest, DirectSolrSpellCheckerTest, TestIndexingPerformance]
    [junit] ------------- ---------------- ---------------
    [junit] TEST org.apache.solr.update.TestIndexingPerformance FAILED
    [junit] Testsuite: org.apache.solr.util.TestOpenBitSet
    [junit] Tests run: 3, Failures: 0, Errors: 0, Time elapsed: 1.3 sec
    [junit] 
    [junit] 15495 [Shutdown] INFO org.mortbay.log - Shutdown hook executing
    [junit] 15495 [Shutdown] INFO org.mortbay.log - Shutdown hook complete
    [junit] Tests FAILED

BUILD FAILED
/srv/gump/public/workspace/lucene-java/solr/build.xml:386: 
The following error occurred while executing this line:
/srv/gump/public/workspace/lucene-java/solr/build.xml:482: Tests failed!
The following error occurred while executing this line:
/srv/gump/public/workspace/lucene-java/solr/build.xml:482: Tests failed!
The following error occurred while executing this line:
/srv/gump/public/workspace/lucene-java/solr/build.xml:482: Tests failed!
The following error occurred while executing this line:
/srv/gump/public/workspace/lucene-java/solr/build.xml:482: Tests failed!
The following error occurred while executing this line:
/srv/gump/public/workspace/lucene-java/solr/build.xml:482: Tests failed!
The following error occurred while executing this line:
/srv/gump/public/workspace/lucene-java/solr/build.xml:482: Tests failed!
The following error occurred while executing this line:
/srv/gump/public/workspace/lucene-java/solr/build.xml:482: Tests failed!
The following error occurred while executing this line:
/srv/gump/public/workspace/lucene-java/solr/build.xml:482: Tests failed!

Total time: 2 minutes 26 seconds
---------------------------------------------

To subscribe to this information via syndicated feeds:
- RSS: http://vmgump.apache.org/gump/public/lucene-java/solr-test/rss.xml
- Atom: http://vmgump.apache.org/gump/public/lucene-java/solr-test/atom.xml

============================== Gump Tracking Only ===
Produced by Gump version 2.3.
Gump Run 10000024102010, vmgump.apache.org:vmgump:10000024102010
Gump E-mail Identifier (unique within run) #22.

*********************************************************** G U M P
[GUMP@vmgump]: Project commons-jelly-tags-ant-test (in module commons-jelly) failed
To whom it may engage...
        
This is an automated request, but not an unsolicited one. For 
more information please visit http://gump.apache.org/nagged.html, 
and/or contact the folk at general@gump.apache.org.

Project commons-jelly-tags-ant-test has an issue affecting its community integration.
This issue affects 1 projects.
The current state of this project is 'Failed', with reason 'Build Failed'.
For reference only, the following projects are affected by this:
    - commons-jelly-tags-ant-test :  Commons Jelly


Full details are available at:
    http://vmgump.apache.org/gump/public/commons-jelly/commons-jelly-tags-ant-test/index.html

That said, some information snippets are provided here.

The following annotations (debug/informational/warning/error messages) were provided:
 -DEBUG- Dependency on ant exists, no need to add for property maven.jar.ant-optional.
 -DEBUG- Dependency on xml-xerces exists, no need to add for property maven.jar.xerces.
 -DEBUG- Dependency on commons-jexl-1.x exists, no need to add for property maven.jar.commons-jexl.
 -WARNING- Overriding Maven properties: [/srv/gump/public/workspace/commons-jelly/jelly-tags/ant/build.properties]
 -DEBUG- (Gump generated) Maven Properties in: /srv/gump/public/workspace/commons-jelly/jelly-tags/ant/build.properties
 -INFO- Failed with reason build failed
 -DEBUG- Maven POM in: /srv/gump/public/workspace/commons-jelly/jelly-tags/ant/project.xml
 -DEBUG- Maven project properties in: /srv/gump/public/workspace/commons-jelly/jelly-tags/ant/project.properties
 -INFO- Project Reports in: /srv/gump/public/workspace/commons-jelly/jelly-tags/ant/target/test-reports



The following work was performed:
http://vmgump.apache.org/gump/public/commons-jelly/commons-jelly-tags-ant-test/gump_work/build_commons-jelly_commons-jelly-tags-ant-test.html
Work Name: build_commons-jelly_commons-jelly-tags-ant-test (Type: Build)
Work ended in a state of : Failed
Elapsed: 12 secs
Command Line: maven --offline jar 
[Working Directory: /srv/gump/public/workspace/commons-jelly/jelly-tags/ant]
---------------------------------------------
    [junit] Actual expression: (${foo4.1})=(null)
    [junit] 	at org.apache.commons.jelly.tags.junit.AssertTagSupport.fail(AssertTagSupport.java:44)
    [junit] 	at org.apache.commons.jelly.tags.junit.AssertTagSupport.failNotEquals(AssertTagSupport.java:77)
    [junit] 	at org.apache.commons.jelly.tags.junit.AssertEqualsTag.doTag(AssertEqualsTag.java:56)
    [junit] 	at org.apache.commons.jelly.impl.TagScript.run(TagScript.java:267)
    [junit] 	at org.apache.commons.jelly.impl.ScriptBlock.run(ScriptBlock.java:96)
    [junit] 	at org.apache.commons.jelly.tags.junit.CaseTag$1.runTest(CaseTag.java:60)
    [junit] 
    [junit] 
    [junit] Testcase: startUpReadWrite(org.apache.commons.jelly.tags.junit.CaseTag$1):	Caused an ERROR
    [junit] file:/srv/gump/public/workspace/commons-jelly/jelly-tags/ant/target/test-classes/org/apache/commons/jelly/ant/suite.jelly:98:5: <test:assertEquals> file:/srv/gump/public/workspace/commons-jelly/jelly-tags/ant/target/test-classes/org/apache/commons/jelly/ant/suite.jelly:98:5: <test:assertEquals>  expected:[bar5] but was:[null]
    [junit] Expected expression: (bar5)=(bar5)
    [junit] Actual expression: (${foo5.1})=(null)
    [junit] org.apache.commons.jelly.JellyTagException: file:/srv/gump/public/workspace/commons-jelly/jelly-tags/ant/target/test-classes/org/apache/commons/jelly/ant/suite.jelly:98:5: <test:assertEquals> file:/srv/gump/public/workspace/commons-jelly/jelly-tags/ant/target/test-classes/org/apache/commons/jelly/ant/suite.jelly:98:5: <test:assertEquals>  expected:[bar5] but was:[null]
    [junit] Expected expression: (bar5)=(bar5)
    [junit] Actual expression: (${foo5.1})=(null)
    [junit] 	at org.apache.commons.jelly.impl.TagScript.handleException(TagScript.java:732)
    [junit] 	at org.apache.commons.jelly.impl.TagScript.run(TagScript.java:287)
    [junit] 	at org.apache.commons.jelly.impl.ScriptBlock.run(ScriptBlock.java:96)
    [junit] 	at org.apache.commons.jelly.tags.junit.CaseTag$1.runTest(CaseTag.java:60)
    [junit] Caused by: org.apache.commons.jelly.tags.junit.JellyAssertionFailedError: file:/srv/gump/public/workspace/commons-jelly/jelly-tags/ant/target/test-classes/org/apache/commons/jelly/ant/suite.jelly:98:5: <test:assertEquals>  expected:[bar5] but was:[null]
    [junit] Expected expression: (bar5)=(bar5)
    [junit] Actual expression: (${foo5.1})=(null)
    [junit] 	at org.apache.commons.jelly.tags.junit.AssertTagSupport.fail(AssertTagSupport.java:44)
    [junit] 	at org.apache.commons.jelly.tags.junit.AssertTagSupport.failNotEquals(AssertTagSupport.java:77)
    [junit] 	at org.apache.commons.jelly.tags.junit.AssertEqualsTag.doTag(AssertEqualsTag.java:56)
    [junit] 	at org.apache.commons.jelly.impl.TagScript.run(TagScript.java:267)
    [junit] Root cause
    [junit] org.apache.commons.jelly.tags.junit.JellyAssertionFailedError: file:/srv/gump/public/workspace/commons-jelly/jelly-tags/ant/target/test-classes/org/apache/commons/jelly/ant/suite.jelly:98:5: <test:assertEquals>  expected:[bar5] but was:[null]
    [junit] Expected expression: (bar5)=(bar5)
    [junit] Actual expression: (${foo5.1})=(null)
    [junit] 	at org.apache.commons.jelly.tags.junit.AssertTagSupport.fail(AssertTagSupport.java:44)
    [junit] 	at org.apache.commons.jelly.tags.junit.AssertTagSupport.failNotEquals(AssertTagSupport.java:77)
    [junit] 	at org.apache.commons.jelly.tags.junit.AssertEqualsTag.doTag(AssertEqualsTag.java:56)
    [junit] 	at org.apache.commons.jelly.impl.TagScript.run(TagScript.java:267)
    [junit] 	at org.apache.commons.jelly.impl.ScriptBlock.run(ScriptBlock.java:96)
    [junit] 	at org.apache.commons.jelly.tags.junit.CaseTag$1.runTest(CaseTag.java:60)
    [junit] 
    [junit] 
    [junit] [ERROR] TEST org.apache.commons.jelly.ant.TestJelly FAILED

BUILD FAILED
File...... /home/gump/.maven/cache/maven-test-plugin-1.6.2/plugin.jelly
Element... fail
Line...... 181
Column.... 54
There were test failures.
Total time: 12 seconds
Finished at: Sun Oct 24 10:32:37 UTC 2010

---------------------------------------------

To subscribe to this information via syndicated feeds:
- RSS: http://vmgump.apache.org/gump/public/commons-jelly/commons-jelly-tags-ant-test/rss.xml
- Atom: http://vmgump.apache.org/gump/public/commons-jelly/commons-jelly-tags-ant-test/atom.xml

============================== Gump Tracking Only ===
Produced by Gump version 2.3.
Gump Run 10000024102010, vmgump.apache.org:vmgump:10000024102010
Gump E-mail Identifier (unique within run) #24.

*********************************************************** G U M P
[GUMP@vmgump]: Project portals-pluto-portal-1.0 (in module portals-pluto-1.0) failed
To whom it may engage...
        
This is an automated request, but not an unsolicited one. For 
more information please visit http://gump.apache.org/nagged.html, 
and/or contact the folk at general@gump.apache.org.

Project portals-pluto-portal-1.0 has an issue affecting its community integration.
This issue affects 1 projects,
 and has been outstanding for 37 runs.
The current state of this project is 'Failed', with reason 'Build Failed'.
For reference only, the following projects are affected by this:
    - portals-pluto-portal-1.0 :  JSR168 Container


Full details are available at:
    http://vmgump.apache.org/gump/public/portals-pluto-1.0/portals-pluto-portal-1.0/index.html

That said, some information snippets are provided here.

The following annotations (debug/informational/warning/error messages) were provided:
 -DEBUG- Dependency on ant exists, no need to add for property env.ANT_HOME.
 -INFO- Failed with reason build failed
 -INFO- Failed to extract fallback artifacts from Gump Repository



The following work was performed:
http://vmgump.apache.org/gump/public/portals-pluto-1.0/portals-pluto-portal-1.0/gump_work/build_portals-pluto-1.0_portals-pluto-portal-1.0.html
Work Name: build_portals-pluto-1.0_portals-pluto-portal-1.0 (Type: Build)
Work ended in a state of : Failed
Elapsed: 17 secs
Command Line: /usr/lib/jvm/java-6-openjdk/bin/java -Djava.awt.headless=true -Xbootclasspath/p:/srv/gump/public/workspace/xml-commons/java/external/build/xml-apis.jar:/srv/gump/public/workspace/xml-xerces2/build/xercesImpl.jar org.apache.tools.ant.Main -Dgump.merge=/srv/gump/public/gump/work/merge.xml -Dbuild.sysclasspath=only -Denv.ANT_HOME=/srv/gump/public/workspace/ant/dist -Dversion=24102010 -Dfinal.portal.name=pluto-portal-impl-24102010 all 
[Working Directory: /srv/gump/public/workspace/portals-pluto-1.0]
CLASSPATH: /usr/lib/jvm/java-6-openjdk/lib/tools.jar:/srv/gump/public/workspace/portals-pluto-1.0/build/ant/lib/ForeachTask.jar:/srv/gump/public/workspace/ant/dist/lib/ant.jar:/srv/gump/public/workspace/ant/dist/lib/ant-launcher.jar:/srv/gump/public/workspace/ant/dist/lib/ant-jmf.jar:/srv/gump/public/workspace/ant/dist/lib/ant-junit.jar:/srv/gump/public/workspace/ant/dist/lib/ant-swing.jar:/srv/gump/public/workspace/ant/dist/lib/ant-apache-resolver.jar:/srv/gump/public/workspace/ant/dist/lib/ant-apache-xalan2.jar:/srv/gump/packages/junit3.8.1/junit.jar:/srv/gump/public/workspace/xml-commons/java/build/resolver.jar:/srv/gump/public/workspace/castor/core/target/castor-core-1.3.2-SNAPSHOT.jar:/srv/gump/public/workspace/castor/xml/target/castor-xml-1.3.2-SNAPSHOT.jar:/srv/gump/public/workspace/castor/codegen/target/castor-codegen-1.3.2-SNAPSHOT.jar:/srv/gump/public/workspace/castor/schema/target/castor-xml-schema-1.3.2-SNAPSHOT.jar:/srv/gump/public/workspace/apache-commons/fileup
 load/target/commons-fileupload-24102010.jar:/srv/gump/public/workspace/apache-commons/logging/target/commons-logging-24102010.jar:/srv/gump/public/workspace/apache-commons/logging/target/commons-logging-api-24102010.jar:/srv/gump/public/workspace/junit/dist/junit-24102010.jar:/srv/gump/public/workspace/junit/dist/junit-dep-24102010.jar:/srv/gump/public/workspace/jakarta-regexp/build/jakarta-regexp-24102010.jar:/srv/gump/public/workspace/jakarta-servletapi-5/jsr154/dist/lib/servlet-api.jar:/srv/gump/public/workspace/jakarta-servletapi-5/jsr152/dist/lib/jsp-api.jar:/srv/gump/public/workspace/portals-pluto-1.0/api/target/portlet-api-1.0.jar:/srv/gump/public/workspace/portals-pluto-1.0/container/target/pluto-1.0.jar:/srv/gump/public/workspace/portals-pluto-1.0/descriptors/target/pluto-descriptors-1.0.jar:/srv/gump/public/workspace/xml-commons/java/external/build/xml-apis-ext.jar
---------------------------------------------

compile-tests:

internal-test:

test:

jar:

portal:

init:
    [mkdir] Created dir: /srv/gump/public/workspace/portals-pluto-1.0/portal/target/lib

get-deps:

compile:
    [mkdir] Created dir: /srv/gump/public/workspace/portals-pluto-1.0/portal/target/classes
    [javac] Compiling 149 source files to /srv/gump/public/workspace/portals-pluto-1.0/portal/target/classes
    [javac] /srv/gump/public/workspace/portals-pluto-1.0/portal/src/java/org/apache/pluto/portalImpl/Deploy.java:62: warning: [deprecation] org.apache.xml.serialize.OutputFormat in org.apache.xml.serialize has been deprecated
    [javac] import org.apache.xml.serialize.OutputFormat;
    [javac]                                ^
    [javac] /srv/gump/public/workspace/portals-pluto-1.0/portal/src/java/org/apache/pluto/portalImpl/Deploy.java:63: warning: [deprecation] org.apache.xml.serialize.XMLSerializer in org.apache.xml.serialize has been deprecated
    [javac] import org.apache.xml.serialize.XMLSerializer;
    [javac]                                ^
    [javac] /srv/gump/public/workspace/portals-pluto-1.0/portal/src/java/org/apache/pluto/portalImpl/core/PortalURL.java:179: warning: [deprecation] encode(java.lang.String) in java.net.URLEncoder has been deprecated
    [javac]         value = URLEncoder.encode(value);
    [javac]                           ^
    [javac] /srv/gump/public/workspace/portals-pluto-1.0/portal/src/java/org/apache/pluto/portalImpl/services/portletdefinitionregistry/PortletDefinitionRegistryServiceContextImpl.java:113: exception java.io.IOException is never thrown in body of corresponding try statement
    [javac]         } catch (IOException e) {
    [javac]           ^
    [javac] /srv/gump/public/workspace/portals-pluto-1.0/portal/src/java/org/apache/pluto/portalImpl/services/portletdefinitionregistry/PortletDefinitionRegistryServiceContextImpl.java:115: exception org.exolab.castor.mapping.MappingException is never thrown in body of corresponding try statement
    [javac]         } catch (MappingException e) {
    [javac]           ^
    [javac] /srv/gump/public/workspace/portals-pluto-1.0/portal/src/java/org/apache/pluto/portalImpl/services/portletdefinitionregistry/PortletDefinitionRegistryServiceFileImpl.java:233: warning: [deprecation] toURL() in java.io.File has been deprecated
    [javac]             source.setSystemId(portletXml.toURL().toExternalForm());
    [javac]                                          ^
    [javac] /srv/gump/public/workspace/portals-pluto-1.0/portal/src/java/org/apache/pluto/portlet/admin/services/DeployWarService.java:165: warning: [deprecation] org.apache.pluto.portalImpl.Deploy in org.apache.pluto.portalImpl has been deprecated
    [javac] 		            org.apache.pluto.portalImpl.Deploy.main(args);
    [javac] 		                                       ^
    [javac] Note: Some input files use unchecked or unsafe operations.
    [javac] Note: Recompile with -Xlint:unchecked for details.
    [javac] 2 errors
    [javac] 5 warnings

BUILD FAILED
/srv/gump/public/workspace/portals-pluto-1.0/build.xml:51: The following error occurred while executing this line:
/srv/gump/public/workspace/portals-pluto-1.0/portal/build.xml:50: Compile failed; see the compiler error output for details.

Total time: 17 seconds
---------------------------------------------

To subscribe to this information via syndicated feeds:
- RSS: http://vmgump.apache.org/gump/public/portals-pluto-1.0/portals-pluto-portal-1.0/rss.xml
- Atom: http://vmgump.apache.org/gump/public/portals-pluto-1.0/portals-pluto-portal-1.0/atom.xml

============================== Gump Tracking Only ===
Produced by Gump version 2.3.
Gump Run 10000024102010, vmgump.apache.org:vmgump:10000024102010
Gump E-mail Identifier (unique within run) #25.

*********************************************************** G U M P
[GUMP@vmgump]: Project cocoon22-flowscript-impl (in module cocoon) failed
To whom it may engage...
        
This is an automated request, but not an unsolicited one. For 
more information please visit http://gump.apache.org/nagged.html, 
and/or contact the folk at general@gump.apache.org.

Project cocoon22-flowscript-impl has an issue affecting its community integration.
This issue affects 3 projects,
 and has been outstanding for 37 runs.
The current state of this project is 'Failed', with reason 'Build Failed'.
For reference only, the following projects are affected by this:
    - cocoon22-flowscript-impl :  Java XML Framework
    - lenya-core-api :  Content Management System
    - lenya-reactor :  Content Management System


Full details are available at:
    http://vmgump.apache.org/gump/public/cocoon/cocoon22-flowscript-impl/index.html

That said, some information snippets are provided here.

The following annotations (debug/informational/warning/error messages) were provided:
 -DEBUG- (Gump generated) Maven2 Settings in: /srv/gump/public/workspace/cocoon/blocks/cocoon-flowscript/cocoon-flowscript-impl/gump_mvn_settings.xml
 -INFO- Failed with reason build failed
 -DEBUG- Maven POM in: /srv/gump/public/workspace/cocoon/blocks/cocoon-flowscript/cocoon-flowscript-impl/pom.xml
 -INFO- Failed to extract fallback artifacts from Gump Repository



The following work was performed:
http://vmgump.apache.org/gump/public/cocoon/cocoon22-flowscript-impl/gump_work/build_cocoon_cocoon22-flowscript-impl.html
Work Name: build_cocoon_cocoon22-flowscript-impl (Type: Build)
Work ended in a state of : Failed
Elapsed: 17 secs
Command Line: mvn --batch-mode --settings /srv/gump/public/workspace/cocoon/blocks/cocoon-flowscript/cocoon-flowscript-impl/gump_mvn_settings.xml install 
[Working Directory: /srv/gump/public/workspace/cocoon/blocks/cocoon-flowscript/cocoon-flowscript-impl]
---------------------------------------------
[INFO] Scanning for projects...
[INFO] ------------------------------------------------------------------------
[INFO] Building Cocoon Flowscript Block Implementation
[INFO]    task-segment: [install]
[INFO] ------------------------------------------------------------------------
Downloading: http://localhost:8192/maven2/org/apache/cocoon/cocoon-maven-plugin/1.0.0-M1/cocoon-maven-plugin-1.0.0-M1.pom
4K downloaded  (cocoon-maven-plugin-1.0.0-M1.pom)
Downloading: http://localhost:8192/maven2/org/apache/cocoon/cocoon-maven-plugin/1.0.0-M1/cocoon-maven-plugin-1.0.0-M1.jar

[INFO] [enforcer:enforce-once {execution: enforce-maven}]
[INFO] [resources:resources {execution: default-resources}]
[WARNING] Using platform encoding (UTF-8 actually) to copy filtered resources, i.e. build is platform dependent!
[INFO] Copying 5 resources
[INFO] Copying 2 resources to META-INF
Downloading: http://localhost:8192/maven2/org/apache/cocoon/cocoon-expression-language-api/1.0.0/cocoon-expression-language-api-1.0.0.pom

Downloading: http://localhost:8192/maven2/org/apache/cocoon/cocoon-expression-language-api/1.0.0/cocoon-expression-language-api-1.0.0.jar
11K downloaded  (cocoon-expression-language-api-1.0.0.jar)
[INFO] [compiler:compile {execution: default-compile}]
[INFO] Compiling 20 source files to /srv/gump/public/workspace/cocoon/blocks/cocoon-flowscript/cocoon-flowscript-impl/target/classes
[INFO] ------------------------------------------------------------------------
[ERROR] BUILD FAILURE
[INFO] ------------------------------------------------------------------------
[INFO] Compilation failure
/srv/gump/public/workspace/cocoon/blocks/cocoon-flowscript/cocoon-flowscript-impl/src/main/java/org/apache/cocoon/components/flow/javascript/ScriptablePropertyPointer.java:[163,19] escape(java.lang.String) in org.apache.cocoon.components.flow.javascript.ScriptablePropertyPointer cannot override escape(java.lang.String) in org.apache.commons.jxpath.ri.model.NodePointer; attempting to assign weaker access privileges; was protected


[INFO] ------------------------------------------------------------------------
[INFO] For more information, run Maven with the -e switch
[INFO] ------------------------------------------------------------------------
[INFO] Total time: 16 seconds
[INFO] Finished at: Sun Oct 24 11:02:26 UTC 2010
[INFO] Final Memory: 51M/122M
[INFO] ------------------------------------------------------------------------
---------------------------------------------

To subscribe to this information via syndicated feeds:
- RSS: http://vmgump.apache.org/gump/public/cocoon/cocoon22-flowscript-impl/rss.xml
- Atom: http://vmgump.apache.org/gump/public/cocoon/cocoon22-flowscript-impl/atom.xml

============================== Gump Tracking Only ===
Produced by Gump version 2.3.
Gump Run 10000024102010, vmgump.apache.org:vmgump:10000024102010
Gump E-mail Identifier (unique within run) #27.

*********************************************************** G U M P
[GUMP@vmgump]: Project tapestry (in module tapestry) failed
To whom it may engage...
        
This is an automated request, but not an unsolicited one. For 
more information please visit http://gump.apache.org/nagged.html, 
and/or contact the folk at general@gump.apache.org.

Project tapestry has an issue affecting its community integration.
This issue affects 1 projects,
 and has been outstanding for 142 runs.
The current state of this project is 'Failed', with reason 'Build Failed'.
For reference only, the following projects are affected by this:
    - tapestry :  Component-based web application framework organized around i...


Full details are available at:
    http://vmgump.apache.org/gump/public/tapestry/tapestry/index.html

That said, some information snippets are provided here.

The following annotations (debug/informational/warning/error messages) were provided:
 -DEBUG- (Gump generated) Maven2 Settings in: /srv/gump/public/workspace/tapestry/gump_mvn_settings.xml
 -INFO- Failed with reason build failed
 -DEBUG- Maven POM in: /srv/gump/public/workspace/tapestry/pom.xml
 -INFO- Failed to extract fallback artifacts from Gump Repository



The following work was performed:
http://vmgump.apache.org/gump/public/tapestry/tapestry/gump_work/build_tapestry_tapestry.html
Work Name: build_tapestry_tapestry (Type: Build)
Work ended in a state of : Failed
Elapsed: 4 mins 2 secs
Command Line: mvn --batch-mode -DskipTests=true --settings /srv/gump/public/workspace/tapestry/gump_mvn_settings.xml package 
[Working Directory: /srv/gump/public/workspace/tapestry]
---------------------------------------------
Downloading: http://localhost:8192/maven2/org/antlr/antlr/3.1.1/antlr-3.1.1.jar

Downloading: http://antlr.org/antlr-snapshot/org/antlr/stringtemplate/3.2/stringtemplate-3.2.jar
[INFO] Unable to find resource 'org.antlr:stringtemplate:jar:3.2' in repository antlr-snapshot (http://antlr.org/antlr-snapshot)
Downloading: http://localhost:8192/maven2/org/antlr/stringtemplate/3.2/stringtemplate-3.2.jar

[INFO] [antlr3:antlr {execution: default}]
org/apache/tapestry5/internal/antlr/PropertyExpressionLexer.g
org/apache/tapestry5/internal/antlr/PropertyExpressionParser.g
Downloading: http://localhost:8192/maven2/org/antlr/antlr-runtime/3.1.1/antlr-runtime-3.1.1.pom

Downloading: http://localhost:8192/maven2/org/codehaus/groovy/groovy-all/1.7.4/groovy-all-1.7.4.pom

Downloading: http://localhost:8192/maven2/org/antlr/antlr-runtime/3.1.1/antlr-runtime-3.1.1.jar
Downloading: http://localhost:8192/maven2/org/codehaus/groovy/groovy-all/1.7.4/groovy-all-1.7.4.jar


[INFO] [remote-resources:process {execution: default}]
[INFO] [resources:resources {execution: default-resources}]
[INFO] Using 'UTF-8' encoding to copy filtered resources.
[INFO] Copying 6 resources
[INFO] Copying 178 resources
[INFO] Copying 3 resources
[INFO] [compiler:compile {execution: default-compile}]
[INFO] Compiling 911 source files to /srv/gump/public/workspace/tapestry/tapestry-core/target/classes
[INFO] ------------------------------------------------------------------------
[ERROR] BUILD FAILURE
[INFO] ------------------------------------------------------------------------
[INFO] Compilation failure

/srv/gump/public/workspace/tapestry/tapestry-core/src/main/java/org/apache/tapestry5/internal/transform/ComponentWorker.java:[124,20] setPublishedParameters(java.util.List<java.lang.String>) in org.apache.tapestry5.model.MutableEmbeddedComponentModel cannot be applied to (java.util.List<java.lang.Object>)

/srv/gump/public/workspace/tapestry/tapestry-core/src/main/java/org/apache/tapestry5/internal/services/MarkupWriterImpl.java:[264,63] incompatible types
found   : java.lang.Object
required: org.apache.tapestry5.MarkupWriterListener

/srv/gump/public/workspace/tapestry/tapestry-core/src/main/java/org/apache/tapestry5/internal/services/MarkupWriterImpl.java:[279,63] incompatible types
found   : java.lang.Object
required: org.apache.tapestry5.MarkupWriterListener

/srv/gump/public/workspace/tapestry/tapestry-core/src/main/java/org/apache/tapestry5/internal/services/FieldValidatorSourceImpl.java:[83,42] expandMacros(java.util.List<org.apache.tapestry5.internal.services.ValidatorSpecification>) in org.apache.tapestry5.internal.services.FieldValidatorSourceImpl cannot be applied to (java.util.List<java.lang.Object>)


[INFO] ------------------------------------------------------------------------
[INFO] For more information, run Maven with the -e switch
[INFO] ------------------------------------------------------------------------
[INFO] Total time: 3 minutes 58 seconds
[INFO] Finished at: Sun Oct 24 11:09:39 UTC 2010
[INFO] Final Memory: 129M/313M
[INFO] ------------------------------------------------------------------------
---------------------------------------------

To subscribe to this information via syndicated feeds:
- RSS: http://vmgump.apache.org/gump/public/tapestry/tapestry/rss.xml
- Atom: http://vmgump.apache.org/gump/public/tapestry/tapestry/atom.xml

============================== Gump Tracking Only ===
Produced by Gump version 2.3.
Gump Run 10000024102010, vmgump.apache.org:vmgump:10000024102010
Gump E-mail Identifier (unique within run) #28.

*********************************************************** G U M P
[GUMP@vmgump]: Project cocoon22-reactor (in module cocoon) failed
To whom it may engage...
        
This is an automated request, but not an unsolicited one. For 
more information please visit http://gump.apache.org/nagged.html, 
and/or contact the folk at general@gump.apache.org.

Project cocoon22-reactor has an issue affecting its community integration.
This issue affects 1 projects,
 and has been outstanding for 188 runs.
The current state of this project is 'Failed', with reason 'Build Failed'.
For reference only, the following projects are affected by this:
    - cocoon22-reactor :  Java XML Framework


Full details are available at:
    http://vmgump.apache.org/gump/public/cocoon/cocoon22-reactor/index.html

That said, some information snippets are provided here.

The following annotations (debug/informational/warning/error messages) were provided:
 -INFO- Optional dependency htmlunit failed with reason build failed
 -INFO- Optional dependency cocoon22-flowscript-impl failed with reason build failed
 -INFO- Optional dependency xml-fop prerequisite failed with reason build failed
 -INFO- Optional dependency xml-batik failed with reason build failed
 -DEBUG- (Gump generated) Maven2 Settings in: /srv/gump/public/workspace/cocoon/gump_mvn_settings.xml
 -INFO- Failed with reason build failed
 -DEBUG- Maven POM in: /srv/gump/public/workspace/cocoon/pom.xml



The following work was performed:
http://vmgump.apache.org/gump/public/cocoon/cocoon22-reactor/gump_work/build_cocoon_cocoon22-reactor.html
Work Name: build_cocoon_cocoon22-reactor (Type: Build)
Work ended in a state of : Failed
Elapsed: 1 min 18 secs
Command Line: mvn --batch-mode --settings /srv/gump/public/workspace/cocoon/gump_mvn_settings.xml package 
[Working Directory: /srv/gump/public/workspace/cocoon]
---------------------------------------------
8) daisy:daisy-htmlcleaner:jar:1.5-dev

  Try downloading the file manually from the project website.

  Then, install it using the command: 
      mvn install:install-file -DgroupId=daisy -DartifactId=daisy-htmlcleaner -Dversion=1.5-dev -Dpackaging=jar -Dfile=/path/to/file

  Alternatively, if you host your own repository you can deploy the file there: 
      mvn deploy:deploy-file -DgroupId=daisy -DartifactId=daisy-htmlcleaner -Dversion=1.5-dev -Dpackaging=jar -Dfile=/path/to/file -Durl=[url] -DrepositoryId=[id]

  Path to dependency: 
  	1) org.apache.cocoon:cocoon-sitemaptags2daisy-plugin:maven-plugin:1.0.0-SNAPSHOT
  	2) daisy:daisy-htmlcleaner:jar:1.5-dev

9) daisy:daisy-util:jar:1.5-dev

  Try downloading the file manually from the project website.

  Then, install it using the command: 
      mvn install:install-file -DgroupId=daisy -DartifactId=daisy-util -Dversion=1.5-dev -Dpackaging=jar -Dfile=/path/to/file

  Alternatively, if you host your own repository you can deploy the file there: 
      mvn deploy:deploy-file -DgroupId=daisy -DartifactId=daisy-util -Dversion=1.5-dev -Dpackaging=jar -Dfile=/path/to/file -Durl=[url] -DrepositoryId=[id]

  Path to dependency: 
  	1) org.apache.cocoon:cocoon-sitemaptags2daisy-plugin:maven-plugin:1.0.0-SNAPSHOT
  	2) daisy:daisy-util:jar:1.5-dev

----------
9 required artifacts are missing.

for artifact: 
  org.apache.cocoon:cocoon-sitemaptags2daisy-plugin:maven-plugin:1.0.0-SNAPSHOT

from the specified remote repositories:
  gump-central (http://localhost:8192/maven2),
  maven-snapshot (http://snapshots.maven.codehaus.org/maven2/),
  cocoondev (http://cocoondev.org/repository),
  gump-apache.snapshots (http://localhost:8192/repo/m2-snapshot-repository),
  gkossakowski-maven2 (http://people.apache.org/~gkossakowski/maven2/repository)



[INFO] ------------------------------------------------------------------------
[INFO] For more information, run Maven with the -e switch
[INFO] ------------------------------------------------------------------------
[INFO] Total time: 1 minute 16 seconds
[INFO] Finished at: Sun Oct 24 11:47:22 UTC 2010
[INFO] Final Memory: 96M/229M
[INFO] ------------------------------------------------------------------------
---------------------------------------------

To subscribe to this information via syndicated feeds:
- RSS: http://vmgump.apache.org/gump/public/cocoon/cocoon22-reactor/rss.xml
- Atom: http://vmgump.apache.org/gump/public/cocoon/cocoon22-reactor/atom.xml

============================== Gump Tracking Only ===
Produced by Gump version 2.3.
Gump Run 10000024102010, vmgump.apache.org:vmgump:10000024102010
Gump E-mail Identifier (unique within run) #35.

*********************************************************** G U M P
[GUMP@vmgump]: Project ws-commons-axiom (in module ws-axis2-commons) failed
To whom it may engage...
        
This is an automated request, but not an unsolicited one. For 
more information please visit http://gump.apache.org/nagged.html, 
and/or contact the folk at general@gump.apache.org.

Project ws-commons-axiom has an issue affecting its community integration.
This issue affects 1 projects,
 and has been outstanding for 182 runs.
The current state of this project is 'Failed', with reason 'Build Failed'.
For reference only, the following projects are affected by this:
    - ws-commons-axiom :  Common stuff for the WS projects.


Full details are available at:
    http://vmgump.apache.org/gump/public/ws-axis2-commons/ws-commons-axiom/index.html

That said, some information snippets are provided here.

The following annotations (debug/informational/warning/error messages) were provided:
 -INFO- Optional dependency xml-batik failed with reason build failed
 -DEBUG- (Gump generated) Maven2 Settings in: /srv/gump/public/workspace/ws-axis2-commons/axiom/gump_mvn_settings.xml
 -INFO- Failed with reason build failed
 -DEBUG- Maven POM in: /srv/gump/public/workspace/ws-axis2-commons/axiom/pom.xml



The following work was performed:
http://vmgump.apache.org/gump/public/ws-axis2-commons/ws-commons-axiom/gump_work/build_ws-axis2-commons_ws-commons-axiom.html
Work Name: build_ws-axis2-commons_ws-commons-axiom (Type: Build)
Work ended in a state of : Failed
Elapsed: 6 mins 11 secs
Command Line: mvn --batch-mode --settings /srv/gump/public/workspace/ws-axis2-commons/axiom/gump_mvn_settings.xml install 
[Working Directory: /srv/gump/public/workspace/ws-axis2-commons/axiom]
---------------------------------------------

Tests in error: 
  testIdentity[0](org.apache.axiom.om.impl.jaxp.TransformerTest)
  testIdentity[1](org.apache.axiom.om.impl.jaxp.TransformerTest)
  test(org.apache.axiom.om.impl.builder.SAXOMBuilderJAXBTest)
  testStylesheet[0](org.apache.axiom.om.impl.dom.jaxp.TransformerTest)
  testIdentity[0](org.apache.axiom.om.impl.dom.jaxp.TransformerTest)
  testStylesheet[1](org.apache.axiom.om.impl.dom.jaxp.TransformerTest)
  testIdentity[1](org.apache.axiom.om.impl.dom.jaxp.TransformerTest)
  processingInstruction.xml - crimson(org.apache.axiom.om.impl.builder.SAXOMBuilderSAXParserTest)
  spaces.xml - crimson(org.apache.axiom.om.impl.builder.SAXOMBuilderSAXParserTest)
  cdata.xml - crimson(org.apache.axiom.om.impl.builder.SAXOMBuilderSAXParserTest)
  namespaces2.xml - crimson(org.apache.axiom.om.impl.builder.SAXOMBuilderSAXParserTest)
  null-namespace.xml - crimson(org.apache.axiom.om.impl.builder.SAXOMBuilderSAXParserTest)
  xml-prefix.xml - crimson(org.apache.axiom.om.impl.builder.SAXOMBuilderSAXParserTest)
  namespaces3.xml - crimson(org.apache.axiom.om.impl.builder.SAXOMBuilderSAXParserTest)
  masked-namespace-declaration.xml - crimson(org.apache.axiom.om.impl.builder.SAXOMBuilderSAXParserTest)
  test.xml - crimson(org.apache.axiom.om.impl.builder.SAXOMBuilderSAXParserTest)
  namespaces.xml - crimson(org.apache.axiom.om.impl.builder.SAXOMBuilderSAXParserTest)
  utf-8.xml - crimson(org.apache.axiom.om.impl.builder.SAXOMBuilderSAXParserTest)
  AXIS2-565.xml - crimson(org.apache.axiom.om.impl.builder.SAXOMBuilderSAXParserTest)
  processingInstruction.xml - xerces(org.apache.axiom.om.impl.builder.SAXOMBuilderSAXParserTest)
  spaces.xml - xerces(org.apache.axiom.om.impl.builder.SAXOMBuilderSAXParserTest)
  cdata.xml - xerces(org.apache.axiom.om.impl.builder.SAXOMBuilderSAXParserTest)
  namespaces2.xml - xerces(org.apache.axiom.om.impl.builder.SAXOMBuilderSAXParserTest)
  null-namespace.xml - xerces(org.apache.axiom.om.impl.builder.SAXOMBuilderSAXParserTest)
  xml-prefix.xml - xerces(org.apache.axiom.om.impl.builder.SAXOMBuilderSAXParserTest)
  namespaces3.xml - xerces(org.apache.axiom.om.impl.builder.SAXOMBuilderSAXParserTest)
  masked-namespace-declaration.xml - xerces(org.apache.axiom.om.impl.builder.SAXOMBuilderSAXParserTest)
  test.xml - xerces(org.apache.axiom.om.impl.builder.SAXOMBuilderSAXParserTest)
  namespaces.xml - xerces(org.apache.axiom.om.impl.builder.SAXOMBuilderSAXParserTest)
  utf-8.xml - xerces(org.apache.axiom.om.impl.builder.SAXOMBuilderSAXParserTest)
  AXIS2-565.xml - xerces(org.apache.axiom.om.impl.builder.SAXOMBuilderSAXParserTest)
  test(org.apache.axiom.om.impl.builder.SAXOMBuilderXMLBeansTest)

Tests run: 38, Failures: 0, Errors: 32, Skipped: 0

[INFO] ------------------------------------------------------------------------
[ERROR] BUILD FAILURE
[INFO] ------------------------------------------------------------------------
[INFO] There are test failures.

Please refer to /srv/gump/public/workspace/ws-axis2-commons/axiom/modules/axiom-integration/target/surefire-reports for the individual test results.
[INFO] ------------------------------------------------------------------------
[INFO] For more information, run Maven with the -e switch
[INFO] ------------------------------------------------------------------------
[INFO] Total time: 6 minutes 9 seconds
[INFO] Finished at: Sun Oct 24 11:54:26 UTC 2010
[INFO] Final Memory: 105M/251M
[INFO] ------------------------------------------------------------------------
---------------------------------------------

To subscribe to this information via syndicated feeds:
- RSS: http://vmgump.apache.org/gump/public/ws-axis2-commons/ws-commons-axiom/rss.xml
- Atom: http://vmgump.apache.org/gump/public/ws-axis2-commons/ws-commons-axiom/atom.xml

============================== Gump Tracking Only ===
Produced by Gump version 2.3.
Gump Run 10000024102010, vmgump.apache.org:vmgump:10000024102010
Gump E-mail Identifier (unique within run) #36.

*********************************************************** G U M P
[GUMP@vmgump]: Project ws-axis2 (in module ws-axis2) failed
To whom it may engage...
        
This is an automated request, but not an unsolicited one. For 
more information please visit http://gump.apache.org/nagged.html, 
and/or contact the folk at general@gump.apache.org.

Project ws-axis2 has an issue affecting its community integration.
This issue affects 2 projects,
 and has been outstanding for 572 runs.
The current state of this project is 'Failed', with reason 'Build Failed'.
For reference only, the following projects are affected by this:
    - ws-axis2 :  Apache Axis2 SOAP Stack
    - ws-axis2-test :  Apache Axis2 SOAP Stack


Full details are available at:
    http://vmgump.apache.org/gump/public/ws-axis2/ws-axis2/index.html

That said, some information snippets are provided here.

The following annotations (debug/informational/warning/error messages) were provided:
 -DEBUG- Sole jar output [ws-axis2-24102010] identifier set to project name
 -INFO- Optional dependency ws-commons-axiom failed with reason build failed
 -DEBUG- (Gump generated) Maven2 Settings in: /srv/gump/public/workspace/ws-axis2/gump_mvn_settings.xml
 -INFO- Failed with reason build failed
 -DEBUG- Maven POM in: /srv/gump/public/workspace/ws-axis2/pom.xml
 -INFO- Failed to extract fallback artifacts from Gump Repository



The following work was performed:
http://vmgump.apache.org/gump/public/ws-axis2/ws-axis2/gump_work/build_ws-axis2_ws-axis2.html
Work Name: build_ws-axis2_ws-axis2 (Type: Build)
Work ended in a state of : Failed
Elapsed: 2 mins 25 secs
Command Line: mvn --batch-mode -DskipTests=true --settings /srv/gump/public/workspace/ws-axis2/gump_mvn_settings.xml package 
[Working Directory: /srv/gump/public/workspace/ws-axis2]
---------------------------------------------
location: class org.apache.axis2.util.SchemaUtil

/srv/gump/public/workspace/ws-axis2/modules/kernel/src/org/apache/axis2/util/SchemaUtil.java:[52,51] cannot find symbol
symbol  : method getIncludes()
location: class org.apache.ws.commons.schema.XmlSchema

/srv/gump/public/workspace/ws-axis2/modules/kernel/src/org/apache/axis2/builder/BuilderUtil.java:[134,24] cannot find symbol
symbol  : class XmlSchemaGroupBase
location: class org.apache.axis2.builder.BuilderUtil

/srv/gump/public/workspace/ws-axis2/modules/kernel/src/org/apache/axis2/builder/BuilderUtil.java:[134,65] cannot find symbol
symbol  : class XmlSchemaGroupBase
location: class org.apache.axis2.builder.BuilderUtil

/srv/gump/public/workspace/ws-axis2/modules/kernel/src/org/apache/axis2/description/java2wsdl/DocLitBareSchemaGenerator.java:[289,32] cannot find symbol
symbol  : constructor XmlSchemaElement()
location: class org.apache.ws.commons.schema.XmlSchemaElement

/srv/gump/public/workspace/ws-axis2/modules/kernel/src/org/apache/axis2/description/java2wsdl/DocLitBareSchemaGenerator.java:[295,12] cannot find symbol
symbol  : method setQName(javax.xml.namespace.QName)
location: class org.apache.ws.commons.schema.XmlSchemaElement

/srv/gump/public/workspace/ws-axis2/modules/kernel/src/org/apache/axis2/description/java2wsdl/DocLitBareSchemaGenerator.java:[297,31] cannot find symbol
symbol  : method add(javax.xml.namespace.QName,org.apache.ws.commons.schema.XmlSchemaElement)
location: interface java.util.Map<javax.xml.namespace.QName,org.apache.ws.commons.schema.XmlSchemaElement>

/srv/gump/public/workspace/ws-axis2/modules/kernel/src/org/apache/axis2/description/java2wsdl/DocLitBareSchemaGenerator.java:[314,26] cannot find symbol
symbol  : constructor XmlSchemaComplexType(org.apache.ws.commons.schema.XmlSchema)
location: class org.apache.ws.commons.schema.XmlSchemaComplexType

/srv/gump/public/workspace/ws-axis2/modules/kernel/src/org/apache/axis2/description/java2wsdl/DocLitBareSchemaGenerator.java:[316,45] cannot find symbol
symbol  : constructor XmlSchemaElement()
location: class org.apache.ws.commons.schema.XmlSchemaElement

/srv/gump/public/workspace/ws-axis2/modules/kernel/src/org/apache/axis2/description/java2wsdl/DocLitBareSchemaGenerator.java:[319,25] cannot find symbol
symbol  : method setQName(javax.xml.namespace.QName)
location: class org.apache.ws.commons.schema.XmlSchemaElement

/srv/gump/public/workspace/ws-axis2/modules/kernel/src/org/apache/axis2/description/java2wsdl/DocLitBareSchemaGenerator.java:[321,35] cannot find symbol
symbol  : method add(javax.xml.namespace.QName,org.apache.ws.commons.schema.XmlSchemaElement)
location: interface java.util.Map<javax.xml.namespace.QName,org.apache.ws.commons.schema.XmlSchemaElement>


[INFO] ------------------------------------------------------------------------
[INFO] For more information, run Maven with the -e switch
[INFO] ------------------------------------------------------------------------
[INFO] Total time: 2 minutes 24 seconds
[INFO] Finished at: Sun Oct 24 12:49:05 UTC 2010
[INFO] Final Memory: 71M/212M
[INFO] ------------------------------------------------------------------------
---------------------------------------------

To subscribe to this information via syndicated feeds:
- RSS: http://vmgump.apache.org/gump/public/ws-axis2/ws-axis2/rss.xml
- Atom: http://vmgump.apache.org/gump/public/ws-axis2/ws-axis2/atom.xml

============================== Gump Tracking Only ===
Produced by Gump version 2.3.
Gump Run 10000024102010, vmgump.apache.org:vmgump:10000024102010
Gump E-mail Identifier (unique within run) #37.

*********************************************************** G U M P
[GUMP@vmgump]: Project apacheds-protocol-ldap (in module apacheds) failed
To whom it may engage...
        
This is an automated request, but not an unsolicited one. For 
more information please visit http://gump.apache.org/nagged.html, 
and/or contact the folk at general@gump.apache.org.

Project apacheds-protocol-ldap has an issue affecting its community integration.
This issue affects 14 projects,
 and has been outstanding for 8 runs.
The current state of this project is 'Failed', with reason 'Build Failed'.
For reference only, the following projects are affected by this:
    - apacheds-all :  Apache Directory Server
    - apacheds-core-integ :  Apache Directory Server
    - apacheds-core-integ-test :  Apache Directory Server
    - apacheds-protocol-ldap :  Apache Directory Server
    - apacheds-server-annotations :  Apache Directory Server
    - apacheds-server-config :  Apache Directory Server
    - apacheds-server-integ :  Apache Directory Server
    - apacheds-server-integ-test :  Apache Directory Server
    - apacheds-server-jndi :  Apache Directory Server
    - apacheds-server-tools :  Apache Directory Server
    - apacheds-service :  Apache Directory Server
    - apacheds-test-framework :  Apache Directory Server
    - apacheds-wrapper :  Apache Directory Server
    - syncrepl :  Apache Directory Server


Full details are available at:
    http://vmgump.apache.org/gump/public/apacheds/apacheds-protocol-ldap/index.html

That said, some information snippets are provided here.

The following annotations (debug/informational/warning/error messages) were provided:
 -DEBUG- Sole jar output [apacheds-protocol-ldap-*[0-9T].jar] identifier set to project name
 -DEBUG- (Gump generated) Maven2 Settings in: /srv/gump/public/workspace/apacheds/protocol-ldap/gump_mvn_settings.xml
 -INFO- Failed with reason build failed
 -DEBUG- Maven POM in: /srv/gump/public/workspace/apacheds/protocol-ldap/pom.xml
 -DEBUG- Extracted fallback artifacts from Gump Repository



The following work was performed:
http://vmgump.apache.org/gump/public/apacheds/apacheds-protocol-ldap/gump_work/build_apacheds_apacheds-protocol-ldap.html
Work Name: build_apacheds_apacheds-protocol-ldap (Type: Build)
Work ended in a state of : Failed
Elapsed: 3 mins 10 secs
Command Line: mvn --batch-mode --settings /srv/gump/public/workspace/apacheds/protocol-ldap/gump_mvn_settings.xml install 
[Working Directory: /srv/gump/public/workspace/apacheds/protocol-ldap]
---------------------------------------------
Downloading: http://localhost:8192/maven2/org/codehaus/plexus/plexus-components/1.1.18/plexus-components-1.1.18.pom

Downloading: http://localhost:8192/maven2/org/codehaus/plexus/plexus/2.0.7/plexus-2.0.7.pom

Downloading: http://localhost:8192/maven2/org/codehaus/plexus/plexus-compiler-manager/1.8.1/plexus-compiler-manager-1.8.1.pom

Downloading: http://localhost:8192/maven2/org/codehaus/plexus/plexus-compiler-javac/1.8.1/plexus-compiler-javac-1.8.1.pom

Downloading: http://localhost:8192/maven2/org/codehaus/plexus/plexus-compilers/1.8.1/plexus-compilers-1.8.1.pom

Downloading: http://localhost:8192/maven2/org/codehaus/plexus/plexus-compiler-api/1.8.1/plexus-compiler-api-1.8.1.jar

Downloading: http://localhost:8192/maven2/org/codehaus/plexus/plexus-compiler-manager/1.8.1/plexus-compiler-manager-1.8.1.jar

Downloading: http://localhost:8192/maven2/org/codehaus/plexus/plexus-compiler-javac/1.8.1/plexus-compiler-javac-1.8.1.jar

[INFO] [compiler:compile {execution: default-compile}]
[INFO] Compiling 63 source files to /srv/gump/public/workspace/apacheds/protocol-ldap/target/classes
[INFO] -------------------------------------------------------------
[ERROR] COMPILATION ERROR : 
[INFO] -------------------------------------------------------------
[ERROR] /srv/gump/public/workspace/apacheds/protocol-ldap/src/main/java/org/apache/directory/server/ldap/replication/ReplicationTrustManager.java:[34,36] package org.bouncycastle.jce.provider does not exist
[ERROR] /srv/gump/public/workspace/apacheds/protocol-ldap/src/main/java/org/apache/directory/server/ldap/replication/ReplicationTrustManager.java:[62,19] cannot find symbol
symbol  : class X509CertParser
location: class org.apache.directory.server.ldap.replication.ReplicationTrustManager
[ERROR] /srv/gump/public/workspace/apacheds/protocol-ldap/src/main/java/org/apache/directory/server/ldap/replication/ReplicationTrustManager.java:[62,47] cannot find symbol
symbol  : class X509CertParser
location: class org.apache.directory.server.ldap.replication.ReplicationTrustManager
[INFO] 3 errors 
[INFO] -------------------------------------------------------------
[INFO] ------------------------------------------------------------------------
[ERROR] BUILD FAILURE
[INFO] ------------------------------------------------------------------------
[INFO] Compilation failure

/srv/gump/public/workspace/apacheds/protocol-ldap/src/main/java/org/apache/directory/server/ldap/replication/ReplicationTrustManager.java:[34,36] package org.bouncycastle.jce.provider does not exist
/srv/gump/public/workspace/apacheds/protocol-ldap/src/main/java/org/apache/directory/server/ldap/replication/ReplicationTrustManager.java:[62,19] cannot find symbol
symbol  : class X509CertParser
location: class org.apache.directory.server.ldap.replication.ReplicationTrustManager
/srv/gump/public/workspace/apacheds/protocol-ldap/src/main/java/org/apache/directory/server/ldap/replication/ReplicationTrustManager.java:[62,47] cannot find symbol
symbol  : class X509CertParser
location: class org.apache.directory.server.ldap.replication.ReplicationTrustManager

[INFO] ------------------------------------------------------------------------
[INFO] For more information, run Maven with the -e switch
[INFO] ------------------------------------------------------------------------
[INFO] Total time: 3 minutes 8 seconds
[INFO] Finished at: Sun Oct 24 12:53:23 UTC 2010
[INFO] Final Memory: 38M/92M
[INFO] ------------------------------------------------------------------------
---------------------------------------------

To subscribe to this information via syndicated feeds:
- RSS: http://vmgump.apache.org/gump/public/apacheds/apacheds-protocol-ldap/rss.xml
- Atom: http://vmgump.apache.org/gump/public/apacheds/apacheds-protocol-ldap/atom.xml

============================== Gump Tracking Only ===
Produced by Gump version 2.3.
Gump Run 10000024102010, vmgump.apache.org:vmgump:10000024102010
Gump E-mail Identifier (unique within run) #38.

*********************************************************** G U M P
[GUMP@vmgump]: Project cactus-test (in module jakarta-cactus) failed
To whom it may engage...
        
This is an automated request, but not an unsolicited one. For 
more information please visit http://gump.apache.org/nagged.html, 
and/or contact the folk at general@gump.apache.org.

Project cactus-test has an issue affecting its community integration.
This issue affects 1 projects,
 and has been outstanding for 38 runs.
The current state of this project is 'Failed', with reason 'Build Failed'.
For reference only, the following projects are affected by this:
    - cactus-test :  Unit test framework for server-side java code


Full details are available at:
    http://vmgump.apache.org/gump/public/jakarta-cactus/cactus-test/index.html

That said, some information snippets are provided here.

The following annotations (debug/informational/warning/error messages) were provided:
 -WARNING- Overriding Maven2 settings: [/srv/gump/public/workspace/jakarta-cactus/gump_mvn_settings.xml]
 -DEBUG- (Gump generated) Maven2 Settings in: /srv/gump/public/workspace/jakarta-cactus/gump_mvn_settings.xml
 -INFO- Failed with reason build failed
 -DEBUG- Maven POM in: /srv/gump/public/workspace/jakarta-cactus/pom.xml
 -INFO- Project Reports in: /srv/gump/public/workspace/jakarta-cactus/build-tools/target/surefire-reports
 -WARNING- No directory [/srv/gump/public/workspace/jakarta-cactus/build-tools/target/surefire-reports]
 -INFO- Project Reports in: /srv/gump/public/workspace/jakarta-cactus/framework/framework-12-13-14/target/surefire-reports
 -INFO- Project Reports in: /srv/gump/public/workspace/jakarta-cactus/framework/framework-13-14/target/surefire-reports
 -INFO- Project Reports in: /srv/gump/public/workspace/jakarta-cactus/framework/framework-wrappers/wrapper-javaEE-12/target/surefire-reports
 -INFO- Project Reports in: /srv/gump/public/workspace/jakarta-cactus/framework/framework-wrappers/wrapper-javaEE-13/target/surefire-reports
 -WARNING- No directory [/srv/gump/public/workspace/jakarta-cactus/framework/framework-wrappers/wrapper-javaEE-13/target/surefire-reports]
 -INFO- Project Reports in: /srv/gump/public/workspace/jakarta-cactus/framework/framework-wrappers/wrapper-javaEE-14/target/surefire-reports
 -WARNING- No directory [/srv/gump/public/workspace/jakarta-cactus/framework/framework-wrappers/wrapper-javaEE-14/target/surefire-reports]
 -INFO- Project Reports in: /srv/gump/public/workspace/jakarta-cactus/integration/shared-api/target/surefire-reports
 -WARNING- No directory [/srv/gump/public/workspace/jakarta-cactus/integration/shared-api/target/surefire-reports]
 -INFO- Project Reports in: /srv/gump/public/workspace/jakarta-cactus/integration/ant/target/surefire-reports



The following work was performed:
http://vmgump.apache.org/gump/public/jakarta-cactus/cactus-test/gump_work/build_jakarta-cactus_cactus-test.html
Work Name: build_jakarta-cactus_cactus-test (Type: Build)
Work ended in a state of : Failed
Elapsed: 26 secs
Command Line: mvn --batch-mode --settings /srv/gump/public/workspace/jakarta-cactus/gump_mvn_settings.xml -P!sourcecheck test 
[Working Directory: /srv/gump/public/workspace/jakarta-cactus]
---------------------------------------------
  testSetLoginConfigAdding(org.apache.cactus.integration.ant.deployment.webapp.TestWebXml)
  testSetLoginConfigReplacing(org.apache.cactus.integration.ant.deployment.webapp.TestWebXml)
  testHasSecurityConstraintEmpty(org.apache.cactus.integration.ant.deployment.webapp.TestWebXml)
  testGetSingleSecurityConstraint(org.apache.cactus.integration.ant.deployment.webapp.TestWebXml)
  testGetMutlipleSecurityConstraints(org.apache.cactus.integration.ant.deployment.webapp.TestWebXml)
  testGetLoginConfigEmpty(org.apache.cactus.integration.ant.deployment.webapp.TestWebXml)
  testGetLoginConfig(org.apache.cactus.integration.ant.deployment.webapp.TestWebXml)
  testHasSecurityRoleEmpty(org.apache.cactus.integration.ant.deployment.webapp.TestWebXml)
  testGetServletRunAsRole(org.apache.cactus.integration.ant.deployment.webapp.TestWebXml)
  testAddServletRunAsRole(org.apache.cactus.integration.ant.deployment.webapp.TestWebXml)
  testSrcFileWithoutWebXml(org.apache.cactus.integration.ant.TestCactifyWarTask)
  testDefaultRedirectorsNoDoctype(org.apache.cactus.integration.ant.TestCactifyWarTask)
  testDefaultRedirectors22Doctype(org.apache.cactus.integration.ant.TestCactifyWarTask)
  testDefaultRedirectors23Doctype(org.apache.cactus.integration.ant.TestCactifyWarTask)
  testDefaultRedirectorsNewWar22(org.apache.cactus.integration.ant.TestCactifyWarTask)
  testDefaultRedirectorsNewWar23(org.apache.cactus.integration.ant.TestCactifyWarTask)
  testCustomServletRedirectorMapping(org.apache.cactus.integration.ant.TestCactifyWarTask)
  testCustomJspRedirectorMapping(org.apache.cactus.integration.ant.TestCactifyWarTask)
  testCustomFilterRedirectorMapping(org.apache.cactus.integration.ant.TestCactifyWarTask)
  testCustomFilterRedirectorMappingIgnored(org.apache.cactus.integration.ant.TestCactifyWarTask)
  testMultipleNamedServletRedirectors(org.apache.cactus.integration.ant.TestCactifyWarTask)
  testMultipleNamedJspRedirectors(org.apache.cactus.integration.ant.TestCactifyWarTask)
  testMultipleNamedFilterRedirectors(org.apache.cactus.integration.ant.TestCactifyWarTask)
  testSecuredServletRedirector(org.apache.cactus.integration.ant.TestCactifyWarTask)
  testLoginConfigNotOverwritten(org.apache.cactus.integration.ant.TestCactifyWarTask)
  testNoDuplicateJars(org.apache.cactus.integration.ant.TestCactifyWarTask)
  testAddWeblogicEjbRefs(org.apache.cactus.integration.ant.TestCactifyWarTask)
  testWarFileCactified(org.apache.cactus.integration.ant.TestCactusTestTask)
  testEarFileCactified(org.apache.cactus.integration.ant.TestCactusTestTask)
  testWarFileCactified(org.apache.cactus.integration.ant.TestCactusTask)
  testEarFileCactified(org.apache.cactus.integration.ant.TestCactusTask)
  testCanAddCactifiedWar(org.apache.cactus.integration.ant.TestCactifyEarTask)
  testCustomCactusWarContext(org.apache.cactus.integration.ant.TestCactifyEarTask)
  testAddEjbReferences(org.apache.cactus.integration.ant.TestCactifyEarTask)

Tests run: 131, Failures: 5, Errors: 76, Skipped: 0

[INFO] ------------------------------------------------------------------------
[ERROR] BUILD FAILURE
[INFO] ------------------------------------------------------------------------
[INFO] There are test failures.

Please refer to /srv/gump/public/workspace/jakarta-cactus/integration/ant/target/surefire-reports for the individual test results.
[INFO] ------------------------------------------------------------------------
[INFO] For more information, run Maven with the -e switch
[INFO] ------------------------------------------------------------------------
[INFO] Total time: 25 seconds
[INFO] Finished at: Sun Oct 24 12:55:26 UTC 2010
[INFO] Final Memory: 38M/91M
[INFO] ------------------------------------------------------------------------
---------------------------------------------

To subscribe to this information via syndicated feeds:
- RSS: http://vmgump.apache.org/gump/public/jakarta-cactus/cactus-test/rss.xml
- Atom: http://vmgump.apache.org/gump/public/jakarta-cactus/cactus-test/atom.xml

============================== Gump Tracking Only ===
Produced by Gump version 2.3.
Gump Run 10000024102010, vmgump.apache.org:vmgump:10000024102010
Gump E-mail Identifier (unique within run) #39.

*********************************************************** G U M P
[GUMP@vmgump]: Project openjpa-kernel (in module openjpa) failed
To whom it may engage...
        
This is an automated request, but not an unsolicited one. For 
more information please visit http://gump.apache.org/nagged.html, 
and/or contact the folk at general@gump.apache.org.

Project openjpa-kernel has an issue affecting its community integration.
This issue affects 8 projects,
 and has been outstanding for 61 runs.
The current state of this project is 'Failed', with reason 'Build Failed'.
For reference only, the following projects are affected by this:
    - openjpa :  Apache OpenJPA is a Java persistence project that can be use...
    - openjpa-jdbc :  Apache OpenJPA is a Java persistence project that can be use...
    - openjpa-kernel :  Apache OpenJPA is a Java persistence project that can be use...
    - openjpa-persistence :  Apache OpenJPA is a Java persistence project that can be use...
    - openjpa-persistence-jdbc :  Apache OpenJPA is a Java persistence project that can be use...
    - openjpa-slice :  Apache OpenJPA is a Java persistence project that can be use...
    - openjpa-testsupport :  Apache OpenJPA is a Java persistence project that can be use...
    - openjpa-xmlstore :  Apache OpenJPA is a Java persistence project that can be use...


Full details are available at:
    http://vmgump.apache.org/gump/public/openjpa/openjpa-kernel/index.html

That said, some information snippets are provided here.

The following annotations (debug/informational/warning/error messages) were provided:
 -DEBUG- Sole jar output [openjpa-kernel-*[0-9T].jar] identifier set to project name
 -DEBUG- (Gump generated) Maven2 Settings in: /srv/gump/public/workspace/openjpa/openjpa-kernel/gump_mvn_settings.xml
 -INFO- Failed with reason build failed
 -DEBUG- Maven POM in: /srv/gump/public/workspace/openjpa/openjpa-kernel/pom.xml
 -INFO- Failed to extract fallback artifacts from Gump Repository



The following work was performed:
http://vmgump.apache.org/gump/public/openjpa/openjpa-kernel/gump_work/build_openjpa_openjpa-kernel.html
Work Name: build_openjpa_openjpa-kernel (Type: Build)
Work ended in a state of : Failed
Elapsed: 44 secs
Command Line: mvn --batch-mode -Dcheckstyle.skip=true --settings /srv/gump/public/workspace/openjpa/openjpa-kernel/gump_mvn_settings.xml package 
[Working Directory: /srv/gump/public/workspace/openjpa/openjpa-kernel]
---------------------------------------------
location: class org.apache.openjpa.enhance.PCDataGenerator

/srv/gump/public/workspace/openjpa/openjpa-kernel/src/main/java/org/apache/openjpa/enhance/PCDataGenerator.java:[762,33] cannot find symbol
symbol  : class BCClass
location: class org.apache.openjpa.enhance.PCDataGenerator

/srv/gump/public/workspace/openjpa/openjpa-kernel/src/main/java/org/apache/openjpa/enhance/PCDataGenerator.java:[769,32] cannot find symbol
symbol  : class BCClass
location: class org.apache.openjpa.enhance.PCDataGenerator

/srv/gump/public/workspace/openjpa/openjpa-kernel/src/main/java/org/apache/openjpa/enhance/PCDataGenerator.java:[855,26] cannot find symbol
symbol  : class BCClass
location: class org.apache.openjpa.enhance.PCDataGenerator

/srv/gump/public/workspace/openjpa/openjpa-kernel/src/main/java/org/apache/openjpa/enhance/PCDataGenerator.java:[855,38] cannot find symbol
symbol  : class Code
location: class org.apache.openjpa.enhance.PCDataGenerator

/srv/gump/public/workspace/openjpa/openjpa-kernel/src/main/java/org/apache/openjpa/enhance/PCDataGenerator.java:[944,32] cannot find symbol
symbol  : class BCClass
location: class org.apache.openjpa.enhance.PCDataGenerator

/srv/gump/public/workspace/openjpa/openjpa-kernel/src/main/java/org/apache/openjpa/enhance/PCDataGenerator.java:[967,28] cannot find symbol
symbol  : class BCClass
location: class org.apache.openjpa.enhance.PCDataGenerator

/srv/gump/public/workspace/openjpa/openjpa-kernel/src/main/java/org/apache/openjpa/enhance/PCDataGenerator.java:[1030,38] cannot find symbol
symbol  : class BCClass
location: class org.apache.openjpa.enhance.PCDataGenerator

/srv/gump/public/workspace/openjpa/openjpa-kernel/src/main/java/org/apache/openjpa/enhance/PCDataGenerator.java:[1049,29] cannot find symbol
symbol  : class Instruction
location: class org.apache.openjpa.enhance.PCDataGenerator

/srv/gump/public/workspace/openjpa/openjpa-kernel/src/main/java/org/apache/openjpa/enhance/PCDataGenerator.java:[1049,57] cannot find symbol
symbol  : class Instruction
location: class org.apache.openjpa.enhance.PCDataGenerator

/srv/gump/public/workspace/openjpa/openjpa-kernel/src/main/java/org/apache/openjpa/enhance/DynamicStorageGenerator.java:[98,18] cannot find symbol
symbol  : class Project
location: class org.apache.openjpa.enhance.DynamicStorageGenerator


[INFO] ------------------------------------------------------------------------
[INFO] For more information, run Maven with the -e switch
[INFO] ------------------------------------------------------------------------
[INFO] Total time: 42 seconds
[INFO] Finished at: Sun Oct 24 12:56:16 UTC 2010
[INFO] Final Memory: 63M/196M
[INFO] ------------------------------------------------------------------------
---------------------------------------------

To subscribe to this information via syndicated feeds:
- RSS: http://vmgump.apache.org/gump/public/openjpa/openjpa-kernel/rss.xml
- Atom: http://vmgump.apache.org/gump/public/openjpa/openjpa-kernel/atom.xml

============================== Gump Tracking Only ===
Produced by Gump version 2.3.
Gump Run 10000024102010, vmgump.apache.org:vmgump:10000024102010
Gump E-mail Identifier (unique within run) #40.

*********************************************************** G U M P
[GUMP@vmgump]: Project cocoon3-reactor (in module cocoon3) failed
To whom it may engage...
        
This is an automated request, but not an unsolicited one. For 
more information please visit http://gump.apache.org/nagged.html, 
and/or contact the folk at general@gump.apache.org.

Project cocoon3-reactor has an issue affecting its community integration.
This issue affects 1 projects,
 and has been outstanding for 6 runs.
The current state of this project is 'Failed', with reason 'Build Failed'.
For reference only, the following projects are affected by this:
    - cocoon3-reactor :  Java XML Framework


Full details are available at:
    http://vmgump.apache.org/gump/public/cocoon3/cocoon3-reactor/index.html

That said, some information snippets are provided here.

The following annotations (debug/informational/warning/error messages) were provided:
 -DEBUG- (Gump generated) Maven2 Settings in: /srv/gump/public/workspace/cocoon3/gump_mvn_settings.xml
 -INFO- Failed with reason build failed
 -DEBUG- Maven POM in: /srv/gump/public/workspace/cocoon3/pom.xml



The following work was performed:
http://vmgump.apache.org/gump/public/cocoon3/cocoon3-reactor/gump_work/build_cocoon3_cocoon3-reactor.html
Work Name: build_cocoon3_cocoon3-reactor (Type: Build)
Work ended in a state of : Failed
Elapsed: 51 secs
Command Line: mvn --batch-mode --settings /srv/gump/public/workspace/cocoon3/gump_mvn_settings.xml package 
[Working Directory: /srv/gump/public/workspace/cocoon3]
---------------------------------------------
[INFO] [remote-resources:process {execution: default}]
[INFO] [resources:resources {execution: default-resources}]
[INFO] Using 'UTF-8' encoding to copy filtered resources.
[INFO] Copying 2 resources
[INFO] Copying 3 resources
[INFO] [compiler:compile {execution: default-compile}]
[INFO] Nothing to compile - all classes are up to date
[INFO] [resources:testResources {execution: default-testResources}]
[INFO] Using 'UTF-8' encoding to copy filtered resources.
[INFO] Copying 4 resources
[INFO] Copying 3 resources
[INFO] [compiler:testCompile {execution: default-testCompile}]
[INFO] Nothing to compile - all classes are up to date
[INFO] [surefire:test {execution: default-test}]
[INFO] Surefire report directory: /srv/gump/public/workspace/cocoon3/cocoon-optional/target/surefire-reports

-------------------------------------------------------
 T E S T S
-------------------------------------------------------
Running org.apache.cocoon.optional.pipeline.components.sax.jaxb.JAXBGeneratorTestCase
Tests run: 3, Failures: 0, Errors: 0, Skipped: 0, Time elapsed: 1.411 sec
Running org.apache.cocoon.optional.pipeline.components.sax.betwixt.BetwixtBeanGeneratorTest
Tests run: 2, Failures: 0, Errors: 0, Skipped: 0, Time elapsed: 2.805 sec
Running org.apache.cocoon.optional.pipeline.components.sax.fop.FopSerializerTestCase
Tests run: 1, Failures: 0, Errors: 0, Skipped: 0, Time elapsed: 3.117 sec
Running org.apache.cocoon.optional.pipeline.components.sax.solr.SolrConsumerTestCase
Tests run: 1, Failures: 0, Errors: 1, Skipped: 0, Time elapsed: 0.011 sec <<< FAILURE!
Running org.apache.cocoon.optional.pipeline.components.sax.neko.NekoGeneratorTestCase
Tests run: 1, Failures: 0, Errors: 0, Skipped: 0, Time elapsed: 0.056 sec

Results :

Tests in error: 
  testPipelineWithSolrConsumer(org.apache.cocoon.optional.pipeline.components.sax.solr.SolrConsumerTestCase)

Tests run: 8, Failures: 0, Errors: 1, Skipped: 0

[INFO] ------------------------------------------------------------------------
[ERROR] BUILD FAILURE
[INFO] ------------------------------------------------------------------------
[INFO] There are test failures.

Please refer to /srv/gump/public/workspace/cocoon3/cocoon-optional/target/surefire-reports for the individual test results.
[INFO] ------------------------------------------------------------------------
[INFO] For more information, run Maven with the -e switch
[INFO] ------------------------------------------------------------------------
[INFO] Total time: 50 seconds
[INFO] Finished at: Sun Oct 24 13:07:38 UTC 2010
[INFO] Final Memory: 69M/165M
[INFO] ------------------------------------------------------------------------
---------------------------------------------

To subscribe to this information via syndicated feeds:
- RSS: http://vmgump.apache.org/gump/public/cocoon3/cocoon3-reactor/rss.xml
- Atom: http://vmgump.apache.org/gump/public/cocoon3/cocoon3-reactor/atom.xml

============================== Gump Tracking Only ===
Produced by Gump version 2.3.
Gump Run 10000024102010, vmgump.apache.org:vmgump:10000024102010
Gump E-mail Identifier (unique within run) #43.

*********************************************************** G U M P
[GUMP@vmgump]: Project portals-bridges-script-test (in module portals-bridges) failed
To whom it may engage...
        
This is an automated request, but not an unsolicited one. For 
more information please visit http://gump.apache.org/nagged.html, 
and/or contact the folk at general@gump.apache.org.

Project portals-bridges-script-test has an issue affecting its community integration.
This issue affects 1 projects,
 and has been outstanding for 20 runs.
The current state of this project is 'Failed', with reason 'Build Failed'.
For reference only, the following projects are affected by this:
    - portals-bridges-script-test :  Support for JSR168 compliant Portlet development


Full details are available at:
    http://vmgump.apache.org/gump/public/portals-bridges/portals-bridges-script-test/index.html

That said, some information snippets are provided here.

The following annotations (debug/informational/warning/error messages) were provided:
 -WARNING- Overriding Maven2 settings: [/srv/gump/public/workspace/portals-bridges/bridges-script/trunk/portlet/gump_mvn_settings.xml]
 -DEBUG- (Gump generated) Maven2 Settings in: /srv/gump/public/workspace/portals-bridges/bridges-script/trunk/portlet/gump_mvn_settings.xml
 -INFO- Failed with reason build failed
 -DEBUG- Maven POM in: /srv/gump/public/workspace/portals-bridges/bridges-script/trunk/portlet/pom.xml



The following work was performed:
http://vmgump.apache.org/gump/public/portals-bridges/portals-bridges-script-test/gump_work/build_portals-bridges_portals-bridges-script-test.html
Work Name: build_portals-bridges_portals-bridges-script-test (Type: Build)
Work ended in a state of : Failed
Elapsed: 26 secs
Command Line: mvn --batch-mode --settings /srv/gump/public/workspace/portals-bridges/bridges-script/trunk/portlet/gump_mvn_settings.xml package 
[Working Directory: /srv/gump/public/workspace/portals-bridges/bridges-script/trunk/portlet]
---------------------------------------------
[INFO] Surefire report directory: /srv/gump/public/workspace/portals-bridges/bridges-script/trunk/portlet/target/surefire-reports

-------------------------------------------------------
 T E S T S
-------------------------------------------------------
Running org.apache.portals.bridges.script.TestHelloJythonScriptPortlet
Tests run: 5, Failures: 0, Errors: 5, Skipped: 0, Time elapsed: 4.555 sec <<< FAILURE!
Running org.apache.portals.bridges.script.TestHelloJRubyScriptPortlet
Tests run: 5, Failures: 0, Errors: 0, Skipped: 0, Time elapsed: 4.758 sec
Running org.apache.portals.bridges.script.TestHelloRhinoScriptPortlet
[WARNING] Rhino script engine embedded in the default Java 1.6+ has not fully tested yet.
[WARNING] Rhino script engine embedded in the default Java 1.6+ has not fully tested yet.
[WARNING] Rhino script engine embedded in the default Java 1.6+ has not fully tested yet.
[WARNING] Rhino script engine embedded in the default Java 1.6+ has not fully tested yet.
[WARNING] Rhino script engine embedded in the default Java 1.6+ has not fully tested yet.
[WARNING] Rhino script engine embedded in the default Java 1.6+ has not fully tested yet.
[WARNING] Rhino script engine embedded in the default Java 1.6+ has not fully tested yet.
[WARNING] Rhino script engine embedded in the default Java 1.6+ has not fully tested yet.
[WARNING] Rhino script engine embedded in the default Java 1.6+ has not fully tested yet.
[WARNING] Rhino script engine embedded in the default Java 1.6+ has not fully tested yet.
Tests run: 5, Failures: 0, Errors: 0, Skipped: 0, Time elapsed: 0.036 sec
Running org.apache.portals.bridges.script.TestHelloGroovyScriptPortlet
Tests run: 5, Failures: 0, Errors: 0, Skipped: 0, Time elapsed: 7.083 sec
Running org.apache.portals.bridges.script.TestHelloBeanShellScriptPortlet
Tests run: 5, Failures: 0, Errors: 0, Skipped: 0, Time elapsed: 3.382 sec

Results :

Tests in error: 
  testInit(org.apache.portals.bridges.script.TestHelloJythonScriptPortlet)
  testRender(org.apache.portals.bridges.script.TestHelloJythonScriptPortlet)
  testProcessAction(org.apache.portals.bridges.script.TestHelloJythonScriptPortlet)
  testProcessEvent(org.apache.portals.bridges.script.TestHelloJythonScriptPortlet)
  testServeResource(org.apache.portals.bridges.script.TestHelloJythonScriptPortlet)

Tests run: 25, Failures: 0, Errors: 5, Skipped: 0

[INFO] ------------------------------------------------------------------------
[ERROR] BUILD FAILURE
[INFO] ------------------------------------------------------------------------
[INFO] There are test failures.

Please refer to /srv/gump/public/workspace/portals-bridges/bridges-script/trunk/portlet/target/surefire-reports for the individual test results.
[INFO] ------------------------------------------------------------------------
[INFO] For more information, run Maven with the -e switch
[INFO] ------------------------------------------------------------------------
[INFO] Total time: 25 seconds
[INFO] Finished at: Sun Oct 24 13:08:05 UTC 2010
[INFO] Final Memory: 24M/57M
[INFO] ------------------------------------------------------------------------
---------------------------------------------

To subscribe to this information via syndicated feeds:
- RSS: http://vmgump.apache.org/gump/public/portals-bridges/portals-bridges-script-test/rss.xml
- Atom: http://vmgump.apache.org/gump/public/portals-bridges/portals-bridges-script-test/atom.xml

============================== Gump Tracking Only ===
Produced by Gump version 2.3.
Gump Run 10000024102010, vmgump.apache.org:vmgump:10000024102010
Gump E-mail Identifier (unique within run) #44.

*********************************************************** G U M P
[GUMP@vmgump]: Project cocoon-optional-test (in module cocoon3) failed
To whom it may engage...
        
This is an automated request, but not an unsolicited one. For 
more information please visit http://gump.apache.org/nagged.html, 
and/or contact the folk at general@gump.apache.org.

Project cocoon-optional-test has an issue affecting its community integration.
This issue affects 1 projects,
 and has been outstanding for 6 runs.
The current state of this project is 'Failed', with reason 'Build Failed'.
For reference only, the following projects are affected by this:
    - cocoon-optional-test :  Java XML Framework


Full details are available at:
    http://vmgump.apache.org/gump/public/cocoon3/cocoon-optional-test/index.html

That said, some information snippets are provided here.

The following annotations (debug/informational/warning/error messages) were provided:
 -WARNING- Overriding Maven2 settings: [/srv/gump/public/workspace/cocoon3/cocoon-optional/gump_mvn_settings.xml]
 -DEBUG- (Gump generated) Maven2 Settings in: /srv/gump/public/workspace/cocoon3/cocoon-optional/gump_mvn_settings.xml
 -INFO- Failed with reason build failed
 -DEBUG- Maven POM in: /srv/gump/public/workspace/cocoon3/cocoon-optional/pom.xml
 -INFO- Project Reports in: /srv/gump/public/workspace/cocoon3/cocoon-optional/target/surefire-reports



The following work was performed:
http://vmgump.apache.org/gump/public/cocoon3/cocoon-optional-test/gump_work/build_cocoon3_cocoon-optional-test.html
Work Name: build_cocoon3_cocoon-optional-test (Type: Build)
Work ended in a state of : Failed
Elapsed: 15 secs
Command Line: mvn --batch-mode --settings /srv/gump/public/workspace/cocoon3/cocoon-optional/gump_mvn_settings.xml test 
[Working Directory: /srv/gump/public/workspace/cocoon3/cocoon-optional]
---------------------------------------------
[INFO] [remote-resources:process {execution: default}]
[INFO] [resources:resources {execution: default-resources}]
[INFO] Using 'UTF-8' encoding to copy filtered resources.
[INFO] Copying 2 resources
[INFO] Copying 3 resources
[INFO] [compiler:compile {execution: default-compile}]
[INFO] Nothing to compile - all classes are up to date
[INFO] [resources:testResources {execution: default-testResources}]
[INFO] Using 'UTF-8' encoding to copy filtered resources.
[INFO] Copying 4 resources
[INFO] Copying 3 resources
[INFO] [compiler:testCompile {execution: default-testCompile}]
[INFO] Nothing to compile - all classes are up to date
[INFO] [surefire:test {execution: default-test}]
[INFO] Surefire report directory: /srv/gump/public/workspace/cocoon3/cocoon-optional/target/surefire-reports

-------------------------------------------------------
 T E S T S
-------------------------------------------------------
Running org.apache.cocoon.optional.pipeline.components.sax.jaxb.JAXBGeneratorTestCase
Tests run: 3, Failures: 0, Errors: 0, Skipped: 0, Time elapsed: 0.883 sec
Running org.apache.cocoon.optional.pipeline.components.sax.betwixt.BetwixtBeanGeneratorTest
Tests run: 2, Failures: 0, Errors: 0, Skipped: 0, Time elapsed: 0.195 sec
Running org.apache.cocoon.optional.pipeline.components.sax.fop.FopSerializerTestCase
Tests run: 1, Failures: 0, Errors: 0, Skipped: 0, Time elapsed: 1.052 sec
Running org.apache.cocoon.optional.pipeline.components.sax.solr.SolrConsumerTestCase
Tests run: 1, Failures: 0, Errors: 1, Skipped: 0, Time elapsed: 0.012 sec <<< FAILURE!
Running org.apache.cocoon.optional.pipeline.components.sax.neko.NekoGeneratorTestCase
Tests run: 1, Failures: 0, Errors: 0, Skipped: 0, Time elapsed: 0.216 sec

Results :

Tests in error: 
  testPipelineWithSolrConsumer(org.apache.cocoon.optional.pipeline.components.sax.solr.SolrConsumerTestCase)

Tests run: 8, Failures: 0, Errors: 1, Skipped: 0

[INFO] ------------------------------------------------------------------------
[ERROR] BUILD FAILURE
[INFO] ------------------------------------------------------------------------
[INFO] There are test failures.

Please refer to /srv/gump/public/workspace/cocoon3/cocoon-optional/target/surefire-reports for the individual test results.
[INFO] ------------------------------------------------------------------------
[INFO] For more information, run Maven with the -e switch
[INFO] ------------------------------------------------------------------------
[INFO] Total time: 14 seconds
[INFO] Finished at: Sun Oct 24 13:08:31 UTC 2010
[INFO] Final Memory: 50M/120M
[INFO] ------------------------------------------------------------------------
---------------------------------------------

To subscribe to this information via syndicated feeds:
- RSS: http://vmgump.apache.org/gump/public/cocoon3/cocoon-optional-test/rss.xml
- Atom: http://vmgump.apache.org/gump/public/cocoon3/cocoon-optional-test/atom.xml

============================== Gump Tracking Only ===
Produced by Gump version 2.3.
Gump Run 10000024102010, vmgump.apache.org:vmgump:10000024102010
Gump E-mail Identifier (unique within run) #45.

*********************************************************** G U M P
[GUMP@vmgump]: Project portals-pluto-trunk-test (in module portals-pluto-trunk) failed
To whom it may engage...
        
This is an automated request, but not an unsolicited one. For 
more information please visit http://gump.apache.org/nagged.html, 
and/or contact the folk at general@gump.apache.org.

Project portals-pluto-trunk-test has an issue affecting its community integration.
This issue affects 1 projects,
 and has been outstanding for 61 runs.
The current state of this project is 'Failed', with reason 'Build Failed'.
For reference only, the following projects are affected by this:
    - portals-pluto-trunk-test :  JSR168 Container


Full details are available at:
    http://vmgump.apache.org/gump/public/portals-pluto-trunk/portals-pluto-trunk-test/index.html

That said, some information snippets are provided here.

The following annotations (debug/informational/warning/error messages) were provided:
 -WARNING- Overriding Maven2 settings: [/srv/gump/public/workspace/portals-pluto-trunk/gump_mvn_settings.xml]
 -DEBUG- (Gump generated) Maven2 Settings in: /srv/gump/public/workspace/portals-pluto-trunk/gump_mvn_settings.xml
 -INFO- Failed with reason build failed
 -DEBUG- Maven POM in: /srv/gump/public/workspace/portals-pluto-trunk/pom.xml



The following work was performed:
http://vmgump.apache.org/gump/public/portals-pluto-trunk/portals-pluto-trunk-test/gump_work/build_portals-pluto-trunk_portals-pluto-trunk-test.html
Work Name: build_portals-pluto-trunk_portals-pluto-trunk-test (Type: Build)
Work ended in a state of : Failed
Elapsed: 27 secs
Command Line: mvn --batch-mode --settings /srv/gump/public/workspace/portals-pluto-trunk/gump_mvn_settings.xml package 
[Working Directory: /srv/gump/public/workspace/portals-pluto-trunk]
---------------------------------------------
[ERROR] FATAL ERROR
[INFO] ------------------------------------------------------------------------
[INFO] org/xmlpull/v1/XmlPullParserFactory
org.xmlpull.v1.XmlPullParserFactory
[INFO] ------------------------------------------------------------------------
[INFO] Trace
java.lang.NoClassDefFoundError: org/xmlpull/v1/XmlPullParserFactory
	at com.thoughtworks.xstream.io.xml.XppDriver.createParser(XppDriver.java:57)
	at com.thoughtworks.xstream.io.xml.AbstractXppDriver.createReader(AbstractXppDriver.java:56)
	at com.thoughtworks.xstream.XStream.fromXML(XStream.java:879)
	at org.apache.maven.plugin.war.util.WebappStructureSerializer.fromXml(WebappStructureSerializer.java:73)
	at org.apache.maven.plugin.war.AbstractWarMojo.buildWebapp(AbstractWarMojo.java:423)
	at org.apache.maven.plugin.war.AbstractWarMojo.buildExplodedWebapp(AbstractWarMojo.java:394)
	at org.apache.maven.plugin.war.WarMojo.performPackaging(WarMojo.java:195)
	at org.apache.maven.plugin.war.WarMojo.execute(WarMojo.java:157)
	at org.apache.maven.plugin.DefaultPluginManager.executeMojo(DefaultPluginManager.java:490)
	at org.apache.maven.lifecycle.DefaultLifecycleExecutor.executeGoals(DefaultLifecycleExecutor.java:694)
	at org.apache.maven.lifecycle.DefaultLifecycleExecutor.executeGoalWithLifecycle(DefaultLifecycleExecutor.java:556)
	at org.apache.maven.lifecycle.DefaultLifecycleExecutor.executeGoal(DefaultLifecycleExecutor.java:535)
	at org.apache.maven.lifecycle.DefaultLifecycleExecutor.executeGoalAndHandleFailures(DefaultLifecycleExecutor.java:387)
	at org.apache.maven.lifecycle.DefaultLifecycleExecutor.executeTaskSegments(DefaultLifecycleExecutor.java:348)
	at org.apache.maven.lifecycle.DefaultLifecycleExecutor.execute(DefaultLifecycleExecutor.java:180)
	at org.apache.maven.DefaultMaven.doExecute(DefaultMaven.java:328)
	at org.apache.maven.DefaultMaven.execute(DefaultMaven.java:138)
	at org.apache.maven.cli.MavenCli.main(MavenCli.java:362)
	at org.apache.maven.cli.compat.CompatibleMain.main(CompatibleMain.java:60)
	at sun.reflect.NativeMethodAccessorImpl.invoke0(Native Method)
	at sun.reflect.NativeMethodAccessorImpl.invoke(NativeMethodAccessorImpl.java:57)
	at sun.reflect.DelegatingMethodAccessorImpl.invoke(DelegatingMethodAccessorImpl.java:43)
	at java.lang.reflect.Method.invoke(Method.java:616)
	at org.codehaus.classworlds.Launcher.launchEnhanced(Launcher.java:315)
	at org.codehaus.classworlds.Launcher.launch(Launcher.java:255)
	at org.codehaus.classworlds.Launcher.mainWithExitCode(Launcher.java:430)
	at org.codehaus.classworlds.Launcher.main(Launcher.java:375)
Caused by: java.lang.ClassNotFoundException: org.xmlpull.v1.XmlPullParserFactory
	at java.net.URLClassLoader$1.run(URLClassLoader.java:217)
	at java.security.AccessController.doPrivileged(Native Method)
	at java.net.URLClassLoader.findClass(URLClassLoader.java:205)
	at java.lang.ClassLoader.loadClass(ClassLoader.java:321)
	at org.codehaus.classworlds.RealmClassLoader.loadClassDirect(RealmClassLoader.java:195)
	at org.codehaus.classworlds.DefaultClassRealm.loadClass(DefaultClassRealm.java:255)
	at org.codehaus.classworlds.DefaultClassRealm.loadClass(DefaultClassRealm.java:274)
	at org.codehaus.classworlds.RealmClassLoader.loadClass(RealmClassLoader.java:214)
	at java.lang.ClassLoader.loadClass(ClassLoader.java:266)
	... 27 more
[INFO] ------------------------------------------------------------------------
[INFO] Total time: 25 seconds
[INFO] Finished at: Sun Oct 24 13:08:59 UTC 2010
[INFO] Final Memory: 50M/121M
[INFO] ------------------------------------------------------------------------
---------------------------------------------

To subscribe to this information via syndicated feeds:
- RSS: http://vmgump.apache.org/gump/public/portals-pluto-trunk/portals-pluto-trunk-test/rss.xml
- Atom: http://vmgump.apache.org/gump/public/portals-pluto-trunk/portals-pluto-trunk-test/atom.xml

============================== Gump Tracking Only ===
Produced by Gump version 2.3.
Gump Run 10000024102010, vmgump.apache.org:vmgump:10000024102010
Gump E-mail Identifier (unique within run) #46.

*********************************************************** G U M P
[GUMP@vmgump]: Project activemq-jaas (in module activemq) failed
To whom it may engage...
        
This is an automated request, but not an unsolicited one. For 
more information please visit http://gump.apache.org/nagged.html, 
and/or contact the folk at general@gump.apache.org.

Project activemq-jaas has an issue affecting its community integration.
This issue affects 5 projects,
 and has been outstanding for 66 runs.
The current state of this project is 'Failed', with reason 'Build Failed'.
For reference only, the following projects are affected by this:
    - activemq-core :  ActiveMQ :: Core
    - activemq-jaas :  ActiveMQ :: JAAS
    - activemq-jaas-test :  ActiveMQ message broker and enterprise integration patterns ...
    - activemq-pool :  ActiveMQ :: Pool
    - activemq-ra :  ActiveMQ :: RA


Full details are available at:
    http://vmgump.apache.org/gump/public/activemq/activemq-jaas/index.html

That said, some information snippets are provided here.

The following annotations (debug/informational/warning/error messages) were provided:
 -DEBUG- Sole jar output [activemq-jaas-*[0-9T].jar] identifier set to project name
 -INFO- Optional dependency apacheds-server-integ prerequisite failed with reason build failed
 -INFO- Optional dependency apacheds-core-integ prerequisite failed with reason build failed
 -DEBUG- (Gump generated) Maven2 Settings in: /srv/gump/public/workspace/activemq/activemq-jaas/gump_mvn_settings.xml
 -INFO- Failed with reason build failed
 -DEBUG- Maven POM in: /srv/gump/public/workspace/activemq/activemq-jaas/pom.xml
 -INFO- Failed to extract fallback artifacts from Gump Repository



The following work was performed:
http://vmgump.apache.org/gump/public/activemq/activemq-jaas/gump_work/build_activemq_activemq-jaas.html
Work Name: build_activemq_activemq-jaas (Type: Build)
Work ended in a state of : Failed
Elapsed: 53 secs
Command Line: mvn --batch-mode -DskipTests=true --settings /srv/gump/public/workspace/activemq/activemq-jaas/gump_mvn_settings.xml install 
[Working Directory: /srv/gump/public/workspace/activemq/activemq-jaas]
---------------------------------------------
Downloading: http://localhost:8192/maven2/org/apache/directory/server/apacheds-kerberos-shared/1.5.5/apacheds-kerberos-shared-1.5.5.jar
260K downloaded  (apacheds-kerberos-shared-1.5.5.jar)
Downloading: http://repository.springsource.com/maven/bundles/external/org/apache/directory/server/apacheds-protocol-shared/1.5.5/apacheds-protocol-shared-1.5.5.jar
[INFO] Unable to find resource 'org.apache.directory.server:apacheds-protocol-shared:jar:1.5.5' in repository com.springsource.repository.bundles.external (http://repository.springsource.com/maven/bundles/external)
Downloading: http://localhost:8192/maven2/org/apache/directory/server/apacheds-protocol-shared/1.5.5/apacheds-protocol-shared-1.5.5.jar
26K downloaded  (apacheds-protocol-shared-1.5.5.jar)
[INFO] ------------------------------------------------------------------------
[ERROR] BUILD ERROR
[INFO] ------------------------------------------------------------------------
[INFO] Failed to resolve artifact.

Missing:
----------
1) org.apache.directory.shared:shared-cursor:jar:0.9.20-SNAPSHOT

  Try downloading the file manually from the project website.

  Then, install it using the command: 
      mvn install:install-file -DgroupId=org.apache.directory.shared -DartifactId=shared-cursor -Dversion=0.9.20-SNAPSHOT -Dpackaging=jar -Dfile=/path/to/file

  Alternatively, if you host your own repository you can deploy the file there: 
      mvn deploy:deploy-file -DgroupId=org.apache.directory.shared -DartifactId=shared-cursor -Dversion=0.9.20-SNAPSHOT -Dpackaging=jar -Dfile=/path/to/file -Durl=[url] -DrepositoryId=[id]

  Path to dependency: 
  	1) org.apache.activemq:activemq-jaas:bundle:5.5-SNAPSHOT
  	2) org.apache.directory.server:apacheds-core-integ:jar:1.5.5
  	3) org.apache.directory.server:apacheds-core-jndi:jar:1.5.5
  	4) org.apache.directory.server:apacheds-core:jar:1.5.5
  	5) org.apache.directory.shared:shared-cursor:jar:0.9.20-SNAPSHOT

----------
1 required artifact is missing.

for artifact: 
  org.apache.activemq:activemq-jaas:bundle:5.5-SNAPSHOT

from the specified remote repositories:
  com.springsource.repository.bundles.external (http://repository.springsource.com/maven/bundles/external),
  gump-central (http://localhost:8192/maven2),
  gump-apache.snapshots (http://localhost:8192/repo/m2-snapshot-repository)



[INFO] ------------------------------------------------------------------------
[INFO] For more information, run Maven with the -e switch
[INFO] ------------------------------------------------------------------------
[INFO] Total time: 52 seconds
[INFO] Finished at: Sun Oct 24 13:10:27 UTC 2010
[INFO] Final Memory: 29M/70M
[INFO] ------------------------------------------------------------------------
---------------------------------------------

To subscribe to this information via syndicated feeds:
- RSS: http://vmgump.apache.org/gump/public/activemq/activemq-jaas/rss.xml
- Atom: http://vmgump.apache.org/gump/public/activemq/activemq-jaas/atom.xml

============================== Gump Tracking Only ===
Produced by Gump version 2.3.
Gump Run 10000024102010, vmgump.apache.org:vmgump:10000024102010
Gump E-mail Identifier (unique within run) #47.

*********************************************************** G U M P
[GUMP@vmgump]: Project james-imap-test (in module james-imap) failed
To whom it may engage...
        
This is an automated request, but not an unsolicited one. For 
more information please visit http://gump.apache.org/nagged.html, 
and/or contact the folk at general@gump.apache.org.

Project james-imap-test has an issue affecting its community integration.
This issue affects 1 projects,
 and has been outstanding for 16 runs.
The current state of this project is 'Failed', with reason 'Build Failed'.
For reference only, the following projects are affected by this:
    - james-imap-test :  A library providing a flexible codec for IMAP, command proce...


Full details are available at:
    http://vmgump.apache.org/gump/public/james-imap/james-imap-test/index.html

That said, some information snippets are provided here.

The following annotations (debug/informational/warning/error messages) were provided:
 -WARNING- Overriding Maven2 settings: [/srv/gump/public/workspace/james-imap/gump_mvn_settings.xml]
 -DEBUG- (Gump generated) Maven2 Settings in: /srv/gump/public/workspace/james-imap/gump_mvn_settings.xml
 -INFO- Failed with reason build failed
 -DEBUG- Maven POM in: /srv/gump/public/workspace/james-imap/pom.xml



The following work was performed:
http://vmgump.apache.org/gump/public/james-imap/james-imap-test/gump_work/build_james-imap_james-imap-test.html
Work Name: build_james-imap_james-imap-test (Type: Build)
Work ended in a state of : Failed
Elapsed: 6 mins 25 secs
Command Line: mvn --batch-mode --settings /srv/gump/public/workspace/james-imap/gump_mvn_settings.xml test 
[Working Directory: /srv/gump/public/workspace/james-imap]
---------------------------------------------
  testValidNonAuthenticatedITALY(org.apache.james.mailbox.jcr.AuthenticatedStateTest)
  testCreateITALY(org.apache.james.mailbox.jcr.AuthenticatedStateTest)
  testExamineEmptyITALY(org.apache.james.mailbox.jcr.AuthenticatedStateTest)
  testSelectEmptyITALY(org.apache.james.mailbox.jcr.AuthenticatedStateTest)
  testListNamespaceITALY(org.apache.james.mailbox.jcr.AuthenticatedStateTest)
  testListMailboxesITALY(org.apache.james.mailbox.jcr.AuthenticatedStateTest)
  testStatusITALY(org.apache.james.mailbox.jcr.AuthenticatedStateTest)
  testStringArgsITALY(org.apache.james.mailbox.jcr.AuthenticatedStateTest)
  testSubscribeITALY(org.apache.james.mailbox.jcr.AuthenticatedStateTest)
  testAppendITALY(org.apache.james.mailbox.jcr.AuthenticatedStateTest)
  testDeleteITALY(org.apache.james.mailbox.jcr.AuthenticatedStateTest)
  testValidNonAuthenticatedKOREA(org.apache.james.mailbox.jcr.AuthenticatedStateTest)
  testCreateKOREA(org.apache.james.mailbox.jcr.AuthenticatedStateTest)
  testExamineEmptyKOREA(org.apache.james.mailbox.jcr.AuthenticatedStateTest)
  testSelectEmptyKOREA(org.apache.james.mailbox.jcr.AuthenticatedStateTest)
  testListNamespaceKOREA(org.apache.james.mailbox.jcr.AuthenticatedStateTest)
  testListMailboxesKOREA(org.apache.james.mailbox.jcr.AuthenticatedStateTest)
  testStatusKOREA(org.apache.james.mailbox.jcr.AuthenticatedStateTest)
  testStringArgsKOREA(org.apache.james.mailbox.jcr.AuthenticatedStateTest)
  testSubscribeKOREA(org.apache.james.mailbox.jcr.AuthenticatedStateTest)
  testAppendKOREA(org.apache.james.mailbox.jcr.AuthenticatedStateTest)
  testDeleteKOREA(org.apache.james.mailbox.jcr.AuthenticatedStateTest)
  testAppendExamineInboxUS(org.apache.james.mailbox.jcr.AuthenticatedStateTest)
  testAppendSelectInboxUS(org.apache.james.mailbox.jcr.AuthenticatedStateTest)
  testAppendExpungeUS(org.apache.james.mailbox.jcr.AuthenticatedStateTest)
  testSelectAppendUS(org.apache.james.mailbox.jcr.AuthenticatedStateTest)
  testAppendExamineInboxITALY(org.apache.james.mailbox.jcr.AuthenticatedStateTest)
  testAppendSelectInboxITALY(org.apache.james.mailbox.jcr.AuthenticatedStateTest)
  testAppendExpungeITALY(org.apache.james.mailbox.jcr.AuthenticatedStateTest)
  testSelectAppendITALY(org.apache.james.mailbox.jcr.AuthenticatedStateTest)
  testAppendExamineInboxKOREA(org.apache.james.mailbox.jcr.AuthenticatedStateTest)
  testAppendSelectInboxKOREA(org.apache.james.mailbox.jcr.AuthenticatedStateTest)
  testAppendExpungeKOREA(org.apache.james.mailbox.jcr.AuthenticatedStateTest)
  testSelectAppendKOREA(org.apache.james.mailbox.jcr.AuthenticatedStateTest)

Tests run: 293, Failures: 0, Errors: 293, Skipped: 0

[INFO] ------------------------------------------------------------------------
[ERROR] BUILD FAILURE
[INFO] ------------------------------------------------------------------------
[INFO] There are test failures.

Please refer to /srv/gump/public/workspace/james-imap/jcr/target/surefire-reports for the individual test results.
[INFO] ------------------------------------------------------------------------
[INFO] For more information, run Maven with the -e switch
[INFO] ------------------------------------------------------------------------
[INFO] Total time: 6 minutes 24 seconds
[INFO] Finished at: Sun Oct 24 13:20:05 UTC 2010
[INFO] Final Memory: 51M/122M
[INFO] ------------------------------------------------------------------------
---------------------------------------------

To subscribe to this information via syndicated feeds:
- RSS: http://vmgump.apache.org/gump/public/james-imap/james-imap-test/rss.xml
- Atom: http://vmgump.apache.org/gump/public/james-imap/james-imap-test/atom.xml

============================== Gump Tracking Only ===
Produced by Gump version 2.3.
Gump Run 10000024102010, vmgump.apache.org:vmgump:10000024102010
Gump E-mail Identifier (unique within run) #48.

*********************************************************** G U M P
[GUMP@vmgump]: Project james-server (in module james-server) failed
To whom it may engage...
        
This is an automated request, but not an unsolicited one. For 
more information please visit http://gump.apache.org/nagged.html, 
and/or contact the folk at general@gump.apache.org.

Project james-server has an issue affecting its community integration.
This issue affects 2 projects,
 and has been outstanding for 6 runs.
The current state of this project is 'Failed', with reason 'Build Failed'.
For reference only, the following projects are affected by this:
    - james-server :  James Server
    - james-server-test :  James Server


Full details are available at:
    http://vmgump.apache.org/gump/public/james-server/james-server/index.html

That said, some information snippets are provided here.

The following annotations (debug/informational/warning/error messages) were provided:
 -INFO- Optional dependency james-jsieve failed with reason build failed
 -INFO- Optional dependency openjpa prerequisite failed with reason build failed
 -INFO- Optional dependency activemq-pool prerequisite failed with reason build failed
 -INFO- Optional dependency activemq-core prerequisite failed with reason build failed
 -DEBUG- (Gump generated) Maven2 Settings in: /srv/gump/public/workspace/james-server/gump_mvn_settings.xml
 -INFO- Failed with reason build failed
 -DEBUG- Maven POM in: /srv/gump/public/workspace/james-server/pom.xml
 -INFO- Failed to extract fallback artifacts from Gump Repository



The following work was performed:
http://vmgump.apache.org/gump/public/james-server/james-server/gump_work/build_james-server_james-server.html
Work Name: build_james-server_james-server (Type: Build)
Work ended in a state of : Failed
Elapsed: 4 mins 58 secs
Command Line: mvn --batch-mode -DskipTests=true --settings /srv/gump/public/workspace/james-server/gump_mvn_settings.xml install 
[Working Directory: /srv/gump/public/workspace/james-server]
---------------------------------------------
[ERROR] BUILD FAILURE
[INFO] ------------------------------------------------------------------------
[INFO] Compilation failure
Failure executing javac, but could not parse the error:


The system is out of resources.
Consult the following stack trace for details.
java.lang.OutOfMemoryError: PermGen space
	at java.lang.ClassLoader.defineClass1(Native Method)
	at java.lang.ClassLoader.defineClass(ClassLoader.java:634)
	at java.security.SecureClassLoader.defineClass(SecureClassLoader.java:142)
	at java.net.URLClassLoader.defineClass(URLClassLoader.java:277)
	at java.net.URLClassLoader.access$000(URLClassLoader.java:73)
	at java.net.URLClassLoader$1.run(URLClassLoader.java:212)
	at java.security.AccessController.doPrivileged(Native Method)
	at java.net.URLClassLoader.findClass(URLClassLoader.java:205)
	at org.codehaus.plexus.compiler.javac.IsolatedClassLoader.loadClass(IsolatedClassLoader.java:56)
	at com.sun.tools.javac.main.JavaCompiler.<init>(JavaCompiler.java:307)
	at com.sun.tools.javac.main.JavaCompiler.instance(JavaCompiler.java:86)
	at com.sun.tools.javac.main.Main.compile(Main.java:367)
	at com.sun.tools.javac.main.Main.compile(Main.java:306)
	at com.sun.tools.javac.main.Main.compile(Main.java:297)
	at com.sun.tools.javac.Main.compile(Main.java:100)
	at sun.reflect.NativeMethodAccessorImpl.invoke0(Native Method)
	at sun.reflect.NativeMethodAccessorImpl.invoke(NativeMethodAccessorImpl.java:57)
	at sun.reflect.DelegatingMethodAccessorImpl.invoke(DelegatingMethodAccessorImpl.java:43)
	at java.lang.reflect.Method.invoke(Method.java:616)
	at org.codehaus.plexus.compiler.javac.JavacCompiler.compileInProcess(JavacCompiler.java:420)
	at org.codehaus.plexus.compiler.javac.JavacCompiler.compile(JavacCompiler.java:141)
	at org.apache.maven.plugin.AbstractCompilerMojo.execute(AbstractCompilerMojo.java:493)
	at org.apache.maven.plugin.TestCompilerMojo.execute(TestCompilerMojo.java:102)
	at org.apache.maven.plugin.DefaultPluginManager.executeMojo(DefaultPluginManager.java:490)
	at org.apache.maven.lifecycle.DefaultLifecycleExecutor.executeGoals(DefaultLifecycleExecutor.java:694)
	at org.apache.maven.lifecycle.DefaultLifecycleExecutor.executeGoalWithLifecycle(DefaultLifecycleExecutor.java:556)
	at org.apache.maven.lifecycle.DefaultLifecycleExecutor.executeGoal(DefaultLifecycleExecutor.java:535)
	at org.apache.maven.lifecycle.DefaultLifecycleExecutor.executeGoalAndHandleFailures(DefaultLifecycleExecutor.java:387)
	at org.apache.maven.lifecycle.DefaultLifecycleExecutor.executeTaskSegments(DefaultLifecycleExecutor.java:348)
	at org.apache.maven.lifecycle.DefaultLifecycleExecutor.execute(DefaultLifecycleExecutor.java:180)
	at org.apache.maven.DefaultMaven.doExecute(DefaultMaven.java:328)
	at org.apache.maven.DefaultMaven.execute(DefaultMaven.java:138)


[INFO] ------------------------------------------------------------------------
[INFO] For more information, run Maven with the -e switch
[INFO] ------------------------------------------------------------------------
[INFO] Total time: 4 minutes 56 seconds
[INFO] Finished at: Sun Oct 24 13:30:44 UTC 2010
[INFO] Final Memory: 87M/483M
[INFO] ------------------------------------------------------------------------
---------------------------------------------

To subscribe to this information via syndicated feeds:
- RSS: http://vmgump.apache.org/gump/public/james-server/james-server/rss.xml
- Atom: http://vmgump.apache.org/gump/public/james-server/james-server/atom.xml

============================== Gump Tracking Only ===
Produced by Gump version 2.3.
Gump Run 10000024102010, vmgump.apache.org:vmgump:10000024102010
Gump E-mail Identifier (unique within run) #49.


--
Apache Gump
http://gump.apache.org/ [Instance: vmgump]

---------------------------------------------------------------------
To unsubscribe, e-mail: general-unsubscribe@gump.apache.org
For additional commands, e-mail: general-help@gump.apache.org


Mime
View raw message