gump-general mailing list archives

Site index · List index
Message view « Date » · « Thread »
Top « Date » · « Thread »
From g...@vmgump.apache.org
Subject BATCH: All dressed up, with nowhere to go...
Date Fri, 08 Oct 2010 04:15:19 GMT
Dear Gumpmeisters,
            
The following 1 notifys should have been sent

*********************************************************** G U M P
[GUMP@vmgump]: Project apacheds-server-integ-test (in module apacheds) failed
*********************************************************** G U M P
[GUMP@vmgump]: Project apacheds-server-integ-test (in module apacheds) failed
To whom it may engage...
        
This is an automated request, but not an unsolicited one. For 
more information please visit http://gump.apache.org/nagged.html, 
and/or contact the folk at general@gump.apache.org.

Project apacheds-server-integ-test has an issue affecting its community integration.
This issue affects 1 projects.
The current state of this project is 'Failed', with reason 'Build Failed'.
For reference only, the following projects are affected by this:
    - apacheds-server-integ-test :  Apache Directory Server


Full details are available at:
    http://vmgump.apache.org/gump/public/apacheds/apacheds-server-integ-test/index.html

That said, some information snippets are provided here.

The following annotations (debug/informational/warning/error messages) were provided:
 -WARNING- Overriding Maven2 settings: [/srv/gump/public/workspace/apacheds/server-integ/gump_mvn_settings.xml]
 -DEBUG- (Gump generated) Maven2 Settings in: /srv/gump/public/workspace/apacheds/server-integ/gump_mvn_settings.xml
 -INFO- Failed with reason build failed
 -DEBUG- Maven POM in: /srv/gump/public/workspace/apacheds/server-integ/pom.xml



The following work was performed:
http://vmgump.apache.org/gump/public/apacheds/apacheds-server-integ-test/gump_work/build_apacheds_apacheds-server-integ-test.html
Work Name: build_apacheds_apacheds-server-integ-test (Type: Build)
Work ended in a state of : Failed
Elapsed: 1 min 48 secs
Command Line: mvn --batch-mode --settings /srv/gump/public/workspace/apacheds/server-integ/gump_mvn_settings.xml
package 
[Working Directory: /srv/gump/public/workspace/apacheds/server-integ]
---------------------------------------------
[INFO]    task-segment: [package]
[INFO] ------------------------------------------------------------------------
[INFO] Setting property: classpath.resource.loader.class => 'org.codehaus.plexus.velocity.ContextClassLoaderResourceLoader'.
[INFO] Setting property: velocimacro.messages.on => 'false'.
[INFO] Setting property: resource.loader => 'classpath'.
[INFO] Setting property: resource.manager.logwhenfound => 'false'.
[INFO] [remote-resources:process {execution: default}]
Downloading: http://localhost:8192/repo/m2-snapshot-repository/org/apache/directory/server/apacheds-protocol-ldap/1.5.8-SNAPSHOT/apacheds-protocol-ldap-1.5.8-SNAPSHOT.pom
[INFO] Unable to find resource 'org.apache.directory.server:apacheds-protocol-ldap:pom:1.5.8-SNAPSHOT'
in repository apache.snapshots (https://repository.apache.org/content/repositories/snapshots/)
[INFO] [resources:resources {execution: default-resources}]
[INFO] Using 'UTF-8' encoding to copy filtered resources.
[INFO] Copying 0 resource
[INFO] Copying 3 resources
[INFO] [compiler:compile {execution: default-compile}]
[INFO] Nothing to compile - all classes are up to date
[INFO] [resources:testResources {execution: default-testResources}]
[INFO] Using 'UTF-8' encoding to copy filtered resources.
[INFO] Copying 6 resources
[INFO] Copying 3 resources
[INFO] [compiler:testCompile {execution: default-testCompile}]
[INFO] Nothing to compile - all classes are up to date
[INFO] [surefire:test {execution: default-test}]
[INFO] Surefire report directory: /srv/gump/public/workspace/apacheds/server-integ/target/surefire-reports

-------------------------------------------------------
 T E S T S
-------------------------------------------------------
Running org.apache.directory.server.suites.StockServerISuite
Tests run: 297, Failures: 1, Errors: 0, Skipped: 2, Time elapsed: 96.092 sec <<<
FAILURE!

Results :

Failed tests: 
  testAddPDUExceedingMaxSizeLdapApi(org.apache.directory.server.operations.add.AddIT)

Tests run: 297, Failures: 1, Errors: 0, Skipped: 2

[INFO] ------------------------------------------------------------------------
[ERROR] BUILD FAILURE
[INFO] ------------------------------------------------------------------------
[INFO] There are test failures.

Please refer to /srv/gump/public/workspace/apacheds/server-integ/target/surefire-reports for
the individual test results.
[INFO] ------------------------------------------------------------------------
[INFO] For more information, run Maven with the -e switch
[INFO] ------------------------------------------------------------------------
[INFO] Total time: 1 minute 47 seconds
[INFO] Finished at: Fri Oct 08 03:12:08 UTC 2010
[INFO] Final Memory: 44M/106M
[INFO] ------------------------------------------------------------------------
---------------------------------------------

To subscribe to this information via syndicated feeds:
- RSS: http://vmgump.apache.org/gump/public/apacheds/apacheds-server-integ-test/rss.xml
- Atom: http://vmgump.apache.org/gump/public/apacheds/apacheds-server-integ-test/atom.xml

============================== Gump Tracking Only ===
Produced by Gump version 2.3.
Gump Run 11001807102010, vmgump.apache.org:vmgump:11001807102010
Gump E-mail Identifier (unique within run) #1.


--
Apache Gump
http://gump.apache.org/ [Instance: vmgump]

---------------------------------------------------------------------
To unsubscribe, e-mail: general-unsubscribe@gump.apache.org
For additional commands, e-mail: general-help@gump.apache.org


Mime
View raw message