gump-general mailing list archives

Site index · List index
Message view « Date » · « Thread »
Top « Date » · « Thread »
From g...@vmgump.apache.org
Subject BATCH: All dressed up, with nowhere to go...
Date Tue, 05 Oct 2010 03:58:10 GMT
Dear Gumpmeisters,
            
The following 2 notifys should have been sent

*********************************************************** G U M P
[GUMP@vmgump]: Project solr-test (in module lucene-java) failed
[GUMP@vmgump]: Project cocoon-optional-test (in module cocoon3) failed
*********************************************************** G U M P
[GUMP@vmgump]: Project solr-test (in module lucene-java) failed
To whom it may engage...
        
This is an automated request, but not an unsolicited one. For 
more information please visit http://gump.apache.org/nagged.html, 
and/or contact the folk at general@gump.apache.org.

Project solr-test has an issue affecting its community integration.
This issue affects 1 projects.
The current state of this project is 'Failed', with reason 'Build Failed'.
For reference only, the following projects are affected by this:
    - solr-test :  Java Based Search Engine


Full details are available at:
    http://vmgump.apache.org/gump/public/lucene-java/solr-test/index.html

That said, some information snippets are provided here.

The following annotations (debug/informational/warning/error messages) were provided:
 -INFO- Failed with reason build failed



The following work was performed:
http://vmgump.apache.org/gump/public/lucene-java/solr-test/gump_work/build_lucene-java_solr-test.html
Work Name: build_lucene-java_solr-test (Type: Build)
Work ended in a state of : Failed
Elapsed: 5 mins 53 secs
Command Line: /usr/lib/jvm/java-6-openjdk/bin/java -Djava.awt.headless=true -Xbootclasspath/p:/srv/gump/public/workspace/xml-commons/java/external/build/xml-apis.jar:/srv/gump/public/workspace/xml-xerces2/build/xercesImpl.jar
org.apache.tools.ant.Main -Dgump.merge=/srv/gump/public/gump/work/merge.xml -Dbuild.sysclasspath=only
-Dversion=04102010 test 
[Working Directory: /srv/gump/public/workspace/lucene-java/solr]
CLASSPATH: /usr/lib/jvm/java-6-openjdk/lib/tools.jar:/srv/gump/public/workspace/lucene-java/lucene/build/classes/test:/srv/gump/public/workspace/lucene-java/solr/build/tests:/srv/gump/public/workspace/lucene-java/solr/contrib/clustering/lib/carrot2-core-3.4.0.jar:/srv/gump/public/workspace/lucene-java/solr/contrib/clustering/lib/jackson-core-asl-1.5.2.jar:/srv/gump/public/workspace/lucene-java/solr/contrib/clustering/lib/simple-xml-2.3.5.jar:/srv/gump/public/workspace/lucene-java/solr/lib/apache-solr-noggit-r944541.jar:/srv/gump/public/workspace/lucene-java/solr/lib/easymock.jar:/srv/gump/public/workspace/lucene-java/solr/lib/guava-r05.jar:/srv/gump/public/workspace/ant/dist/lib/ant.jar:/srv/gump/public/workspace/ant/dist/lib/ant-launcher.jar:/srv/gump/public/workspace/ant/dist/lib/ant-jmf.jar:/srv/gump/public/workspace/ant/dist/lib/ant-junit.jar:/srv/gump/public/workspace/ant/dist/lib/ant-swing.jar:/srv/gump/public/workspace/ant/dist/lib/ant-apache-resolver.jar:/srv/gump/pub
 lic/workspace/ant/dist/lib/ant-apache-xalan2.jar:/srv/gump/packages/junit3.8.1/junit.jar:/srv/gump/public/workspace/xml-commons/java/build/resolver.jar:/srv/gump/public/workspace/apache-commons/codec/dist/commons-codec-04102010.jar:/srv/gump/public/workspace/commons-collections-3.x/target/commons-collections-3.3-SNAPSHOT.jar:/srv/gump/public/workspace/commons-sandbox/csv/target/commons-csv-1.0-SNAPSHOT.jar:/srv/gump/public/workspace/apache-commons/fileupload/target/commons-fileupload-04102010.jar:/srv/gump/public/workspace/httpcomponents/oac.hc3x/dist/commons-httpclient.jar:/srv/gump/public/workspace/apache-commons/io/target/commons-io-2.0-SNAPSHOT.jar:/srv/gump/public/workspace/commons-lang-2.x/target/commons-lang-2.6-SNAPSHOT.jar:/srv/gump/public/workspace/apache-commons/logging/target/commons-logging-04102010.jar:/srv/gump/public/workspace/apache-commons/logging/target/commons-logging-api-04102010.jar:/srv/gump/public/workspace/jakarta-servletapi-5/jsr154/dist/lib/servlet
 -api.jar:/srv/gump/packages/javamail-1.4/mail.jar:/srv/gump/packages/javamail-1.4/lib/mailapi.jar:/srv/gump/public/workspace/junit/dist/junit-04102010.jar:/srv/gump/public/workspace/junit/dist/junit-dep-04102010.jar:/srv/gump/public/workspace/lucene-java/lucene/build/lucene-core-04102010.jar:/srv/gump/public/workspace/lucene-java/modules/analysis/build/icu/lucene-analyzers-icu-04102010.jar:/srv/gump/public/workspace/lucene-java/modules/analysis/build/smartcn/lucene-analyzers-smartcn-04102010.jar:/srv/gump/public/workspace/lucene-java/modules/analysis/build/common/lucene-analyzers-common-04102010.jar:/srv/gump/public/workspace/lucene-java/modules/analysis/build/stempel/lucene-analyzers-stempel-04102010.jar:/srv/gump/public/workspace/lucene-java/modules/analysis/build/phonetic/lucene-analyzers-phonetic-04102010.jar:/srv/gump/public/workspace/lucene-java/lucene/build/contrib/ant/lucene-ant-04102010.jar:/srv/gump/public/workspace/lucene-java/lucene/build/contrib/demo/lucene-demo
 -04102010.jar:/srv/gump/public/workspace/lucene-java/lucene/build/contrib/memory/lucene-memory-04102010.jar:/srv/gump/public/workspace/lucene-java/lucene/build/contrib/queries/lucene-queries-04102010.jar:/srv/gump/public/workspace/lucene-java/lucene/build/contrib/highlighter/lucene-highlighter-04102010.jar:/srv/gump/public/workspace/lucene-java/lucene/build/contrib/benchmark/lucene-benchmark-04102010.jar:/srv/gump/public/workspace/lucene-java/lucene/build/contrib/db/bdb/lucene-bdb-04102010.jar:/srv/gump/public/workspace/lucene-java/lucene/build/contrib/db/bdb-je/lucene-bdb-je-04102010.jar:/srv/gump/public/workspace/lucene-java/lucene/build/contrib/instantiated/lucene-instantiated-04102010.jar:/srv/gump/public/workspace/lucene-java/lucene/build/contrib/lucli/lucene-lucli-04102010.jar:/srv/gump/public/workspace/lucene-java/lucene/build/contrib/misc/lucene-misc-04102010.jar:/srv/gump/public/workspace/lucene-java/lucene/build/contrib/queryparser/lucene-queryparser-04102010.jar:/
 srv/gump/public/workspace/lucene-java/lucene/build/contrib/remote/lucene-remote-04102010.jar:/srv/gump/public/workspace/lucene-java/lucene/build/contrib/spatial/lucene-spatial-04102010.jar:/srv/gump/public/workspace/lucene-java/lucene/build/contrib/spellchecker/lucene-spellchecker-04102010.jar:/srv/gump/public/workspace/lucene-java/lucene/build/contrib/swing/lucene-swing-04102010.jar:/srv/gump/public/workspace/lucene-java/lucene/build/contrib/wordnet/lucene-wordnet-04102010.jar:/srv/gump/public/workspace/lucene-java/lucene/build/contrib/xml-query-parser/lucene-xml-query-parser-04102010.jar:/srv/gump/packages/jetty6/jetty-6.1.25.jar:/srv/gump/packages/jetty6/jetty-util-6.1.25.jar:/srv/gump/public/workspace/slf4j/slf4j-api/target/slf4j-api-1.5.9-SNAPSHOT.jar:/srv/gump/public/workspace/slf4j/slf4j-simple/target/slf4j-simple-1.5.9-SNAPSHOT.jar:/srv/gump/public/workspace/slf4j/slf4j-nop/target/slf4j-nop-1.5.9-SNAPSHOT.jar:/srv/gump/public/workspace/slf4j/slf4j-jdk14/target/slf4j-
 jdk14-1.5.9-SNAPSHOT.jar:/srv/gump/public/workspace/slf4j/slf4j-log4j12/target/slf4j-log4j12-1.5.9-SNAPSHOT.jar:/srv/gump/public/workspace/slf4j/slf4j-jcl/target/slf4j-jcl-1.5.9-SNAPSHOT.jar:/srv/gump/public/workspace/slf4j/slf4j-ext/target/slf4j-ext-1.5.9-SNAPSHOT.jar:/srv/gump/public/workspace/slf4j/jcl-over-slf4j/target/jcl-over-slf4j-1.5.9-SNAPSHOT.jar:/srv/gump/public/workspace/slf4j/jcl104-over-slf4j/target/jcl104-over-slf4j-1.5.9-SNAPSHOT.jar:/srv/gump/public/workspace/slf4j/log4j-over-slf4j/target/log4j-over-slf4j-1.5.9-SNAPSHOT.jar:/srv/gump/public/workspace/slf4j/jul-to-slf4j/target/jul-to-slf4j-1.5.9-SNAPSHOT.jar:/srv/gump/public/workspace/slf4j/slf4j-migrator/target/slf4j-migrator-1.5.9-SNAPSHOT.jar:/srv/gump/public/workspace/lucene-java/solr/dist/apache-solr-solrj-04102010.jar:/srv/gump/public/workspace/lucene-java/solr/dist/apache-solr-core-04102010.jar:/srv/gump/public/workspace/lucene-java/solr/dist/apache-solr-cell-04102010.jar:/srv/gump/public/workspace/luc
 ene-java/solr/dist/apache-solr-clustering-04102010.jar:/srv/gump/public/workspace/lucene-java/solr/dist/apache-solr-dataimporthandler-extras-04102010.jar:/srv/gump/public/workspace/lucene-java/solr/dist/apache-solr-dataimporthandler-04102010.jar:/srv/gump/public/workspace/tika/tika-core/target/tika-core-0.8-SNAPSHOT.jar:/srv/gump/public/workspace/tika/tika-parsers/target/tika-parsers-0.8-SNAPSHOT.jar:/srv/gump/public/workspace/velocity-engine/bin/velocity-04102010.jar:/srv/gump/public/workspace/velocity-engine/bin/velocity-04102010-dep.jar:/srv/gump/public/workspace/velocity-tools/velocity-tools-generic/target/velocity-tools-generic-2.1.0-SNAPSHOT.jar:/srv/gump/public/workspace/xml-commons/java/external/build/xml-apis-ext.jar
---------------------------------------------
    [junit] 	documentCache{lookups=0,hits=0,hitratio=0.00,inserts=0,evictions=0,size=0,warmupTime=0,cumulative_lookups=0,cumulative_hits=0,cumulative_hitratio=0.00,cumulative_inserts=0,cumulative_evictions=0}
    [junit] ------------- ---------------- ---------------
    [junit] Testsuite: org.apache.solr.search.TestSort
    [junit] Tests run: 1, Failures: 0, Errors: 0, Time elapsed: 3.673 sec
    [junit] 
    [junit] ------------- Standard Error -----------------
    [junit] 89761 [main] INFO org.apache.solr.util.AbstractSolrTestCase - ####SETUP_START
testSort
    [junit] 89761 [main] INFO org.apache.solr.util.AbstractSolrTestCase - ####SETUP_END testSort
    [junit] 93387 [main] INFO org.apache.solr.util.AbstractSolrTestCase - ####TEARDOWN_START
testSort
    [junit] ------------- ---------------- ---------------
    [junit] 93526 [Shutdown] INFO org.mortbay.log - Shutdown hook executing
    [junit] 93526 [Shutdown] INFO org.mortbay.log - Shutdown hook complete
    [junit] Testsuite: org.apache.solr.spelling.SpellingQueryConverterTest
    [junit] Tests run: 4, Failures: 0, Errors: 0, Time elapsed: 0.09 sec
    [junit] 
    [junit] 94526 [Shutdown] INFO org.mortbay.log - Shutdown hook complete
    [junit] 95527 [Shutdown] INFO org.mortbay.log - Shutdown hook complete
    [junit] 96527 [Shutdown] INFO org.mortbay.log - Shutdown hook complete
    [junit] 97528 [Shutdown] INFO org.mortbay.log - Shutdown hook complete
    [junit] 98529 [Shutdown] INFO org.mortbay.log - Shutdown hook complete
    [junit] 99529 [Shutdown] INFO org.mortbay.log - Shutdown hook complete
    [junit] 100529 [Shutdown] INFO org.mortbay.log - Shutdown hook complete
    [junit] 101530 [Shutdown] INFO org.mortbay.log - Shutdown hook complete
    [junit] 102530 [Shutdown] INFO org.mortbay.log - Shutdown hook complete
    [junit] 103541 [Shutdown] INFO org.mortbay.log - Shutdown hook complete
    [junit] 104542 [Shutdown] INFO org.mortbay.log - Shutdown hook complete
    [junit] 105542 [Shutdown] INFO org.mortbay.log - Shutdown hook complete
    [junit] 106542 [Shutdown] INFO org.mortbay.log - Shutdown hook complete
    [junit] 107549 [Shutdown] INFO org.mortbay.log - Shutdown hook complete
    [junit] 108550 [Shutdown] INFO org.mortbay.log - Shutdown hook complete
    [junit] 109550 [Shutdown] INFO org.mortbay.log - Shutdown hook complete
    [junit] 110551 [Shutdown] INFO org.mortbay.log - Shutdown hook complete
    [junit] 111551 [Shutdown] INFO org.mortbay.log - Shutdown hook complete
    [junit] 112552 [Shutdown] INFO org.mortbay.log - Shutdown hook complete
    [junit] Tests FAILED

BUILD FAILED
/srv/gump/public/workspace/lucene-java/solr/build.xml:388: 
The following error occurred while executing this line:
/srv/gump/public/workspace/lucene-java/solr/build.xml:482: Tests failed!
The following error occurred while executing this line:
/srv/gump/public/workspace/lucene-java/solr/build.xml:482: Tests failed!
The following error occurred while executing this line:
/srv/gump/public/workspace/lucene-java/solr/build.xml:482: Tests failed!
The following error occurred while executing this line:
/srv/gump/public/workspace/lucene-java/solr/build.xml:482: Tests failed!
The following error occurred while executing this line:
/srv/gump/public/workspace/lucene-java/solr/build.xml:482: Tests failed!

Total time: 5 minutes 53 seconds
---------------------------------------------

To subscribe to this information via syndicated feeds:
- RSS: http://vmgump.apache.org/gump/public/lucene-java/solr-test/rss.xml
- Atom: http://vmgump.apache.org/gump/public/lucene-java/solr-test/atom.xml

============================== Gump Tracking Only ===
Produced by Gump version 2.3.
Gump Run 12001804102010, vmgump.apache.org:vmgump:12001804102010
Gump E-mail Identifier (unique within run) #1.

*********************************************************** G U M P
[GUMP@vmgump]: Project cocoon-optional-test (in module cocoon3) failed
To whom it may engage...
        
This is an automated request, but not an unsolicited one. For 
more information please visit http://gump.apache.org/nagged.html, 
and/or contact the folk at general@gump.apache.org.

Project cocoon-optional-test has an issue affecting its community integration.
This issue affects 1 projects.
The current state of this project is 'Failed', with reason 'Build Failed'.
For reference only, the following projects are affected by this:
    - cocoon-optional-test :  Java XML Framework


Full details are available at:
    http://vmgump.apache.org/gump/public/cocoon3/cocoon-optional-test/index.html

That said, some information snippets are provided here.

The following annotations (debug/informational/warning/error messages) were provided:
 -WARNING- Overriding Maven2 settings: [/srv/gump/public/workspace/cocoon3/cocoon-optional/gump_mvn_settings.xml]
 -DEBUG- (Gump generated) Maven2 Settings in: /srv/gump/public/workspace/cocoon3/cocoon-optional/gump_mvn_settings.xml
 -INFO- Failed with reason build failed
 -DEBUG- Maven POM in: /srv/gump/public/workspace/cocoon3/cocoon-optional/pom.xml
 -INFO- Project Reports in: /srv/gump/public/workspace/cocoon3/cocoon-optional/target/surefire-reports



The following work was performed:
http://vmgump.apache.org/gump/public/cocoon3/cocoon-optional-test/gump_work/build_cocoon3_cocoon-optional-test.html
Work Name: build_cocoon3_cocoon-optional-test (Type: Build)
Work ended in a state of : Failed
Elapsed: 15 secs
Command Line: mvn --batch-mode --settings /srv/gump/public/workspace/cocoon3/cocoon-optional/gump_mvn_settings.xml
test 
[Working Directory: /srv/gump/public/workspace/cocoon3/cocoon-optional]
---------------------------------------------
[INFO] [remote-resources:process {execution: default}]
[INFO] [resources:resources {execution: default-resources}]
[INFO] Using 'UTF-8' encoding to copy filtered resources.
[INFO] Copying 2 resources
[INFO] Copying 3 resources
[INFO] [compiler:compile {execution: default-compile}]
[INFO] Nothing to compile - all classes are up to date
[INFO] [resources:testResources {execution: default-testResources}]
[INFO] Using 'UTF-8' encoding to copy filtered resources.
[INFO] Copying 4 resources
[INFO] Copying 3 resources
[INFO] [compiler:testCompile {execution: default-testCompile}]
[INFO] Nothing to compile - all classes are up to date
[INFO] [surefire:test {execution: default-test}]
[INFO] Surefire report directory: /srv/gump/public/workspace/cocoon3/cocoon-optional/target/surefire-reports

-------------------------------------------------------
 T E S T S
-------------------------------------------------------
Running org.apache.cocoon.optional.pipeline.components.sax.jaxb.JAXBGeneratorTestCase
Tests run: 3, Failures: 0, Errors: 0, Skipped: 0, Time elapsed: 0.919 sec
Running org.apache.cocoon.optional.pipeline.components.sax.betwixt.BetwixtBeanGeneratorTest
Tests run: 2, Failures: 0, Errors: 0, Skipped: 0, Time elapsed: 0.202 sec
Running org.apache.cocoon.optional.pipeline.components.sax.fop.FopSerializerTestCase
Tests run: 1, Failures: 0, Errors: 0, Skipped: 0, Time elapsed: 1.082 sec
Running org.apache.cocoon.optional.pipeline.components.sax.solr.SolrConsumerTestCase
Tests run: 1, Failures: 0, Errors: 1, Skipped: 0, Time elapsed: 0.014 sec <<< FAILURE!
Running org.apache.cocoon.optional.pipeline.components.sax.neko.NekoGeneratorTestCase
Tests run: 1, Failures: 0, Errors: 0, Skipped: 0, Time elapsed: 0.07 sec

Results :

Tests in error: 
  testPipelineWithSolrConsumer(org.apache.cocoon.optional.pipeline.components.sax.solr.SolrConsumerTestCase)

Tests run: 8, Failures: 0, Errors: 1, Skipped: 0

[INFO] ------------------------------------------------------------------------
[ERROR] BUILD FAILURE
[INFO] ------------------------------------------------------------------------
[INFO] There are test failures.

Please refer to /srv/gump/public/workspace/cocoon3/cocoon-optional/target/surefire-reports
for the individual test results.
[INFO] ------------------------------------------------------------------------
[INFO] For more information, run Maven with the -e switch
[INFO] ------------------------------------------------------------------------
[INFO] Total time: 14 seconds
[INFO] Finished at: Tue Oct 05 02:47:20 UTC 2010
[INFO] Final Memory: 50M/120M
[INFO] ------------------------------------------------------------------------
---------------------------------------------

To subscribe to this information via syndicated feeds:
- RSS: http://vmgump.apache.org/gump/public/cocoon3/cocoon-optional-test/rss.xml
- Atom: http://vmgump.apache.org/gump/public/cocoon3/cocoon-optional-test/atom.xml

============================== Gump Tracking Only ===
Produced by Gump version 2.3.
Gump Run 12001804102010, vmgump.apache.org:vmgump:12001804102010
Gump E-mail Identifier (unique within run) #2.


--
Apache Gump
http://gump.apache.org/ [Instance: vmgump]

---------------------------------------------------------------------
To unsubscribe, e-mail: general-unsubscribe@gump.apache.org
For additional commands, e-mail: general-help@gump.apache.org


Mime
View raw message