gump-general mailing list archives

Site index · List index
Message view « Date » · « Thread »
Top « Date » · « Thread »
From g...@vmgump.apache.org
Subject BATCH: All dressed up, with nowhere to go...
Date Sat, 25 Sep 2010 17:44:09 GMT
Dear Gumpmeisters,
            
The following 28 notifys should have been sent

*********************************************************** G U M P
[GUMP@vmgump]: Project expat-configure (in module expat) failed
[GUMP@vmgump]: Project hamcrest-java-unit-test (in module hamcrest) failed
[GUMP@vmgump]: Project santuario-tests (in module santuario) failed
[GUMP@vmgump]: Project checkstyle (in module checkstyle) failed
[GUMP@vmgump]: Project velocity-tools-reactor (in module velocity-tools) failed
[GUMP@vmgump]: Project pdfbox-lucene (in module pdfbox) failed
[GUMP@vmgump]: Project tika-parsers-test (in module tika) failed
[GUMP@vmgump]: Project apache-mime4j-reactor (in module james-mime4j) failed
[GUMP@vmgump]: Project tika-reactor (in module tika) failed
[GUMP@vmgump]: Project commons-jci-reactor (in module apache-commons) failed
[GUMP@vmgump]: Project james-jsieve (in module james-jsieve) failed
[GUMP@vmgump]: Project htmlunit (in module htmlunit) failed
[GUMP@vmgump]: Project solr-test (in module lucene-java) failed
[GUMP@vmgump]: Project commons-jelly-tags-ant-test (in module commons-jelly) failed
[GUMP@vmgump]: Project portals-pluto-portal-1.0 (in module portals-pluto-1.0) failed
[GUMP@vmgump]: Project cocoon22-flowscript-impl (in module cocoon) failed
[GUMP@vmgump]: Project tapestry (in module tapestry) failed
[GUMP@vmgump]: Project cocoon22-reactor (in module cocoon) failed
[GUMP@vmgump]: Project ws-commons-axiom (in module ws-axis2-commons) failed
[GUMP@vmgump]: Project openjpa-kernel (in module openjpa) failed
[GUMP@vmgump]: Project portals-pluto-trunk-test (in module portals-pluto-trunk) failed
[GUMP@vmgump]: Project cocoon3-reactor (in module cocoon3) failed
[GUMP@vmgump]: Project portals-bridges-script-test (in module portals-bridges) failed
[GUMP@vmgump]: Project cocoon-optional-test (in module cocoon3) failed
[GUMP@vmgump]: Project ws-axis2 (in module ws-axis2) failed
[GUMP@vmgump]: Project activemq-jaas (in module activemq) failed
[GUMP@vmgump]: Project james-imap-test (in module james-imap) failed
[GUMP@vmgump]: Project james-server (in module james-server) failed
*********************************************************** G U M P
[GUMP@vmgump]: Project expat-configure (in module expat) failed
To whom it may engage...
        
This is an automated request, but not an unsolicited one. For 
more information please visit http://gump.apache.org/nagged.html, 
and/or contact the folk at general@gump.apache.org.

Project expat-configure has an issue affecting its community integration.
This issue affects 22 projects,
 and has been outstanding for 94 runs.
The current state of this project is 'Failed', with reason 'Build Failed'.
For reference only, the following projects are affected by this:
    - apache-httpd-buildconf :  Apache HTTP Server
    - apache-httpd-configure :  Apache HTTP Server
    - apache-httpd-make :  Apache HTTP Server
    - apache-httpd-make-install :  Apache HTTP Server
    - apr-configure :  Apache Portable Runtime
    - apr-iconv-buildconf :  Apache Portable Runtime
    - apr-iconv-configure :  Apache Portable Runtime
    - apr-iconv-make :  Apache Portable Runtime
    - apr-make :  Apache Portable Runtime
    - apr-make-install :  Apache Portable Runtime
    - expat :  The Expat XML Parser
    - expat-configure :  The Expat XML Parser
    - expat-make :  The Expat XML Parser
    - jakarta-tomcat-jk-native :  Connectors to various web servers
    - jakarta-tomcat-jk-native-buildconf :  Connectors to various web servers
    - jakarta-tomcat-jk-native-configure :  Connectors to various web servers
    - logging-log4cxx-ant :  Apache log4cxx
    - logging-log4cxx-ant-no_wchar_t :  Apache log4cxx
    - logging-log4cxx-ant-static :  Apache log4cxx
    - logging-log4cxx-configure :  Apache log4cxx
    - logging-log4cxx-make :  Apache log4cxx
    - logging-log4cxx-make-install :  Apache log4cxx


Full details are available at:
    http://vmgump.apache.org/gump/public/expat/expat-configure/index.html

That said, some information snippets are provided here.

The following annotations (debug/informational/warning/error messages) were provided:
 -INFO- Failed with reason build failed



The following work was performed:
http://vmgump.apache.org/gump/public/expat/expat-configure/gump_work/buildscript_expat_expat-configure.html
Work Name: buildscript_expat_expat-configure (Type: Build)
Work ended in a state of : Failed
Elapsed: 2 secs
Command Line: /srv/gump/public/workspace/expat/configure --prefix=/srv/gump/public/workspace/expat/dest-25092010 
[Working Directory: /srv/gump/public/workspace/expat]
---------------------------------------------
/srv/gump/public/workspace/expat/configure: line 3336: AC_LIBTOOL_WIN32_DLL: command not found
/srv/gump/public/workspace/expat/configure: line 3343: LTOPTIONS_VERSION: command not found
/srv/gump/public/workspace/expat/configure: line 3344: LTSUGAR_VERSION: command not found
/srv/gump/public/workspace/expat/configure: line 3345: LTVERSION_VERSION: command not found
/srv/gump/public/workspace/expat/configure: line 3346: LTOBSOLETE_VERSION: command not found
checking build system type... x86_64-unknown-linux-gnu
checking host system type... x86_64-unknown-linux-gnu
checking for gcc... gcc
checking whether the C compiler works... yes
checking for C compiler default output file name... a.out
checking for suffix of executables... 
checking whether we are cross compiling... no
checking for suffix of object files... o
checking whether we are using the GNU C compiler... yes
checking whether gcc accepts -g... yes
checking for gcc option to accept ISO C89... none needed
checking for a sed that does not truncate output... /bin/sed
/srv/gump/public/workspace/expat/configure: line 4283: syntax error near unexpected token `lt_decl_varnames,'
/srv/gump/public/workspace/expat/configure: line 4283: `lt_if_append_uniq(lt_decl_varnames, SED, , ,'
---------------------------------------------

To subscribe to this information via syndicated feeds:
- RSS: http://vmgump.apache.org/gump/public/expat/expat-configure/rss.xml
- Atom: http://vmgump.apache.org/gump/public/expat/expat-configure/atom.xml

============================== Gump Tracking Only ===
Produced by Gump version 2.3.
Gump Run 14000625092010, vmgump.apache.org:vmgump:14000625092010
Gump E-mail Identifier (unique within run) #1.

*********************************************************** G U M P
[GUMP@vmgump]: Project hamcrest-java-unit-test (in module hamcrest) failed
To whom it may engage...
        
This is an automated request, but not an unsolicited one. For 
more information please visit http://gump.apache.org/nagged.html, 
and/or contact the folk at general@gump.apache.org.

Project hamcrest-java-unit-test has an issue affecting its community integration.
This issue affects 2 projects,
 and has been outstanding for 61 runs.
The current state of this project is 'Failed', with reason 'Build Failed'.
For reference only, the following projects are affected by this:
    - hamcrest-java-unit-test :  Provides a library of matcher objects (also known as constra...
    - jmock2 :  jMock is a library for testing Java code using mock objects.


Full details are available at:
    http://vmgump.apache.org/gump/public/hamcrest/hamcrest-java-unit-test/index.html

That said, some information snippets are provided here.

The following annotations (debug/informational/warning/error messages) were provided:
 -INFO- Failed with reason build failed
 -INFO- Failed to extract fallback artifacts from Gump Repository



The following work was performed:
http://vmgump.apache.org/gump/public/hamcrest/hamcrest-java-unit-test/gump_work/build_hamcrest_hamcrest-java-unit-test.html
Work Name: build_hamcrest_hamcrest-java-unit-test (Type: Build)
Work ended in a state of : Failed
Elapsed: 15 secs
Command Line: /usr/lib/jvm/java-6-openjdk/bin/java -Djava.awt.headless=true -Xbootclasspath/p:/srv/gump/public/workspace/xml-commons/java/external/build/xml-apis.jar:/srv/gump/public/workspace/xml-xerces2/build/xercesImpl.jar org.apache.tools.ant.Main -Dgump.merge=/srv/gump/public/gump/work/merge.xml -Dbuild.sysclasspath=only -Dversion=25092010 unit-test 
[Working Directory: /srv/gump/public/workspace/hamcrest/hamcrest-java]
CLASSPATH: /usr/lib/jvm/java-6-openjdk/lib/tools.jar:/srv/gump/public/workspace/hamcrest/hamcrest-java/lib/integration/easymock-2.2.jar:/srv/gump/public/workspace/hamcrest/hamcrest-java/build/temp/build/hamcrest-unit-test-25092010.jar.contents:/srv/gump/public/workspace/ant/dist/lib/ant.jar:/srv/gump/public/workspace/ant/dist/lib/ant-launcher.jar:/srv/gump/public/workspace/ant/dist/lib/ant-jmf.jar:/srv/gump/public/workspace/ant/dist/lib/ant-junit.jar:/srv/gump/public/workspace/ant/dist/lib/ant-swing.jar:/srv/gump/public/workspace/ant/dist/lib/ant-apache-resolver.jar:/srv/gump/public/workspace/ant/dist/lib/ant-apache-xalan2.jar:/srv/gump/public/workspace/hamcrest/hamcrest-java/build/hamcrest-integration-25092010.jar:/srv/gump/public/workspace/hamcrest/hamcrest-java/build/hamcrest-all-25092010.jar:/srv/gump/packages/jarjar/jarjar-0.6.jar:/srv/gump/public/workspace/jmock/build/dist/jmock-core-25092010.jar:/srv/gump/public/workspace/jmock/build/dist/jmock-cglib-25092010.jar:/srv/
 gump/public/workspace/junit/dist/junit-25092010.jar:/srv/gump/public/workspace/junit/dist/junit-dep-25092010.jar:/srv/gump/packages/qdox-1.6.3/qdox-1.6.3.jar:/srv/gump/public/workspace/xml-commons/java/external/build/xml-apis-ext.jar
---------------------------------------------
     [java]              [T] isIn(Collection<T> collection)
     [java]              [T] isIn(T[] param1)
     [java]              [T] isOneOf(T... elements)
     [java]         [Double] closeTo(double operand, double error)
     [java]      [? super T] comparesEqualTo(T value)
     [java]      [? super T] greaterThan(T value)
     [java]      [? super T] greaterThanOrEqualTo(T value)
     [java]      [? super T] lessThan(T value)
     [java]      [? super T] lessThanOrEqualTo(T value)
     [java]         [String] equalToIgnoringCase(String string)
     [java]         [String] equalToIgnoringWhiteSpace(String string)
     [java]              [T] hasToString(Matcher<String> toStringMatcher)
     [java]              [T] hasToString(String expectedToString)
     [java]       [Class<?>] typeCompatibleWith(Class<T> baseType)
     [java]    [EventObject] eventFrom(Class<EventObject> eventClass, Object source)
     [java]    [EventObject] eventFrom(Object source)
     [java]              [T] hasProperty(String propertyName)
     [java]              [T] hasProperty(String propertyName, Matcher<?> value)
     [java]              [T] samePropertyValuesAs(T expectedBean)
     [java]           [Node] hasXPath(String xPath, Matcher<String> valueMatcher)
     [java]           [Node] hasXPath(String xPath, NamespaceContext namespaceContext, Matcher<String> valueMatcher)
     [java]           [Node] hasXPath(String xPath)
     [java]           [Node] hasXPath(String xPath, NamespaceContext namespaceContext)
    [javac] Compiling 1 source file to /srv/gump/public/workspace/hamcrest/hamcrest-java/build/temp/build/hamcrest-library-25092010.jar.contents
    [javac] Note: /srv/gump/public/workspace/hamcrest/hamcrest-java/build/temp/hamcrest-library/generated-code/org/hamcrest/Matchers.java uses or overrides a deprecated API.
    [javac] Note: Recompile with -Xlint:deprecation for details.
     [copy] Copying 1 file to /srv/gump/public/workspace/hamcrest/hamcrest-java/build/temp/build/hamcrest-library-25092010.jar.contents
      [jar] Building jar: /srv/gump/public/workspace/hamcrest/hamcrest-java/build/hamcrest-library-25092010.jar

integration:

unit-test:
    [mkdir] Created dir: /srv/gump/public/workspace/hamcrest/hamcrest-java/build/temp/build/hamcrest-unit-test-25092010.jar.contents
    [javac] Compiling 62 source files to /srv/gump/public/workspace/hamcrest/hamcrest-java/build/temp/build/hamcrest-unit-test-25092010.jar.contents
    [javac] /srv/gump/public/workspace/hamcrest/hamcrest-java/hamcrest-unit-test/src/main/java/org/hamcrest/collection/IsIterableContainingInOrderTest.java:15: incompatible types; no instance(s) of type variable(s) E,C exist so that org.hamcrest.Matcher<C> conforms to org.hamcrest.Matcher<java.lang.Iterable<? extends org.hamcrest.collection.IsIterableContainingInOrderTest.WithValue>>
    [javac] found   : <E,C>org.hamcrest.Matcher<C>
    [javac] required: org.hamcrest.Matcher<java.lang.Iterable<? extends org.hamcrest.collection.IsIterableContainingInOrderTest.WithValue>>
    [javac]     private final Matcher<Iterable<? extends WithValue>> contains123 = contains(value(1), value(2), value(3));
    [javac]                                                                                ^
    [javac] Note: /srv/gump/public/workspace/hamcrest/hamcrest-java/hamcrest-unit-test/src/main/java/org/hamcrest/core/IsTest.java uses or overrides a deprecated API.
    [javac] Note: Recompile with -Xlint:deprecation for details.
    [javac] Note: Some input files use unchecked or unsafe operations.
    [javac] Note: Recompile with -Xlint:unchecked for details.
    [javac] 1 error

BUILD FAILED
/srv/gump/public/workspace/hamcrest/hamcrest-java/build.xml:117: The following error occurred while executing this line:
/srv/gump/public/workspace/hamcrest/hamcrest-java/build.xml:231: Compile failed; see the compiler error output for details.

Total time: 14 seconds
---------------------------------------------

To subscribe to this information via syndicated feeds:
- RSS: http://vmgump.apache.org/gump/public/hamcrest/hamcrest-java-unit-test/rss.xml
- Atom: http://vmgump.apache.org/gump/public/hamcrest/hamcrest-java-unit-test/atom.xml

============================== Gump Tracking Only ===
Produced by Gump version 2.3.
Gump Run 14000625092010, vmgump.apache.org:vmgump:14000625092010
Gump E-mail Identifier (unique within run) #3.

*********************************************************** G U M P
[GUMP@vmgump]: Project santuario-tests (in module santuario) failed
To whom it may engage...
        
This is an automated request, but not an unsolicited one. For 
more information please visit http://gump.apache.org/nagged.html, 
and/or contact the folk at general@gump.apache.org.

Project santuario-tests has an issue affecting its community integration.
This issue affects 1 projects,
 and has been outstanding for 3 runs.
The current state of this project is 'Failed', with reason 'Build Failed'.
For reference only, the following projects are affected by this:
    - santuario-tests :  XML-Signature Syntax and Processing


Full details are available at:
    http://vmgump.apache.org/gump/public/santuario/santuario-tests/index.html

That said, some information snippets are provided here.

The following annotations (debug/informational/warning/error messages) were provided:
 -DEBUG- Dependency on jce exists, no need to add for property lib.jce.
 -DEBUG- Dependency on junit exists, no need to add for property lib.junit.
 -INFO- Failed with reason build failed



The following work was performed:
http://vmgump.apache.org/gump/public/santuario/santuario-tests/gump_work/build_santuario_santuario-tests.html
Work Name: build_santuario_santuario-tests (Type: Build)
Work ended in a state of : Failed
Elapsed: 57 secs
Command Line: /usr/lib/jvm/java-6-openjdk/bin/java -Djava.awt.headless=true -Dant.build.clonevm=true -Xbootclasspath/p:/srv/gump/public/workspace/xml-commons/java/external/build/xml-apis.jar:/srv/gump/public/workspace/xml-xerces2/build/xercesImpl.jar:/srv/gump/public/workspace/xml-xalan/build/xalan-unbundled.jar:/srv/gump/public/workspace/xml-xalan/build/serializer.jar org.apache.tools.ant.Main -Dgump.merge=/srv/gump/public/gump/work/merge.xml -Dbuild.sysclasspath=only -Djce.download.sha1=c1f0e975e8c8e0a0105787b249a50615b485d109 -Dlib.jce=/srv/gump/packages/jce/jce-jdk13-116.jar -Dlib.junit=/srv/gump/public/workspace/junit/dist/junit-25092010.jar -Djce.download.md5=85c64cd754719a4bc8da7e9aa0e113fd test 
[Working Directory: /srv/gump/public/workspace/santuario]
CLASSPATH: /usr/lib/jvm/java-6-openjdk/lib/tools.jar:/srv/gump/public/workspace/santuario/build/test:/srv/gump/public/workspace/santuario:/srv/gump/public/workspace/santuario/build/xmlsec-25092010.jar:/srv/gump/public/workspace/ant/dist/lib/ant.jar:/srv/gump/public/workspace/ant/dist/lib/ant-launcher.jar:/srv/gump/public/workspace/ant/dist/lib/ant-jmf.jar:/srv/gump/public/workspace/ant/dist/lib/ant-junit.jar:/srv/gump/public/workspace/ant/dist/lib/ant-swing.jar:/srv/gump/public/workspace/ant/dist/lib/ant-apache-resolver.jar:/srv/gump/public/workspace/ant/dist/lib/ant-apache-xalan2.jar:/srv/gump/packages/junit3.8.1/junit.jar:/srv/gump/public/workspace/xml-commons/java/build/resolver.jar:/srv/gump/public/workspace/xml-commons/java/external/build/xml-apis-ext.jar:/srv/gump/packages/jce/jce-jdk13-116.jar:/srv/gump/public/workspace/apache-commons/logging/target/commons-logging-25092010.jar:/srv/gump/public/workspace/apache-commons/logging/target/commons-logging-api-25092010.jar:/s
 rv/gump/public/workspace/junit/dist/junit-25092010.jar:/srv/gump/public/workspace/junit/dist/junit-dep-25092010.jar
---------------------------------------------
    [junit] Testcase: test_signatureAlgorithms_signatures_hMACSignature took 0.014 sec
    [junit] Testcase: test_coreFeatures_signatures_manifestSignature_core took 0.029 sec
    [junit] Testcase: test_coreFeatures_signatures_manifestSignature_manifest took 0.045 sec
    [junit] Testcase: test_coreFeatures_signatures_signatureTypesSignature took 0.163 sec
    [junit] Testcase: test_coreFeatures_signatures_anonymousReferenceSignature took 0.02 sec
    [junit] Testcase: test_signatureAlgorithms_signatures_dSASignature took 0.105 sec
    [junit] Testcase: test_signatureAlgorithms_signatures_rSASignature took 0.01 sec
    [junit] Testcase: test_transforms_signatures_base64DecodeSignature took 1.212 sec
    [junit] Testcase: test_transforms_signatures_c14nSignature took 0.169 sec
    [junit] Testcase: test_transforms_signatures_envelopedSignatureSignature took 0.014 sec
    [junit] Testcase: test_transforms_signatures_xPathSignature took 0.017 sec
    [junit] Testcase: test_enveloping took 0.036 sec
    [junit] Testcase: test_enveloped took 0.01 sec
    [junit] Testcase: test_Y1 took 0.108 sec
    [junit] Testcase: test_Y2 took 0.144 sec
    [junit] Testcase: test_Y3 took 0.155 sec
    [junit] Testcase: test_Y4 took 7.644 sec
    [junit] Testcase: test_xfilter2 took 0.086 sec
    [junit] Testcase: testAES128ElementAES192KWCipherUsingKEK took 0.239 sec
    [junit] Testcase: testAES128ElementRSAKWCipherUsingKEK took 1.853 sec
    [junit] Testcase: testAES192ElementAES256KWCipher took 0.118 sec
    [junit] Testcase: testTrippleDesElementCipher took 0.103 sec
    [junit] Testcase: testAes128ElementCipher took 0.168 sec
    [junit] Testcase: testAes192ElementCipher took 0.104 sec
    [junit] Testcase: testAes265ElementCipher took 0.106 sec
    [junit] Testcase: testTrippleDesDocumentCipher took 0.611 sec
    [junit] Testcase: testSameDocumentCipherReference took 0.018 sec
    [junit] Testcase: testSerializedData took 0.057 sec
    [junit] Testcase: testEncryptedKeyWithRecipient took 0.021 sec
    [junit] Testcase: test_five_content_3des_cbc took 0.057 sec
    [junit] Testcase: test_five_content_aes256_cbc took 0.037 sec
    [junit] Testcase: test_five_content_aes128_cbc_kw_aes192 took 0.035 sec
    [junit] Testcase: test_five_content_3des_cbc_kw_aes128 took 0.033 sec
    [junit] Testcase: test_five_content_aes128_cbc_rsa_15 took 0.102 sec
    [junit] Testcase: test_five_element_aes192_cbc_ref took 0.03 sec
    [junit] Testcase: test_five_data_aes128_cbc took 0.015 sec
    [junit] Testcase: test_five_data_aes256_cbc_3des took 0.019 sec
    [junit] Testcase: test_five_data_aes192_cbc_aes256 took 0.017 sec
    [junit] Testcase: test_five_data_3des_cbc_rsa_oaep took 0.097 sec
    [junit] Testcase: testContentRemoved took 0.005 sec
    [junit] Test org.apache.xml.security.test.AllTests FAILED
[junitreport] Processing /srv/gump/public/workspace/santuario/build/docs/xml/junit/TESTS-TestSuites.xml to /tmp/null1711891054
[junitreport] Loading stylesheet jar:file:/srv/gump/public/workspace/ant/dist/lib/ant-junit.jar!/org/apache/tools/ant/taskdefs/optional/junit/xsl/junit-frames.xsl
[junitreport] Transform time: 1369ms
[junitreport] Deleting: /tmp/null1711891054

BUILD FAILED
/srv/gump/public/workspace/santuario/build.xml:381: Unit Tests Failed

Total time: 57 seconds
---------------------------------------------

To subscribe to this information via syndicated feeds:
- RSS: http://vmgump.apache.org/gump/public/santuario/santuario-tests/rss.xml
- Atom: http://vmgump.apache.org/gump/public/santuario/santuario-tests/atom.xml

============================== Gump Tracking Only ===
Produced by Gump version 2.3.
Gump Run 14000625092010, vmgump.apache.org:vmgump:14000625092010
Gump E-mail Identifier (unique within run) #7.

*********************************************************** G U M P
[GUMP@vmgump]: Project checkstyle (in module checkstyle) failed
To whom it may engage...
        
This is an automated request, but not an unsolicited one. For 
more information please visit http://gump.apache.org/nagged.html, 
and/or contact the folk at general@gump.apache.org.

Project checkstyle has an issue affecting its community integration.
This issue affects 5 projects,
 and has been outstanding for 9 runs.
The current state of this project is 'Failed', with reason 'Missing Build Outputs'.
For reference only, the following projects are affected by this:
    - checkstyle :  Java style checker
    - checkstyle-test :  Java style checker
    - tomcat-trunk :  Java Servlet 3.0, Java Server Pages 2.2 & Expression Languag...
    - tomcat-trunk-test :  Java Servlet 3.0, Java Server Pages 2.2 & Expression Languag...
    - tomcat-trunk-validate :  Java Servlet 3.0, Java Server Pages 2.2 & Expression Languag...


Full details are available at:
    http://vmgump.apache.org/gump/public/checkstyle/checkstyle/index.html

That said, some information snippets are provided here.

The following annotations (debug/informational/warning/error messages) were provided:
 -DEBUG- (Gump generated) Maven2 Settings in: /srv/gump/public/workspace/checkstyle/gump_mvn_settings.xml
 -DEBUG- Maven POM in: /srv/gump/public/workspace/checkstyle/pom.xml
 -INFO- Failed with reason missing build outputs
 -ERROR- Missing Output: /srv/gump/public/workspace/checkstyle/target/dist/checkstyle-25092010/checkstyle-25092010.jar
 -ERROR- Missing Output: /srv/gump/public/workspace/checkstyle/target/dist/checkstyle-25092010/checkstyle-all-25092010.jar
 -ERROR- No such directory (where output is expected) : /srv/gump/public/workspace/checkstyle/target/dist/checkstyle-25092010
 -ERROR- No such directory (where output is expected) : /srv/gump/public/workspace/checkstyle/target/dist/checkstyle-25092010
 -INFO- Failed to extract fallback artifacts from Gump Repository



The following work was performed:
http://vmgump.apache.org/gump/public/checkstyle/checkstyle/gump_work/build_checkstyle_checkstyle.html
Work Name: build_checkstyle_checkstyle (Type: Build)
Work ended in a state of : Success
Elapsed: 1 min 47 secs
Command Line: mvn --batch-mode -DskipTests=true --settings /srv/gump/public/workspace/checkstyle/gump_mvn_settings.xml install 
[Working Directory: /srv/gump/public/workspace/checkstyle]
---------------------------------------------

[INFO] [antlr:generate {execution: default}]
[INFO] Using Antlr grammar: /srv/gump/public/workspace/checkstyle/src/checkstyle/com/puppycrawl/tools/checkstyle/grammars/java.g
ANTLR Parser Generator   Version 2.7.7 (20060906)   1989-2005
/srv/gump/public/workspace/checkstyle/src/checkstyle/com/puppycrawl/tools/checkstyle/grammars/java.g:913: warning:Syntactic predicate superfluous for single alternative

[INFO] [resources:resources {execution: default-resources}]
[INFO] Using 'iso-8859-1' encoding to copy filtered resources.
[INFO] Copying 113 resources
[INFO] Copying 1 resource
[INFO] [compiler:compile {execution: default-compile}]
[INFO] Compiling 294 source files to /srv/gump/public/workspace/checkstyle/target/classes
Downloading: http://localhost:8192/maven2/org/apache/ant/ant-nodeps/1.7.1/ant-nodeps-1.7.1.pom

Downloading: http://localhost:8192/maven2/org/apache/ant/ant-nodeps/1.7.1/ant-nodeps-1.7.1.jar

[INFO] [antrun:run {execution: ant-phase-compile}]
[INFO] Executing tasks

execute:
[propertyfile] Creating new property file: /srv/gump/public/workspace/checkstyle/target/classes/checkstylecompilation.properties
  [javadoc] Generating Javadoc
  [javadoc] Javadoc execution
  [javadoc] Loading source file /srv/gump/public/workspace/checkstyle/src/checkstyle/com/puppycrawl/tools/checkstyle/api/TokenTypes.java...
  [javadoc] Constructing Javadoc information...
[INFO] Executed tasks
[INFO] [resources:testResources {execution: default-testResources}]
[INFO] Using 'iso-8859-1' encoding to copy filtered resources.
[INFO] skip non existing resourceDirectory /srv/gump/public/workspace/checkstyle/src/test/resources
[INFO] [compiler:testCompile {execution: default-testCompile}]
[INFO] Compiling 169 source files to /srv/gump/public/workspace/checkstyle/target/test-classes
[INFO] [surefire:test {execution: default-test}]
[INFO] Tests are skipped.
[INFO] [antrun:run {execution: ant-phase-package}]
[INFO] Executing tasks

execute:
[checkstyle] Running Checkstyle 5.3-SNAPSHOT on 408 files
[INFO] Executed tasks
[INFO] [jar:jar {execution: default-jar}]
[INFO] Building jar: /srv/gump/public/workspace/checkstyle/target/checkstyle-5.3-SNAPSHOT.jar
[INFO] [install:install {execution: default-install}]
[INFO] Installing /srv/gump/public/workspace/checkstyle/target/checkstyle-5.3-SNAPSHOT.jar to /srv/gump/public/workspace/mvnlocalrepo/shared/com/puppycrawl/tools/checkstyle/5.3-SNAPSHOT/checkstyle-5.3-SNAPSHOT.jar
[INFO] ------------------------------------------------------------------------
[INFO] BUILD SUCCESSFUL
[INFO] ------------------------------------------------------------------------
[INFO] Total time: 1 minute 46 seconds
[INFO] Finished at: Sat Sep 25 09:38:02 UTC 2010
[INFO] Final Memory: 50M/120M
[INFO] ------------------------------------------------------------------------
---------------------------------------------

To subscribe to this information via syndicated feeds:
- RSS: http://vmgump.apache.org/gump/public/checkstyle/checkstyle/rss.xml
- Atom: http://vmgump.apache.org/gump/public/checkstyle/checkstyle/atom.xml

============================== Gump Tracking Only ===
Produced by Gump version 2.3.
Gump Run 14000625092010, vmgump.apache.org:vmgump:14000625092010
Gump E-mail Identifier (unique within run) #8.

*********************************************************** G U M P
[GUMP@vmgump]: Project velocity-tools-reactor (in module velocity-tools) failed
To whom it may engage...
        
This is an automated request, but not an unsolicited one. For 
more information please visit http://gump.apache.org/nagged.html, 
and/or contact the folk at general@gump.apache.org.

Project velocity-tools-reactor has an issue affecting its community integration.
This issue affects 1 projects,
 and has been outstanding for 7 runs.
The current state of this project is 'Failed', with reason 'Missing Build Outputs'.
For reference only, the following projects are affected by this:
    - velocity-tools-reactor :  VelocityTools project


Full details are available at:
    http://vmgump.apache.org/gump/public/velocity-tools/velocity-tools-reactor/index.html

That said, some information snippets are provided here.

The following annotations (debug/informational/warning/error messages) were provided:
 -WARNING- Overriding Maven2 settings: [/srv/gump/public/workspace/velocity-tools/gump_mvn_settings.xml]
 -DEBUG- (Gump generated) Maven2 Settings in: /srv/gump/public/workspace/velocity-tools/gump_mvn_settings.xml
 -DEBUG- Maven POM in: /srv/gump/public/workspace/velocity-tools/pom.xml
 -INFO- Failed with reason missing build outputs
 -ERROR- Missing Output: /srv/gump/public/workspace/velocity-tools/dist/velocity-tools-25092010.jar
 -ERROR- Missing Output: /srv/gump/public/workspace/velocity-tools/dist/velocity-tools-view-25092010.jar
 -ERROR- No such directory (where output is expected) : /srv/gump/public/workspace/velocity-tools/dist
 -ERROR- No such directory (where output is expected) : /srv/gump/public/workspace/velocity-tools/dist
 -INFO- Failed to extract fallback artifacts from Gump Repository



The following work was performed:
http://vmgump.apache.org/gump/public/velocity-tools/velocity-tools-reactor/gump_work/build_velocity-tools_velocity-tools-reactor.html
Work Name: build_velocity-tools_velocity-tools-reactor (Type: Build)
Work ended in a state of : Success
Elapsed: 1 min 33 secs
Command Line: mvn --batch-mode -DskipTests=true --settings /srv/gump/public/workspace/velocity-tools/gump_mvn_settings.xml package 
[Working Directory: /srv/gump/public/workspace/velocity-tools]
---------------------------------------------
[INFO] Copying 3 resources
[INFO] [compiler:compile {execution: default-compile}]
[INFO] Compiling 10 source files to /srv/gump/public/workspace/velocity-tools/velocity-tools-examples/velocity-tools-examples-struts/target/classes
[INFO] [resources:testResources {execution: default-testResources}]
[INFO] Using 'UTF-8' encoding to copy filtered resources.
[INFO] Copying 0 resource
[INFO] Copying 3 resources
[INFO] [compiler:testCompile {execution: default-testCompile}]
[INFO] Nothing to compile - all classes are up to date
[INFO] [surefire:test {execution: default-test}]
[INFO] Tests are skipped.
[INFO] [war:war {execution: default-war}]
[INFO] Packaging webapp
[INFO] Assembling webapp[velocity-tools-examples-struts] in [/srv/gump/public/workspace/velocity-tools/velocity-tools-examples/velocity-tools-examples-struts/target/velocity-tools-examples-struts]
[INFO] Processing war project
[INFO] Copying webapp resources[/srv/gump/public/workspace/velocity-tools/velocity-tools-examples/velocity-tools-examples-struts/src/main/webapp]
[INFO] Webapp assembled in[637 msecs]
[INFO] Building war: /srv/gump/public/workspace/velocity-tools/velocity-tools-examples/velocity-tools-examples-struts/target/velocity-tools-examples-struts.war
[INFO] ------------------------------------------------------------------------
[INFO] Building Apache Velocity Tools - Assembly
[INFO]    task-segment: [package]
[INFO] ------------------------------------------------------------------------
[INFO] [remote-resources:process {execution: default}]
[INFO] [site:attach-descriptor {execution: default-attach-descriptor}]
[INFO] 
[INFO] 
[INFO] ------------------------------------------------------------------------
[INFO] Reactor Summary:
[INFO] ------------------------------------------------------------------------
[INFO] VelocityTools ......................................... SUCCESS [6.264s]
[INFO] Apache Velocity Tools - Generic tools ................. SUCCESS [3.123s]
[INFO] Apache Velocity Tools - XML tools ..................... SUCCESS [6.576s]
[INFO] Apache Velocity Tools - View tools .................... SUCCESS [2.742s]
[INFO] Apache Velocity Tools - JSP support ................... SUCCESS [2.973s]
[INFO] Apache Velocity Tools - View tools - Velocity Engine 2.x support  SUCCESS [1.945s]
[INFO] Apache Velocity Tools - Struts tools .................. SUCCESS [22.060s]
[INFO] Apache Velocity Tools - Uberjar ....................... SUCCESS [2.282s]
[INFO] Apache Velocity Tools - Examples ...................... SUCCESS [0.039s]
[INFO] Apache Velocity Tools Examples - Showcase ............. SUCCESS [36.829s]
[INFO] Apache Velocity Tools Examples - Simple ............... SUCCESS [1.870s]
[INFO] Apache Velocity Tools Examples - Struts ............... SUCCESS [3.431s]
[INFO] Apache Velocity Tools - Assembly ...................... SUCCESS [0.332s]
[INFO] ------------------------------------------------------------------------
[INFO] ------------------------------------------------------------------------
[INFO] BUILD SUCCESSFUL
[INFO] ------------------------------------------------------------------------
[INFO] Total time: 1 minute 32 seconds
[INFO] Finished at: Sat Sep 25 10:27:05 UTC 2010
[INFO] Final Memory: 87M/208M
[INFO] ------------------------------------------------------------------------
---------------------------------------------

To subscribe to this information via syndicated feeds:
- RSS: http://vmgump.apache.org/gump/public/velocity-tools/velocity-tools-reactor/rss.xml
- Atom: http://vmgump.apache.org/gump/public/velocity-tools/velocity-tools-reactor/atom.xml

============================== Gump Tracking Only ===
Produced by Gump version 2.3.
Gump Run 14000625092010, vmgump.apache.org:vmgump:14000625092010
Gump E-mail Identifier (unique within run) #10.

*********************************************************** G U M P
[GUMP@vmgump]: Project pdfbox-lucene (in module pdfbox) failed
To whom it may engage...
        
This is an automated request, but not an unsolicited one. For 
more information please visit http://gump.apache.org/nagged.html, 
and/or contact the folk at general@gump.apache.org.

Project pdfbox-lucene has an issue affecting its community integration.
This issue affects 1 projects,
 and has been outstanding for 13 runs.
The current state of this project is 'Failed', with reason 'Build Failed'.
For reference only, the following projects are affected by this:
    - pdfbox-lucene :  Apache PDFBox is an open source Java PDF library for working...


Full details are available at:
    http://vmgump.apache.org/gump/public/pdfbox/pdfbox-lucene/index.html

That said, some information snippets are provided here.

The following annotations (debug/informational/warning/error messages) were provided:
 -DEBUG- Sole jar output [pdfbox-lucene-*[0-9T].jar] identifier set to project name
 -DEBUG- (Gump generated) Maven2 Settings in: /srv/gump/public/workspace/pdfbox/lucene/gump_mvn_settings.xml
 -INFO- Failed with reason build failed
 -DEBUG- Maven POM in: /srv/gump/public/workspace/pdfbox/lucene/pom.xml
 -INFO- Failed to extract fallback artifacts from Gump Repository



The following work was performed:
http://vmgump.apache.org/gump/public/pdfbox/pdfbox-lucene/gump_work/build_pdfbox_pdfbox-lucene.html
Work Name: build_pdfbox_pdfbox-lucene (Type: Build)
Work ended in a state of : Failed
Elapsed: 14 secs
Command Line: mvn --batch-mode --settings /srv/gump/public/workspace/pdfbox/lucene/gump_mvn_settings.xml package 
[Working Directory: /srv/gump/public/workspace/pdfbox/lucene]
---------------------------------------------
1289K downloaded  (lucene-core-2.4.1.jar)
Downloading: http://localhost:8192/maven2/org/apache/lucene/lucene-demos/2.4.1/lucene-demos-2.4.1.jar
3352K downloaded  (pdfbox-1.3.0-SNAPSHOT.jar)
57K downloaded  (lucene-demos-2.4.1.jar)
[INFO] Setting property: classpath.resource.loader.class => 'org.codehaus.plexus.velocity.ContextClassLoaderResourceLoader'.
[INFO] Setting property: velocimacro.messages.on => 'false'.
[INFO] Setting property: resource.loader => 'classpath'.
[INFO] Setting property: resource.manager.logwhenfound => 'false'.
[INFO] [remote-resources:process {execution: default}]
[INFO] [resources:resources {execution: default-resources}]
[INFO] Using 'ISO-8859-1' encoding to copy filtered resources.
[INFO] skip non existing resourceDirectory /srv/gump/public/workspace/pdfbox/lucene/src/main/resources
[INFO] Copying 3 resources
[INFO] [compiler:compile {execution: default-compile}]
[INFO] Compiling 4 source files to /srv/gump/public/workspace/pdfbox/lucene/target/classes
[INFO] ------------------------------------------------------------------------
[ERROR] BUILD FAILURE
[INFO] ------------------------------------------------------------------------
[INFO] Compilation failure

/srv/gump/public/workspace/pdfbox/lucene/src/main/java/org/apache/pdfbox/lucene/IndexFiles.java:[25,42] package org.apache.lucene.analysis.standard does not exist

/srv/gump/public/workspace/pdfbox/lucene/src/main/java/org/apache/pdfbox/lucene/IndexFiles.java:[34,30] cannot find symbol
symbol  : class TermEnum
location: package org.apache.lucene.index

/srv/gump/public/workspace/pdfbox/lucene/src/main/java/org/apache/pdfbox/lucene/IndexFiles.java:[59,12] cannot find symbol
symbol  : class TermEnum
location: class org.apache.pdfbox.lucene.IndexFiles

/srv/gump/public/workspace/pdfbox/lucene/src/main/java/org/apache/pdfbox/lucene/IndexFiles.java:[120,48] cannot find symbol
symbol  : class StandardAnalyzer
location: class org.apache.pdfbox.lucene.IndexFiles

/srv/gump/public/workspace/pdfbox/lucene/src/main/java/org/apache/pdfbox/lucene/IndexFiles.java:[120,21] internal error; cannot instantiate org.apache.lucene.index.IndexWriter.<init> at org.apache.lucene.index.IndexWriter to ()

/srv/gump/public/workspace/pdfbox/lucene/src/main/java/org/apache/pdfbox/lucene/IndexFiles.java:[163,32] cannot find symbol
symbol  : method open(java.lang.String)
location: class org.apache.lucene.index.IndexReader

/srv/gump/public/workspace/pdfbox/lucene/src/main/java/org/apache/pdfbox/lucene/IndexFiles.java:[164,28] terms(java.lang.String) in org.apache.lucene.index.IndexReader cannot be applied to (org.apache.lucene.index.Term)


[INFO] ------------------------------------------------------------------------
[INFO] For more information, run Maven with the -e switch
[INFO] ------------------------------------------------------------------------
[INFO] Total time: 13 seconds
[INFO] Finished at: Sat Sep 25 10:53:02 UTC 2010
[INFO] Final Memory: 28M/69M
[INFO] ------------------------------------------------------------------------
---------------------------------------------

To subscribe to this information via syndicated feeds:
- RSS: http://vmgump.apache.org/gump/public/pdfbox/pdfbox-lucene/rss.xml
- Atom: http://vmgump.apache.org/gump/public/pdfbox/pdfbox-lucene/atom.xml

============================== Gump Tracking Only ===
Produced by Gump version 2.3.
Gump Run 14000625092010, vmgump.apache.org:vmgump:14000625092010
Gump E-mail Identifier (unique within run) #12.

*********************************************************** G U M P
[GUMP@vmgump]: Project tika-parsers-test (in module tika) failed
To whom it may engage...
        
This is an automated request, but not an unsolicited one. For 
more information please visit http://gump.apache.org/nagged.html, 
and/or contact the folk at general@gump.apache.org.

Project tika-parsers-test has an issue affecting its community integration.
This issue affects 1 projects,
 and has been outstanding for 7 runs.
The current state of this project is 'Failed', with reason 'Build Failed'.
For reference only, the following projects are affected by this:
    - tika-parsers-test :  Apache Tika is a toolkit for detecting and extracting metada...


Full details are available at:
    http://vmgump.apache.org/gump/public/tika/tika-parsers-test/index.html

That said, some information snippets are provided here.

The following annotations (debug/informational/warning/error messages) were provided:
 -WARNING- Overriding Maven2 settings: [/srv/gump/public/workspace/tika/tika-parsers/gump_mvn_settings.xml]
 -DEBUG- (Gump generated) Maven2 Settings in: /srv/gump/public/workspace/tika/tika-parsers/gump_mvn_settings.xml
 -INFO- Failed with reason build failed
 -DEBUG- Maven POM in: /srv/gump/public/workspace/tika/tika-parsers/pom.xml
 -INFO- Project Reports in: /srv/gump/public/workspace/tika/tika-parsers/target/surefire-reports



The following work was performed:
http://vmgump.apache.org/gump/public/tika/tika-parsers-test/gump_work/build_tika_tika-parsers-test.html
Work Name: build_tika_tika-parsers-test (Type: Build)
Work ended in a state of : Failed
Elapsed: 51 secs
Command Line: mvn --batch-mode --settings /srv/gump/public/workspace/tika/tika-parsers/gump_mvn_settings.xml test 
[Working Directory: /srv/gump/public/workspace/tika/tika-parsers]
---------------------------------------------
Tests run: 2, Failures: 0, Errors: 0, Skipped: 0, Time elapsed: 0.13 sec
Running org.apache.tika.parser.mbox.MboxParserTest
Tests run: 5, Failures: 0, Errors: 0, Skipped: 0, Time elapsed: 0.457 sec
Running org.apache.tika.parser.pkg.Bzip2ParserTest
Tests run: 2, Failures: 0, Errors: 0, Skipped: 0, Time elapsed: 0.523 sec
Running org.apache.tika.parser.microsoft.ooxml.OOXMLContainerExtractionTest
Tests run: 3, Failures: 0, Errors: 0, Skipped: 0, Time elapsed: 5.528 sec
Running org.apache.tika.parser.microsoft.WordParserTest
Tests run: 2, Failures: 0, Errors: 0, Skipped: 0, Time elapsed: 0.01 sec
Running org.apache.tika.parser.image.TiffParserTest
Tests run: 1, Failures: 0, Errors: 0, Skipped: 0, Time elapsed: 0.01 sec
Running org.apache.tika.parser.epub.EpubParserTest
Tests run: 1, Failures: 0, Errors: 0, Skipped: 0, Time elapsed: 0.008 sec
Running org.apache.tika.mime.MimeTypesTest
Tests run: 6, Failures: 0, Errors: 0, Skipped: 0, Time elapsed: 0.005 sec
Running org.apache.tika.parser.asm.ClassParserTest
Tests run: 1, Failures: 0, Errors: 0, Skipped: 0, Time elapsed: 0.05 sec
Running org.apache.tika.parser.opendocument.ODFParserTest
Tests run: 1, Failures: 0, Errors: 0, Skipped: 0, Time elapsed: 0.027 sec
Running org.apache.tika.parser.video.FLVParserTest
Tests run: 1, Failures: 0, Errors: 0, Skipped: 0, Time elapsed: 0.038 sec
Running org.apache.tika.parser.audio.AudioParserTest
Tests run: 3, Failures: 0, Errors: 0, Skipped: 0, Time elapsed: 0.198 sec
Running org.apache.tika.parser.microsoft.ooxml.OOXMLParserTest
Tests run: 6, Failures: 0, Errors: 0, Skipped: 0, Time elapsed: 1.387 sec
Running org.apache.tika.TestParsers
Tests run: 12, Failures: 0, Errors: 0, Skipped: 0, Time elapsed: 0.88 sec
Running org.apache.tika.parser.html.HtmlParserTest
Tests run: 25, Failures: 0, Errors: 0, Skipped: 0, Time elapsed: 0.795 sec

Results :

Failed tests: 
  testEmbeddedOfficeFiles(org.apache.tika.parser.microsoft.POIContainerExtractionTest)

Tests run: 177, Failures: 1, Errors: 0, Skipped: 0

[INFO] ------------------------------------------------------------------------
[ERROR] BUILD FAILURE
[INFO] ------------------------------------------------------------------------
[INFO] There are test failures.

Please refer to /srv/gump/public/workspace/tika/tika-parsers/target/surefire-reports for the individual test results.
[INFO] ------------------------------------------------------------------------
[INFO] For more information, run Maven with the -e switch
[INFO] ------------------------------------------------------------------------
[INFO] Total time: 50 seconds
[INFO] Finished at: Sat Sep 25 11:49:51 UTC 2010
[INFO] Final Memory: 25M/60M
[INFO] ------------------------------------------------------------------------
---------------------------------------------

To subscribe to this information via syndicated feeds:
- RSS: http://vmgump.apache.org/gump/public/tika/tika-parsers-test/rss.xml
- Atom: http://vmgump.apache.org/gump/public/tika/tika-parsers-test/atom.xml

============================== Gump Tracking Only ===
Produced by Gump version 2.3.
Gump Run 14000625092010, vmgump.apache.org:vmgump:14000625092010
Gump E-mail Identifier (unique within run) #16.

*********************************************************** G U M P
[GUMP@vmgump]: Project apache-mime4j-reactor (in module james-mime4j) failed
To whom it may engage...
        
This is an automated request, but not an unsolicited one. For 
more information please visit http://gump.apache.org/nagged.html, 
and/or contact the folk at general@gump.apache.org.

Project apache-mime4j-reactor has an issue affecting its community integration.
This issue affects 1 projects,
 and has been outstanding for 16 runs.
The current state of this project is 'Failed', with reason 'Build Failed'.
For reference only, the following projects are affected by this:
    - apache-mime4j-reactor :  Java stream based MIME message parser


Full details are available at:
    http://vmgump.apache.org/gump/public/james-mime4j/apache-mime4j-reactor/index.html

That said, some information snippets are provided here.

The following annotations (debug/informational/warning/error messages) were provided:
 -WARNING- Overriding Maven2 settings: [/srv/gump/public/workspace/james-mime4j/gump_mvn_settings.xml]
 -DEBUG- (Gump generated) Maven2 Settings in: /srv/gump/public/workspace/james-mime4j/gump_mvn_settings.xml
 -INFO- Failed with reason build failed
 -DEBUG- Maven POM in: /srv/gump/public/workspace/james-mime4j/pom.xml



The following work was performed:
http://vmgump.apache.org/gump/public/james-mime4j/apache-mime4j-reactor/gump_work/build_james-mime4j_apache-mime4j-reactor.html
Work Name: build_james-mime4j_apache-mime4j-reactor (Type: Build)
Work ended in a state of : Failed
Elapsed: 51 secs
Command Line: mvn --batch-mode --settings /srv/gump/public/workspace/james-mime4j/gump_mvn_settings.xml package 
[Working Directory: /srv/gump/public/workspace/james-mime4j]
---------------------------------------------
Running org.apache.james.mime4j.stream.MimeTokenStreamTest
Tests run: 1, Failures: 0, Errors: 0, Skipped: 0, Time elapsed: 0.007 sec
Running org.apache.james.mime4j.TestUtil
Tests run: 0, Failures: 0, Errors: 0, Skipped: 0, Time elapsed: 0.003 sec
Running org.apache.james.mime4j.io.PositionInputStreamTest
Tests run: 1, Failures: 0, Errors: 0, Skipped: 0, Time elapsed: 0.004 sec
Running org.apache.james.mime4j.stream.MimeTokenNoRecurseTest
Tests run: 4, Failures: 0, Errors: 0, Skipped: 0, Time elapsed: 0.007 sec
Running org.apache.james.mime4j.parser.MimeStreamParserTest
Tests run: 11, Failures: 0, Errors: 0, Skipped: 0, Time elapsed: 0.074 sec
Running org.apache.james.mime4j.codec.DecoderUtilTest
Tests run: 13, Failures: 0, Errors: 0, Skipped: 0, Time elapsed: 0.041 sec
Running org.apache.james.mime4j.MimeExceptionTest
Tests run: 3, Failures: 0, Errors: 0, Skipped: 0, Time elapsed: 0.003 sec
Running org.apache.james.mime4j.codec.QuotedPrintableEncodeTest
Tests run: 5, Failures: 0, Errors: 0, Skipped: 0, Time elapsed: 0.01 sec
Running org.apache.james.mime4j.MimeIOExceptionTest
Tests run: 1, Failures: 0, Errors: 0, Skipped: 0, Time elapsed: 0.006 sec
Running org.apache.james.mime4j.codec.QuotedPrintableInputStreamTest
Tests run: 19, Failures: 0, Errors: 0, Skipped: 0, Time elapsed: 0.009 sec
Running org.apache.james.mime4j.stream.MimeTokenStreamBodyDescriptorTest
Tests run: 2, Failures: 0, Errors: 0, Skipped: 0, Time elapsed: 0.008 sec
Running org.apache.james.mime4j.codec.CodecUtilTest
Tests run: 5, Failures: 0, Errors: 0, Skipped: 0, Time elapsed: 0.018 sec
Running org.apache.james.mime4j.stream.MultipartStreamTest
Tests run: 2, Failures: 0, Errors: 0, Skipped: 0, Time elapsed: 0.003 sec

Results :

Tests run: 225, Failures: 0, Errors: 0, Skipped: 0

[INFO] [jar:jar {execution: default-jar}]
[INFO] Building jar: /srv/gump/public/workspace/james-mime4j/core/target/apache-mime4j-core-0.7-SNAPSHOT.jar
[INFO] [jar:test-jar {execution: default}]
[INFO] Building jar: /srv/gump/public/workspace/james-mime4j/core/target/apache-mime4j-core-0.7-SNAPSHOT-tests.jar
[INFO] [javadoc:jar {execution: javadoc-jar}]
[INFO] The goal 'org.apache.maven.plugins:maven-javadoc-plugin:2.6.1:javadoc' has not be previously called for the project: 'org.apache.james:apache-mime4j-benchmark:jar:0.7-SNAPSHOT'. Trying to invoke it...
[ERROR] MavenInvocationException: Error when invoking Maven, consult the invoker log file: /srv/gump/public/workspace/james-mime4j/core/target/invoker/maven-javadoc-plugin1117390127.txt
[INFO] ------------------------------------------------------------------------
[ERROR] BUILD ERROR
[INFO] ------------------------------------------------------------------------
[INFO] MavenReportException: Error while creating archive:Error when invoking Maven, consult the invoker log file: /srv/gump/public/workspace/james-mime4j/core/target/invoker/maven-javadoc-plugin1117390127.txt

[INFO] ------------------------------------------------------------------------
[INFO] For more information, run Maven with the -e switch
[INFO] ------------------------------------------------------------------------
[INFO] Total time: 49 seconds
[INFO] Finished at: Sat Sep 25 11:58:00 UTC 2010
[INFO] Final Memory: 61M/147M
[INFO] ------------------------------------------------------------------------
---------------------------------------------

To subscribe to this information via syndicated feeds:
- RSS: http://vmgump.apache.org/gump/public/james-mime4j/apache-mime4j-reactor/rss.xml
- Atom: http://vmgump.apache.org/gump/public/james-mime4j/apache-mime4j-reactor/atom.xml

============================== Gump Tracking Only ===
Produced by Gump version 2.3.
Gump Run 14000625092010, vmgump.apache.org:vmgump:14000625092010
Gump E-mail Identifier (unique within run) #17.

*********************************************************** G U M P
[GUMP@vmgump]: Project tika-reactor (in module tika) failed
To whom it may engage...
        
This is an automated request, but not an unsolicited one. For 
more information please visit http://gump.apache.org/nagged.html, 
and/or contact the folk at general@gump.apache.org.

Project tika-reactor has an issue affecting its community integration.
This issue affects 1 projects,
 and has been outstanding for 7 runs.
The current state of this project is 'Failed', with reason 'Build Failed'.
For reference only, the following projects are affected by this:
    - tika-reactor :  Apache Tika is a toolkit for detecting and extracting metada...


Full details are available at:
    http://vmgump.apache.org/gump/public/tika/tika-reactor/index.html

That said, some information snippets are provided here.

The following annotations (debug/informational/warning/error messages) were provided:
 -DEBUG- (Gump generated) Maven2 Settings in: /srv/gump/public/workspace/tika/gump_mvn_settings.xml
 -INFO- Failed with reason build failed
 -DEBUG- Maven POM in: /srv/gump/public/workspace/tika/pom.xml



The following work was performed:
http://vmgump.apache.org/gump/public/tika/tika-reactor/gump_work/build_tika_tika-reactor.html
Work Name: build_tika_tika-reactor (Type: Build)
Work ended in a state of : Failed
Elapsed: 1 min 6 secs
Command Line: mvn --batch-mode --settings /srv/gump/public/workspace/tika/gump_mvn_settings.xml install 
[Working Directory: /srv/gump/public/workspace/tika]
---------------------------------------------
Tests run: 2, Failures: 0, Errors: 0, Skipped: 0, Time elapsed: 0.161 sec
Running org.apache.tika.parser.mbox.MboxParserTest
Tests run: 5, Failures: 0, Errors: 0, Skipped: 0, Time elapsed: 0.41 sec
Running org.apache.tika.parser.pkg.Bzip2ParserTest
Tests run: 2, Failures: 0, Errors: 0, Skipped: 0, Time elapsed: 0.847 sec
Running org.apache.tika.parser.microsoft.ooxml.OOXMLContainerExtractionTest
Tests run: 3, Failures: 0, Errors: 0, Skipped: 0, Time elapsed: 6.112 sec
Running org.apache.tika.parser.microsoft.WordParserTest
Tests run: 2, Failures: 0, Errors: 0, Skipped: 0, Time elapsed: 0.015 sec
Running org.apache.tika.parser.image.TiffParserTest
Tests run: 1, Failures: 0, Errors: 0, Skipped: 0, Time elapsed: 0.012 sec
Running org.apache.tika.parser.epub.EpubParserTest
Tests run: 1, Failures: 0, Errors: 0, Skipped: 0, Time elapsed: 0.011 sec
Running org.apache.tika.mime.MimeTypesTest
Tests run: 6, Failures: 0, Errors: 0, Skipped: 0, Time elapsed: 0.006 sec
Running org.apache.tika.parser.asm.ClassParserTest
Tests run: 1, Failures: 0, Errors: 0, Skipped: 0, Time elapsed: 0.076 sec
Running org.apache.tika.parser.opendocument.ODFParserTest
Tests run: 1, Failures: 0, Errors: 0, Skipped: 0, Time elapsed: 0.022 sec
Running org.apache.tika.parser.video.FLVParserTest
Tests run: 1, Failures: 0, Errors: 0, Skipped: 0, Time elapsed: 0.036 sec
Running org.apache.tika.parser.audio.AudioParserTest
Tests run: 3, Failures: 0, Errors: 0, Skipped: 0, Time elapsed: 0.127 sec
Running org.apache.tika.parser.microsoft.ooxml.OOXMLParserTest
Tests run: 6, Failures: 0, Errors: 0, Skipped: 0, Time elapsed: 2.496 sec
Running org.apache.tika.TestParsers
Tests run: 12, Failures: 0, Errors: 0, Skipped: 0, Time elapsed: 1.214 sec
Running org.apache.tika.parser.html.HtmlParserTest
Tests run: 25, Failures: 0, Errors: 0, Skipped: 0, Time elapsed: 1.25 sec

Results :

Failed tests: 
  testEmbeddedOfficeFiles(org.apache.tika.parser.microsoft.POIContainerExtractionTest)

Tests run: 177, Failures: 1, Errors: 0, Skipped: 0

[INFO] ------------------------------------------------------------------------
[ERROR] BUILD FAILURE
[INFO] ------------------------------------------------------------------------
[INFO] There are test failures.

Please refer to /srv/gump/public/workspace/tika/tika-parsers/target/surefire-reports for the individual test results.
[INFO] ------------------------------------------------------------------------
[INFO] For more information, run Maven with the -e switch
[INFO] ------------------------------------------------------------------------
[INFO] Total time: 1 minute 5 seconds
[INFO] Finished at: Sat Sep 25 12:06:10 UTC 2010
[INFO] Final Memory: 39M/94M
[INFO] ------------------------------------------------------------------------
---------------------------------------------

To subscribe to this information via syndicated feeds:
- RSS: http://vmgump.apache.org/gump/public/tika/tika-reactor/rss.xml
- Atom: http://vmgump.apache.org/gump/public/tika/tika-reactor/atom.xml

============================== Gump Tracking Only ===
Produced by Gump version 2.3.
Gump Run 14000625092010, vmgump.apache.org:vmgump:14000625092010
Gump E-mail Identifier (unique within run) #18.

*********************************************************** G U M P
[GUMP@vmgump]: Project commons-jci-reactor (in module apache-commons) failed
To whom it may engage...
        
This is an automated request, but not an unsolicited one. For 
more information please visit http://gump.apache.org/nagged.html, 
and/or contact the folk at general@gump.apache.org.

Project commons-jci-reactor has an issue affecting its community integration.
This issue affects 1 projects,
 and has been outstanding for 75 runs.
The current state of this project is 'Failed', with reason 'Build Failed'.
For reference only, the following projects are affected by this:
    - commons-jci-reactor :  Apache Commons


Full details are available at:
    http://vmgump.apache.org/gump/public/apache-commons/commons-jci-reactor/index.html

That said, some information snippets are provided here.

The following annotations (debug/informational/warning/error messages) were provided:
 -WARNING- Overriding Maven2 settings: [/srv/gump/public/workspace/apache-commons/jci/gump_mvn_settings.xml]
 -DEBUG- (Gump generated) Maven2 Settings in: /srv/gump/public/workspace/apache-commons/jci/gump_mvn_settings.xml
 -INFO- Failed with reason build failed
 -DEBUG- Maven POM in: /srv/gump/public/workspace/apache-commons/jci/pom.xml
 -INFO- Project Reports in: /srv/gump/public/workspace/apache-commons/jci/compilers/groovy/target/surefire-reports



The following work was performed:
http://vmgump.apache.org/gump/public/apache-commons/commons-jci-reactor/gump_work/build_apache-commons_commons-jci-reactor.html
Work Name: build_apache-commons_commons-jci-reactor (Type: Build)
Work ended in a state of : Failed
Elapsed: 3 mins 25 secs
Command Line: mvn --batch-mode --settings /srv/gump/public/workspace/apache-commons/jci/gump_mvn_settings.xml package 
[Working Directory: /srv/gump/public/workspace/apache-commons/jci]
---------------------------------------------
Downloading: http://localhost:8192/maven2/asm/asm-analysis/2.2.1/asm-analysis-2.2.1.jar
17K downloaded  (asm-analysis-2.2.1.jar)
Downloading: http://localhost:8192/maven2/asm/asm-tree/2.2.1/asm-tree-2.2.1.jar
21K downloaded  (asm-tree-2.2.1.jar)
Downloading: http://localhost:8192/maven2/asm/asm-attrs/2.2.1/asm-attrs-2.2.1.jar


[INFO] [antrun:run {execution: javadoc.resources}]
[INFO] Executing tasks
[INFO] Executed tasks
[INFO] [remote-resources:process {execution: default}]
[INFO] [resources:resources {execution: default-resources}]
[INFO] Using 'iso-8859-1' encoding to copy filtered resources.
[INFO] Copying 0 resource to META-INF
[INFO] [compiler:compile {execution: default-compile}]
[INFO] Compiling 6 source files to /srv/gump/public/workspace/apache-commons/jci/compilers/javac/target/classes
[INFO] -------------------------------------------------------------
[ERROR] COMPILATION ERROR : 
[INFO] -------------------------------------------------------------
[ERROR] /srv/gump/public/workspace/apache-commons/jci/compilers/javac/src/main/java/org/apache/commons/jci/compilers/JavacClassLoader.java:[108,46] cannot find symbol
symbol  : constructor ClassWriter(boolean,boolean)
location: class org.objectweb.asm.ClassWriter

[ERROR] /srv/gump/public/workspace/apache-commons/jci/compilers/javac/src/main/java/org/apache/commons/jci/compilers/JavacClassLoader.java:[109,44] cannot find symbol
symbol  : method accept(org.vafer.dependency.asm.RenamingVisitor,boolean)
location: class org.objectweb.asm.ClassReader

[INFO] 2 errors 
[INFO] -------------------------------------------------------------
[INFO] ------------------------------------------------------------------------
[ERROR] BUILD FAILURE
[INFO] ------------------------------------------------------------------------
[INFO] Compilation failure

/srv/gump/public/workspace/apache-commons/jci/compilers/javac/src/main/java/org/apache/commons/jci/compilers/JavacClassLoader.java:[108,46] cannot find symbol
symbol  : constructor ClassWriter(boolean,boolean)
location: class org.objectweb.asm.ClassWriter

/srv/gump/public/workspace/apache-commons/jci/compilers/javac/src/main/java/org/apache/commons/jci/compilers/JavacClassLoader.java:[109,44] cannot find symbol
symbol  : method accept(org.vafer.dependency.asm.RenamingVisitor,boolean)
location: class org.objectweb.asm.ClassReader


[INFO] ------------------------------------------------------------------------
[INFO] For more information, run Maven with the -e switch
[INFO] ------------------------------------------------------------------------
[INFO] Total time: 3 minutes 23 seconds
[INFO] Finished at: Sat Sep 25 12:14:35 UTC 2010
[INFO] Final Memory: 78M/186M
[INFO] ------------------------------------------------------------------------
---------------------------------------------

To subscribe to this information via syndicated feeds:
- RSS: http://vmgump.apache.org/gump/public/apache-commons/commons-jci-reactor/rss.xml
- Atom: http://vmgump.apache.org/gump/public/apache-commons/commons-jci-reactor/atom.xml

============================== Gump Tracking Only ===
Produced by Gump version 2.3.
Gump Run 14000625092010, vmgump.apache.org:vmgump:14000625092010
Gump E-mail Identifier (unique within run) #19.

*********************************************************** G U M P
[GUMP@vmgump]: Project james-jsieve (in module james-jsieve) failed
To whom it may engage...
        
This is an automated request, but not an unsolicited one. For 
more information please visit http://gump.apache.org/nagged.html, 
and/or contact the folk at general@gump.apache.org.

Project james-jsieve has an issue affecting its community integration.
This issue affects 1 projects,
 and has been outstanding for 161 runs.
The current state of this project is 'Failed', with reason 'Build Failed'.
For reference only, the following projects are affected by this:
    - james-jsieve :  Implements JSIEVE Mail Filtering Language


Full details are available at:
    http://vmgump.apache.org/gump/public/james-jsieve/james-jsieve/index.html

That said, some information snippets are provided here.

The following annotations (debug/informational/warning/error messages) were provided:
 -WARNING- Overriding Maven2 settings: [/srv/gump/public/workspace/james-jsieve/gump_mvn_settings.xml]
 -DEBUG- (Gump generated) Maven2 Settings in: /srv/gump/public/workspace/james-jsieve/gump_mvn_settings.xml
 -INFO- Failed with reason build failed
 -DEBUG- Maven POM in: /srv/gump/public/workspace/james-jsieve/pom.xml



The following work was performed:
http://vmgump.apache.org/gump/public/james-jsieve/james-jsieve/gump_work/build_james-jsieve_james-jsieve.html
Work Name: build_james-jsieve_james-jsieve (Type: Build)
Work ended in a state of : Failed
Elapsed: 16 secs
Command Line: mvn --batch-mode --settings /srv/gump/public/workspace/james-jsieve/gump_mvn_settings.xml install 
[Working Directory: /srv/gump/public/workspace/james-jsieve]
---------------------------------------------
[INFO]   Apache JAMES jSieve Utilities
[INFO]   Apache JAMES jSieve Assembly
[INFO] ------------------------------------------------------------------------
[INFO] Building Apache JAMES JSieve Project
[INFO]    task-segment: [install]
[INFO] ------------------------------------------------------------------------
[INFO] Setting property: classpath.resource.loader.class => 'org.codehaus.plexus.velocity.ContextClassLoaderResourceLoader'.
[INFO] Setting property: velocimacro.messages.on => 'false'.
[INFO] Setting property: resource.loader => 'classpath'.
[INFO] Setting property: resource.manager.logwhenfound => 'false'.
[INFO] [remote-resources:process {execution: default}]
[INFO] [site:attach-descriptor {execution: default-attach-descriptor}]
[INFO] Unable to load parent project from a relative path: Could not find the model file '/srv/gump/public/workspace/pom.xml'. for project unknown
[INFO] Parent project loaded from repository.
[INFO] [install:install {execution: default-install}]
[INFO] Installing /srv/gump/public/workspace/james-jsieve/pom.xml to /srv/gump/public/workspace/mvnlocalrepo/shared/org/apache/james/jsieve-project/0.5-SNAPSHOT/jsieve-project-0.5-SNAPSHOT.pom
[INFO] ------------------------------------------------------------------------
[INFO] Building Apache JAMES jSieve
[INFO]    task-segment: [install]
[INFO] ------------------------------------------------------------------------
[INFO] [javacc:jjtree-javacc {execution: generate-jjtree}]
[INFO] Skipping - all parsers are up to date
[INFO] [remote-resources:process {execution: default}]
[INFO] [resources:resources {execution: default-resources}]
[INFO] Using 'UTF-8' encoding to copy filtered resources.
[INFO] Copying 3 resources
[INFO] Copying 3 resources
[INFO] [compiler:compile {execution: default-compile}]
[INFO] Nothing to compile - all classes are up to date
[INFO] [bundle:manifest {execution: bundle-manifest}]
[INFO] [resources:testResources {execution: default-testResources}]
[INFO] Using 'UTF-8' encoding to copy filtered resources.
[INFO] Copying 2 resources
[INFO] Copying 3 resources
[INFO] [compiler:testCompile {execution: default-testCompile}]
[INFO] Compiling 50 source files to /srv/gump/public/workspace/james-jsieve/main/target/test-classes
[INFO] ------------------------------------------------------------------------
[ERROR] BUILD FAILURE
[INFO] ------------------------------------------------------------------------
[INFO] Compilation failure
/srv/gump/public/workspace/james-jsieve/main/src/test/java/org/apache/jsieve/AllTests.java:[31,21] package junit.swingui does not exist


[INFO] ------------------------------------------------------------------------
[INFO] For more information, run Maven with the -e switch
[INFO] ------------------------------------------------------------------------
[INFO] Total time: 15 seconds
[INFO] Finished at: Sat Sep 25 12:37:25 UTC 2010
[INFO] Final Memory: 46M/111M
[INFO] ------------------------------------------------------------------------
---------------------------------------------

To subscribe to this information via syndicated feeds:
- RSS: http://vmgump.apache.org/gump/public/james-jsieve/james-jsieve/rss.xml
- Atom: http://vmgump.apache.org/gump/public/james-jsieve/james-jsieve/atom.xml

============================== Gump Tracking Only ===
Produced by Gump version 2.3.
Gump Run 14000625092010, vmgump.apache.org:vmgump:14000625092010
Gump E-mail Identifier (unique within run) #22.

*********************************************************** G U M P
[GUMP@vmgump]: Project htmlunit (in module htmlunit) failed
To whom it may engage...
        
This is an automated request, but not an unsolicited one. For 
more information please visit http://gump.apache.org/nagged.html, 
and/or contact the folk at general@gump.apache.org.

Project htmlunit has an issue affecting its community integration.
This issue affects 1 projects,
 and has been outstanding for 181 runs.
The current state of this project is 'Failed', with reason 'Build Failed'.
For reference only, the following projects are affected by this:
    - htmlunit :  A tool for testing web based applications


Full details are available at:
    http://vmgump.apache.org/gump/public/htmlunit/htmlunit/index.html

That said, some information snippets are provided here.

The following annotations (debug/informational/warning/error messages) were provided:
 -DEBUG- Sole jar output [htmlunit-*[0-9T].jar] identifier set to project name
 -INFO- Optional dependency apache-mime4j-reactor failed with reason build failed
 -DEBUG- (Gump generated) Maven2 Settings in: /srv/gump/public/workspace/htmlunit/htmlunit/gump_mvn_settings.xml
 -INFO- Failed with reason build failed
 -DEBUG- Maven POM in: /srv/gump/public/workspace/htmlunit/htmlunit/pom.xml
 -INFO- Failed to extract fallback artifacts from Gump Repository



The following work was performed:
http://vmgump.apache.org/gump/public/htmlunit/htmlunit/gump_work/build_htmlunit_htmlunit.html
Work Name: build_htmlunit_htmlunit (Type: Build)
Work ended in a state of : Failed
Elapsed: 1 min 5 secs
Command Line: mvn --batch-mode --settings /srv/gump/public/workspace/htmlunit/htmlunit/gump_mvn_settings.xml package 
[Working Directory: /srv/gump/public/workspace/htmlunit/htmlunit]
---------------------------------------------

Downloading: http://localhost:8192/maven2/net/java/dev/jna/jna/3.2.2/jna-3.2.2.pom

Downloading: http://localhost:8192/maven2/org/seleniumhq/selenium/selenium-firefox-driver/2.0a5/selenium-firefox-driver-2.0a5.pom

Downloading: http://localhost:8192/maven2/org/seleniumhq/selenium/selenium-remote-client/2.0a5/selenium-remote-client-2.0a5.pom

Downloading: http://localhost:8192/maven2/org/seleniumhq/selenium/selenium-remote-common/2.0a5/selenium-remote-common-2.0a5.pom

Downloading: http://htmlunit.sourceforge.net/m2-repo-snapshots/net/sourceforge/htmlunit/htmlunit-core-js/2.9-SNAPSHOT/htmlunit-core-js-2.9-SNAPSHOT.jar
Downloading: http://localhost:8192/maven2/net/sourceforge/cssparser/cssparser/0.9.5/cssparser-0.9.5.jar
Downloading: http://localhost:8192/maven2/net/sourceforge/nekohtml/nekohtml/1.9.14/nekohtml-1.9.14.jar
Downloading: http://localhost:8192/maven2/org/apache/httpcomponents/httpclient/4.0.1/httpclient-4.0.1.jar
Downloading: http://localhost:8192/maven2/org/w3c/css/sac/1.3/sac-1.3.jar
323K downloaded  (httpclient-4.0.1.jar)
Downloading: http://localhost:8192/maven2/org/apache/httpcomponents/httpcore/4.0.1/httpcore-4.0.1.jar
176K downloaded  (httpcore-4.0.1.jar)
Downloading: http://localhost:8192/maven2/org/apache/httpcomponents/httpmime/4.0.1/httpmime-4.0.1.jar
25K downloaded  (httpmime-4.0.1.jar)



891K downloaded  (htmlunit-core-js-2.9-SNAPSHOT.jar)
[INFO] [compiler:compile {execution: default-compile}]
[INFO] Compiling 441 source files to /srv/gump/public/workspace/htmlunit/htmlunit/target/classes
[INFO] -------------------------------------------------------------
[ERROR] COMPILATION ERROR : 
[INFO] -------------------------------------------------------------
[ERROR] /srv/gump/public/workspace/htmlunit/htmlunit/src/main/java/com/gargoylesoftware/htmlunit/HttpWebConnection.java:[339,65] incompatible types
found   : org.apache.http.entity.mime.FormBodyPart
required: org.apache.james.mime4j.message.BodyPart

[INFO] 1error
[INFO] -------------------------------------------------------------
[INFO] ------------------------------------------------------------------------
[ERROR] BUILD FAILURE
[INFO] ------------------------------------------------------------------------
[INFO] Compilation failure
/srv/gump/public/workspace/htmlunit/htmlunit/src/main/java/com/gargoylesoftware/htmlunit/HttpWebConnection.java:[339,65] incompatible types
found   : org.apache.http.entity.mime.FormBodyPart
required: org.apache.james.mime4j.message.BodyPart


[INFO] ------------------------------------------------------------------------
[INFO] For more information, run Maven with the -e switch
[INFO] ------------------------------------------------------------------------
[INFO] Total time: 1 minute 4 seconds
[INFO] Finished at: Sat Sep 25 13:31:40 UTC 2010
[INFO] Final Memory: 40M/124M
[INFO] ------------------------------------------------------------------------
---------------------------------------------

To subscribe to this information via syndicated feeds:
- RSS: http://vmgump.apache.org/gump/public/htmlunit/htmlunit/rss.xml
- Atom: http://vmgump.apache.org/gump/public/htmlunit/htmlunit/atom.xml

============================== Gump Tracking Only ===
Produced by Gump version 2.3.
Gump Run 14000625092010, vmgump.apache.org:vmgump:14000625092010
Gump E-mail Identifier (unique within run) #25.

*********************************************************** G U M P
[GUMP@vmgump]: Project solr-test (in module lucene-java) failed
To whom it may engage...
        
This is an automated request, but not an unsolicited one. For 
more information please visit http://gump.apache.org/nagged.html, 
and/or contact the folk at general@gump.apache.org.

Project solr-test has an issue affecting its community integration.
This issue affects 1 projects,
 and has been outstanding for 4 runs.
The current state of this project is 'Failed', with reason 'Build Failed'.
For reference only, the following projects are affected by this:
    - solr-test :  Java Based Search Engine


Full details are available at:
    http://vmgump.apache.org/gump/public/lucene-java/solr-test/index.html

That said, some information snippets are provided here.

The following annotations (debug/informational/warning/error messages) were provided:
 -INFO- Failed with reason build failed



The following work was performed:
http://vmgump.apache.org/gump/public/lucene-java/solr-test/gump_work/build_lucene-java_solr-test.html
Work Name: build_lucene-java_solr-test (Type: Build)
Work ended in a state of : Failed
Elapsed: 5 mins 24 secs
Command Line: /usr/lib/jvm/java-6-openjdk/bin/java -Djava.awt.headless=true -Xbootclasspath/p:/srv/gump/public/workspace/xml-commons/java/external/build/xml-apis.jar:/srv/gump/public/workspace/xml-xerces2/build/xercesImpl.jar org.apache.tools.ant.Main -Dgump.merge=/srv/gump/public/gump/work/merge.xml -Dbuild.sysclasspath=only -Dversion=25092010 test 
[Working Directory: /srv/gump/public/workspace/lucene-java/solr]
CLASSPATH: /usr/lib/jvm/java-6-openjdk/lib/tools.jar:/srv/gump/public/workspace/lucene-java/lucene/build/classes/test:/srv/gump/public/workspace/lucene-java/solr/build/tests:/srv/gump/public/workspace/lucene-java/solr/contrib/clustering/lib/carrot2-core-3.4.0.jar:/srv/gump/public/workspace/lucene-java/solr/contrib/clustering/lib/jackson-core-asl-1.5.2.jar:/srv/gump/public/workspace/lucene-java/solr/contrib/clustering/lib/simple-xml-2.3.5.jar:/srv/gump/public/workspace/lucene-java/solr/lib/apache-solr-noggit-r944541.jar:/srv/gump/public/workspace/lucene-java/solr/lib/easymock.jar:/srv/gump/public/workspace/lucene-java/solr/lib/guava-r05.jar:/srv/gump/public/workspace/ant/dist/lib/ant.jar:/srv/gump/public/workspace/ant/dist/lib/ant-launcher.jar:/srv/gump/public/workspace/ant/dist/lib/ant-jmf.jar:/srv/gump/public/workspace/ant/dist/lib/ant-junit.jar:/srv/gump/public/workspace/ant/dist/lib/ant-swing.jar:/srv/gump/public/workspace/ant/dist/lib/ant-apache-resolver.jar:/srv/gump/pub
 lic/workspace/ant/dist/lib/ant-apache-xalan2.jar:/srv/gump/packages/junit3.8.1/junit.jar:/srv/gump/public/workspace/xml-commons/java/build/resolver.jar:/srv/gump/public/workspace/apache-commons/codec/dist/commons-codec-25092010.jar:/srv/gump/public/workspace/commons-collections-3.x/target/commons-collections-3.3-SNAPSHOT.jar:/srv/gump/public/workspace/commons-sandbox/csv/target/commons-csv-1.0-SNAPSHOT.jar:/srv/gump/public/workspace/apache-commons/fileupload/target/commons-fileupload-25092010.jar:/srv/gump/public/workspace/httpcomponents/oac.hc3x/dist/commons-httpclient.jar:/srv/gump/public/workspace/apache-commons/io/target/commons-io-2.0-SNAPSHOT.jar:/srv/gump/public/workspace/commons-lang-2.x/target/commons-lang-2.6-SNAPSHOT.jar:/srv/gump/public/workspace/apache-commons/logging/target/commons-logging-25092010.jar:/srv/gump/public/workspace/apache-commons/logging/target/commons-logging-api-25092010.jar:/srv/gump/public/workspace/jakarta-servletapi-5/jsr154/dist/lib/servlet
 -api.jar:/srv/gump/packages/javamail-1.4/mail.jar:/srv/gump/packages/javamail-1.4/lib/mailapi.jar:/srv/gump/public/workspace/junit/dist/junit-25092010.jar:/srv/gump/public/workspace/junit/dist/junit-dep-25092010.jar:/srv/gump/public/workspace/lucene-java/lucene/build/lucene-core-25092010.jar:/srv/gump/public/workspace/lucene-java/modules/analysis/build/icu/lucene-analyzers-icu-25092010.jar:/srv/gump/public/workspace/lucene-java/modules/analysis/build/smartcn/lucene-analyzers-smartcn-25092010.jar:/srv/gump/public/workspace/lucene-java/modules/analysis/build/common/lucene-analyzers-common-25092010.jar:/srv/gump/public/workspace/lucene-java/modules/analysis/build/stempel/lucene-analyzers-stempel-25092010.jar:/srv/gump/public/workspace/lucene-java/modules/analysis/build/phonetic/lucene-analyzers-phonetic-25092010.jar:/srv/gump/public/workspace/lucene-java/lucene/build/contrib/ant/lucene-ant-25092010.jar:/srv/gump/public/workspace/lucene-java/lucene/build/contrib/demo/lucene-demo
 -25092010.jar:/srv/gump/public/workspace/lucene-java/lucene/build/contrib/memory/lucene-memory-25092010.jar:/srv/gump/public/workspace/lucene-java/lucene/build/contrib/queries/lucene-queries-25092010.jar:/srv/gump/public/workspace/lucene-java/lucene/build/contrib/highlighter/lucene-highlighter-25092010.jar:/srv/gump/public/workspace/lucene-java/lucene/build/contrib/benchmark/lucene-benchmark-25092010.jar:/srv/gump/public/workspace/lucene-java/lucene/build/contrib/db/bdb/lucene-bdb-25092010.jar:/srv/gump/public/workspace/lucene-java/lucene/build/contrib/db/bdb-je/lucene-bdb-je-25092010.jar:/srv/gump/public/workspace/lucene-java/lucene/build/contrib/instantiated/lucene-instantiated-25092010.jar:/srv/gump/public/workspace/lucene-java/lucene/build/contrib/lucli/lucene-lucli-25092010.jar:/srv/gump/public/workspace/lucene-java/lucene/build/contrib/misc/lucene-misc-25092010.jar:/srv/gump/public/workspace/lucene-java/lucene/build/contrib/queryparser/lucene-queryparser-25092010.jar:/
 srv/gump/public/workspace/lucene-java/lucene/build/contrib/remote/lucene-remote-25092010.jar:/srv/gump/public/workspace/lucene-java/lucene/build/contrib/spatial/lucene-spatial-25092010.jar:/srv/gump/public/workspace/lucene-java/lucene/build/contrib/spellchecker/lucene-spellchecker-25092010.jar:/srv/gump/public/workspace/lucene-java/lucene/build/contrib/swing/lucene-swing-25092010.jar:/srv/gump/public/workspace/lucene-java/lucene/build/contrib/wordnet/lucene-wordnet-25092010.jar:/srv/gump/public/workspace/lucene-java/lucene/build/contrib/xml-query-parser/lucene-xml-query-parser-25092010.jar:/srv/gump/packages/jetty6/jetty-6.1.25.jar:/srv/gump/packages/jetty6/jetty-util-6.1.25.jar:/srv/gump/public/workspace/slf4j/slf4j-api/target/slf4j-api-1.5.9-SNAPSHOT.jar:/srv/gump/public/workspace/slf4j/slf4j-simple/target/slf4j-simple-1.5.9-SNAPSHOT.jar:/srv/gump/public/workspace/slf4j/slf4j-nop/target/slf4j-nop-1.5.9-SNAPSHOT.jar:/srv/gump/public/workspace/slf4j/slf4j-jdk14/target/slf4j-
 jdk14-1.5.9-SNAPSHOT.jar:/srv/gump/public/workspace/slf4j/slf4j-log4j12/target/slf4j-log4j12-1.5.9-SNAPSHOT.jar:/srv/gump/public/workspace/slf4j/slf4j-jcl/target/slf4j-jcl-1.5.9-SNAPSHOT.jar:/srv/gump/public/workspace/slf4j/slf4j-ext/target/slf4j-ext-1.5.9-SNAPSHOT.jar:/srv/gump/public/workspace/slf4j/jcl-over-slf4j/target/jcl-over-slf4j-1.5.9-SNAPSHOT.jar:/srv/gump/public/workspace/slf4j/jcl104-over-slf4j/target/jcl104-over-slf4j-1.5.9-SNAPSHOT.jar:/srv/gump/public/workspace/slf4j/log4j-over-slf4j/target/log4j-over-slf4j-1.5.9-SNAPSHOT.jar:/srv/gump/public/workspace/slf4j/jul-to-slf4j/target/jul-to-slf4j-1.5.9-SNAPSHOT.jar:/srv/gump/public/workspace/slf4j/slf4j-migrator/target/slf4j-migrator-1.5.9-SNAPSHOT.jar:/srv/gump/public/workspace/lucene-java/solr/dist/apache-solr-solrj-25092010.jar:/srv/gump/public/workspace/lucene-java/solr/dist/apache-solr-core-25092010.jar:/srv/gump/public/workspace/lucene-java/solr/dist/apache-solr-cell-25092010.jar:/srv/gump/public/workspace/luc
 ene-java/solr/dist/apache-solr-clustering-25092010.jar:/srv/gump/public/workspace/lucene-java/solr/dist/apache-solr-dataimporthandler-extras-25092010.jar:/srv/gump/public/workspace/lucene-java/solr/dist/apache-solr-dataimporthandler-25092010.jar:/srv/gump/public/workspace/tika/tika-core/target/tika-core-0.8-SNAPSHOT.jar:/srv/gump/public/workspace/tika/tika-parsers/target/tika-parsers-0.8-SNAPSHOT.jar:/srv/gump/public/workspace/velocity-engine/bin/velocity-25092010.jar:/srv/gump/public/workspace/velocity-engine/bin/velocity-25092010-dep.jar:/srv/gump/public/workspace/velocity-tools/velocity-tools-generic/target/velocity-tools-generic-2.1.0-SNAPSHOT.jar:/srv/gump/public/workspace/xml-commons/java/external/build/xml-apis-ext.jar
---------------------------------------------
    [junit] 57803 [main] INFO org.apache.solr.handler.component.SearchHandler - Adding  component:org.apache.solr.handler.component.MoreLikeThisComponent@1ff6c2a9
    [junit] 57803 [main] INFO org.apache.solr.handler.component.SearchHandler - Adding  component:org.apache.solr.handler.component.HighlightComponent@165f5a4
    [junit] 57803 [main] INFO org.apache.solr.handler.component.SearchHandler - Adding  component:org.apache.solr.handler.component.StatsComponent@4ce1e2b3
    [junit] 57803 [main] INFO org.apache.solr.handler.component.SearchHandler - Adding  debug component:org.apache.solr.handler.component.DebugComponent@1ea7d34
    [junit] 57803 [main] INFO org.apache.solr.handler.component.SearchHandler - Adding  component:org.apache.solr.handler.component.TermsComponent@49c1e1e7
    [junit] 57803 [main] INFO org.apache.solr.handler.component.SearchHandler - Adding  component:org.apache.solr.handler.component.QueryComponent@17b6dd83
    [junit] 57803 [main] INFO org.apache.solr.handler.component.SearchHandler - Adding  component:org.apache.solr.handler.component.FacetComponent@6688cf9e
    [junit] 57803 [main] INFO org.apache.solr.handler.component.SearchHandler - Adding  component:org.apache.solr.handler.component.MoreLikeThisComponent@1ff6c2a9
    [junit] 57803 [main] INFO org.apache.solr.handler.component.SearchHandler - Adding  component:org.apache.solr.handler.component.HighlightComponent@165f5a4
    [junit] 57803 [main] INFO org.apache.solr.handler.component.SearchHandler - Adding  component:org.apache.solr.handler.component.StatsComponent@4ce1e2b3
    [junit] 57803 [main] INFO org.apache.solr.handler.component.SearchHandler - Adding  component:org.apache.solr.handler.component.SpellCheckComponent@57d62a85
    [junit] 57803 [main] INFO org.apache.solr.handler.component.SearchHandler - Adding  debug component:org.apache.solr.handler.component.DebugComponent@1ea7d34
    [junit] 57803 [main] INFO org.apache.solr.handler.component.SearchHandler - Adding  component:org.apache.solr.handler.component.QueryComponent@17b6dd83
    [junit] 57803 [main] INFO org.apache.solr.handler.component.SearchHandler - Adding  component:org.apache.solr.handler.component.FacetComponent@6688cf9e
    [junit] 57803 [main] INFO org.apache.solr.handler.component.SearchHandler - Adding  component:org.apache.solr.handler.component.MoreLikeThisComponent@1ff6c2a9
    [junit] 57803 [main] INFO org.apache.solr.handler.component.SearchHandler - Adding  component:org.apache.solr.handler.component.HighlightComponent@165f5a4
    [junit] 57803 [main] INFO org.apache.solr.handler.component.SearchHandler - Adding  component:org.apache.solr.handler.component.StatsComponent@4ce1e2b3
    [junit] 57803 [main] INFO org.apache.solr.handler.component.SearchHandler - Adding  component:org.apache.solr.handler.component.TermVectorComponent@2d81aed0
    [junit] 57803 [main] INFO org.apache.solr.handler.component.SearchHandler - Adding  debug component:org.apache.solr.handler.component.DebugComponent@1ea7d34
    [junit] 57816 [pool-40-thread-1] INFO org.apache.solr.core.SolrCore - Registered new searcher Searcher@2d9ffd6f main
    [junit] 57822 [main] INFO org.apache.solr.core.CoreContainer - registering core: 
    [junit] 57823 [main] INFO org.apache.solr.SolrTestCaseJ4 - ####initCore end
    [junit] 57824 [main] INFO org.apache.solr.SolrTestCaseJ4 - ###Starting testBuildDocument
    [junit] 57824 [main] INFO org.apache.solr.SolrTestCaseJ4 - ###Ending testBuildDocument
    [junit] 57836 [main] INFO org.apache.solr.SolrTestCaseJ4 - ###Starting testNullField
    [junit] 57836 [main] INFO org.apache.solr.SolrTestCaseJ4 - ###Ending testNullField
    [junit] 57845 [main] INFO org.apache.solr.SolrTestCaseJ4 - ###Starting testMultiField
    [junit] 57846 [main] INFO org.apache.solr.SolrTestCaseJ4 - ###Ending testMultiField
    [junit] 57846 [main] INFO org.apache.solr.SolrTestCaseJ4 - ###deleteCore
    [junit] 57846 [main] INFO org.apache.solr.core.SolrCore - []  CLOSING SolrCore org.apache.solr.core.SolrCore@2096ed8b
    [junit] 57852 [main] INFO org.apache.solr.update.UpdateHandler - closing DirectUpdateHandler2{commits=0,autocommits=0,optimizes=0,rollbacks=0,expungeDeletes=0,docsPending=0,adds=0,deletesById=0,deletesByQuery=0,errors=0,cumulative_adds=0,cumulative_deletesById=0,cumulative_deletesByQuery=0,cumulative_errors=0}
    [junit] 57852 [main] INFO org.apache.solr.update.UpdateHandler - closed DirectUpdateHandler2{commits=0,autocommits=0,optimizes=0,rollbacks=0,expungeDeletes=0,docsPending=0,adds=0,deletesById=0,deletesByQuery=0,errors=0,cumulative_adds=0,cumulative_deletesById=0,cumulative_deletesByQuery=0,cumulative_errors=0}
    [junit] 57852 [main] INFO org.apache.solr.core.SolrCore - [] Closing main searcher on request.
    [junit] 57852 [main] INFO org.apache.solr.search.SolrIndexSearcher - Closing Searcher@2d9ffd6f main
    [junit] 	fieldValueCache{lookups=0,hits=0,hitratio=0.00,inserts=0,evictions=0,size=0,warmupTime=0,cumulative_lookups=0,cumulative_hits=0,cumulative_hitratio=0.00,cumulative_inserts=0,cumulative_evictions=0}
    [junit] 	filterCache{lookups=0,hits=0,hitratio=0.00,inserts=0,evictions=0,size=0,warmupTime=0,cumulative_lookups=0,cumulative_hits=0,cumulative_hitratio=0.00,cumulative_inserts=0,cumulative_evictions=0}
    [junit] 	queryResultCache{lookups=0,hits=0,hitratio=0.00,inserts=0,evictions=0,size=0,warmupTime=0,cumulative_lookups=0,cumulative_hits=0,cumulative_hitratio=0.00,cumulative_inserts=0,cumulative_evictions=0}
    [junit] 	documentCache{lookups=0,hits=0,hitratio=0.00,inserts=0,evictions=0,size=0,warmupTime=0,cumulative_lookups=0,cumulative_hits=0,cumulative_hitratio=0.00,cumulative_inserts=0,cumulative_evictions=0}
    [junit] ------------- ---------------- ---------------

BUILD FAILED
/srv/gump/public/workspace/lucene-java/solr/build.xml:391: 
The following error occurred while executing this line:
/srv/gump/public/workspace/lucene-java/solr/build.xml:482: Tests failed!
The following error occurred while executing this line:
/srv/gump/public/workspace/lucene-java/solr/build.xml:482: Tests failed!
The following error occurred while executing this line:
/srv/gump/public/workspace/lucene-java/solr/build.xml:482: Tests failed!

Total time: 5 minutes 23 seconds
---------------------------------------------

To subscribe to this information via syndicated feeds:
- RSS: http://vmgump.apache.org/gump/public/lucene-java/solr-test/rss.xml
- Atom: http://vmgump.apache.org/gump/public/lucene-java/solr-test/atom.xml

============================== Gump Tracking Only ===
Produced by Gump version 2.3.
Gump Run 14000625092010, vmgump.apache.org:vmgump:14000625092010
Gump E-mail Identifier (unique within run) #26.

*********************************************************** G U M P
[GUMP@vmgump]: Project commons-jelly-tags-ant-test (in module commons-jelly) failed
To whom it may engage...
        
This is an automated request, but not an unsolicited one. For 
more information please visit http://gump.apache.org/nagged.html, 
and/or contact the folk at general@gump.apache.org.

Project commons-jelly-tags-ant-test has an issue affecting its community integration.
This issue affects 1 projects,
 and has been outstanding for 7 runs.
The current state of this project is 'Failed', with reason 'Build Failed'.
For reference only, the following projects are affected by this:
    - commons-jelly-tags-ant-test :  Commons Jelly


Full details are available at:
    http://vmgump.apache.org/gump/public/commons-jelly/commons-jelly-tags-ant-test/index.html

That said, some information snippets are provided here.

The following annotations (debug/informational/warning/error messages) were provided:
 -DEBUG- Dependency on ant exists, no need to add for property maven.jar.ant-optional.
 -DEBUG- Dependency on xml-xerces exists, no need to add for property maven.jar.xerces.
 -DEBUG- Dependency on commons-jexl-1.x exists, no need to add for property maven.jar.commons-jexl.
 -WARNING- Overriding Maven properties: [/srv/gump/public/workspace/commons-jelly/jelly-tags/ant/build.properties]
 -DEBUG- (Gump generated) Maven Properties in: /srv/gump/public/workspace/commons-jelly/jelly-tags/ant/build.properties
 -INFO- Failed with reason build failed
 -DEBUG- Maven POM in: /srv/gump/public/workspace/commons-jelly/jelly-tags/ant/project.xml
 -DEBUG- Maven project properties in: /srv/gump/public/workspace/commons-jelly/jelly-tags/ant/project.properties
 -INFO- Project Reports in: /srv/gump/public/workspace/commons-jelly/jelly-tags/ant/target/test-reports



The following work was performed:
http://vmgump.apache.org/gump/public/commons-jelly/commons-jelly-tags-ant-test/gump_work/build_commons-jelly_commons-jelly-tags-ant-test.html
Work Name: build_commons-jelly_commons-jelly-tags-ant-test (Type: Build)
Work ended in a state of : Failed
Elapsed: 12 secs
Command Line: maven --offline jar 
[Working Directory: /srv/gump/public/workspace/commons-jelly/jelly-tags/ant]
---------------------------------------------
    [junit] Actual expression: (${foo4.1})=(null)
    [junit] 	at org.apache.commons.jelly.tags.junit.AssertTagSupport.fail(AssertTagSupport.java:44)
    [junit] 	at org.apache.commons.jelly.tags.junit.AssertTagSupport.failNotEquals(AssertTagSupport.java:77)
    [junit] 	at org.apache.commons.jelly.tags.junit.AssertEqualsTag.doTag(AssertEqualsTag.java:56)
    [junit] 	at org.apache.commons.jelly.impl.TagScript.run(TagScript.java:267)
    [junit] 	at org.apache.commons.jelly.impl.ScriptBlock.run(ScriptBlock.java:96)
    [junit] 	at org.apache.commons.jelly.tags.junit.CaseTag$1.runTest(CaseTag.java:60)
    [junit] 
    [junit] 
    [junit] Testcase: startUpReadWrite(org.apache.commons.jelly.tags.junit.CaseTag$1):	Caused an ERROR
    [junit] file:/srv/gump/public/workspace/commons-jelly/jelly-tags/ant/target/test-classes/org/apache/commons/jelly/ant/suite.jelly:98:5: <test:assertEquals> file:/srv/gump/public/workspace/commons-jelly/jelly-tags/ant/target/test-classes/org/apache/commons/jelly/ant/suite.jelly:98:5: <test:assertEquals>  expected:[bar5] but was:[null]
    [junit] Expected expression: (bar5)=(bar5)
    [junit] Actual expression: (${foo5.1})=(null)
    [junit] org.apache.commons.jelly.JellyTagException: file:/srv/gump/public/workspace/commons-jelly/jelly-tags/ant/target/test-classes/org/apache/commons/jelly/ant/suite.jelly:98:5: <test:assertEquals> file:/srv/gump/public/workspace/commons-jelly/jelly-tags/ant/target/test-classes/org/apache/commons/jelly/ant/suite.jelly:98:5: <test:assertEquals>  expected:[bar5] but was:[null]
    [junit] Expected expression: (bar5)=(bar5)
    [junit] Actual expression: (${foo5.1})=(null)
    [junit] 	at org.apache.commons.jelly.impl.TagScript.handleException(TagScript.java:732)
    [junit] 	at org.apache.commons.jelly.impl.TagScript.run(TagScript.java:287)
    [junit] 	at org.apache.commons.jelly.impl.ScriptBlock.run(ScriptBlock.java:96)
    [junit] 	at org.apache.commons.jelly.tags.junit.CaseTag$1.runTest(CaseTag.java:60)
    [junit] Caused by: org.apache.commons.jelly.tags.junit.JellyAssertionFailedError: file:/srv/gump/public/workspace/commons-jelly/jelly-tags/ant/target/test-classes/org/apache/commons/jelly/ant/suite.jelly:98:5: <test:assertEquals>  expected:[bar5] but was:[null]
    [junit] Expected expression: (bar5)=(bar5)
    [junit] Actual expression: (${foo5.1})=(null)
    [junit] 	at org.apache.commons.jelly.tags.junit.AssertTagSupport.fail(AssertTagSupport.java:44)
    [junit] 	at org.apache.commons.jelly.tags.junit.AssertTagSupport.failNotEquals(AssertTagSupport.java:77)
    [junit] 	at org.apache.commons.jelly.tags.junit.AssertEqualsTag.doTag(AssertEqualsTag.java:56)
    [junit] 	at org.apache.commons.jelly.impl.TagScript.run(TagScript.java:267)
    [junit] Root cause
    [junit] org.apache.commons.jelly.tags.junit.JellyAssertionFailedError: file:/srv/gump/public/workspace/commons-jelly/jelly-tags/ant/target/test-classes/org/apache/commons/jelly/ant/suite.jelly:98:5: <test:assertEquals>  expected:[bar5] but was:[null]
    [junit] Expected expression: (bar5)=(bar5)
    [junit] Actual expression: (${foo5.1})=(null)
    [junit] 	at org.apache.commons.jelly.tags.junit.AssertTagSupport.fail(AssertTagSupport.java:44)
    [junit] 	at org.apache.commons.jelly.tags.junit.AssertTagSupport.failNotEquals(AssertTagSupport.java:77)
    [junit] 	at org.apache.commons.jelly.tags.junit.AssertEqualsTag.doTag(AssertEqualsTag.java:56)
    [junit] 	at org.apache.commons.jelly.impl.TagScript.run(TagScript.java:267)
    [junit] 	at org.apache.commons.jelly.impl.ScriptBlock.run(ScriptBlock.java:96)
    [junit] 	at org.apache.commons.jelly.tags.junit.CaseTag$1.runTest(CaseTag.java:60)
    [junit] 
    [junit] 
    [junit] [ERROR] TEST org.apache.commons.jelly.ant.TestJelly FAILED

BUILD FAILED
File...... /home/gump/.maven/cache/maven-test-plugin-1.6.2/plugin.jelly
Element... fail
Line...... 181
Column.... 54
There were test failures.
Total time: 11 seconds
Finished at: Sat Sep 25 13:51:34 UTC 2010

---------------------------------------------

To subscribe to this information via syndicated feeds:
- RSS: http://vmgump.apache.org/gump/public/commons-jelly/commons-jelly-tags-ant-test/rss.xml
- Atom: http://vmgump.apache.org/gump/public/commons-jelly/commons-jelly-tags-ant-test/atom.xml

============================== Gump Tracking Only ===
Produced by Gump version 2.3.
Gump Run 14000625092010, vmgump.apache.org:vmgump:14000625092010
Gump E-mail Identifier (unique within run) #28.

*********************************************************** G U M P
[GUMP@vmgump]: Project portals-pluto-portal-1.0 (in module portals-pluto-1.0) failed
To whom it may engage...
        
This is an automated request, but not an unsolicited one. For 
more information please visit http://gump.apache.org/nagged.html, 
and/or contact the folk at general@gump.apache.org.

Project portals-pluto-portal-1.0 has an issue affecting its community integration.
This issue affects 1 projects,
 and has been outstanding for 4 runs.
The current state of this project is 'Failed', with reason 'Build Failed'.
For reference only, the following projects are affected by this:
    - portals-pluto-portal-1.0 :  JSR168 Container


Full details are available at:
    http://vmgump.apache.org/gump/public/portals-pluto-1.0/portals-pluto-portal-1.0/index.html

That said, some information snippets are provided here.

The following annotations (debug/informational/warning/error messages) were provided:
 -DEBUG- Dependency on ant exists, no need to add for property env.ANT_HOME.
 -INFO- Failed with reason build failed
 -INFO- Failed to extract fallback artifacts from Gump Repository



The following work was performed:
http://vmgump.apache.org/gump/public/portals-pluto-1.0/portals-pluto-portal-1.0/gump_work/build_portals-pluto-1.0_portals-pluto-portal-1.0.html
Work Name: build_portals-pluto-1.0_portals-pluto-portal-1.0 (Type: Build)
Work ended in a state of : Failed
Elapsed: 11 secs
Command Line: /usr/lib/jvm/java-6-openjdk/bin/java -Djava.awt.headless=true -Xbootclasspath/p:/srv/gump/public/workspace/xml-commons/java/external/build/xml-apis.jar:/srv/gump/public/workspace/xml-xerces2/build/xercesImpl.jar org.apache.tools.ant.Main -Dgump.merge=/srv/gump/public/gump/work/merge.xml -Dbuild.sysclasspath=only -Denv.ANT_HOME=/srv/gump/public/workspace/ant/dist -Dversion=25092010 -Dfinal.portal.name=pluto-portal-impl-25092010 all 
[Working Directory: /srv/gump/public/workspace/portals-pluto-1.0]
CLASSPATH: /usr/lib/jvm/java-6-openjdk/lib/tools.jar:/srv/gump/public/workspace/portals-pluto-1.0/build/ant/lib/ForeachTask.jar:/srv/gump/public/workspace/ant/dist/lib/ant.jar:/srv/gump/public/workspace/ant/dist/lib/ant-launcher.jar:/srv/gump/public/workspace/ant/dist/lib/ant-jmf.jar:/srv/gump/public/workspace/ant/dist/lib/ant-junit.jar:/srv/gump/public/workspace/ant/dist/lib/ant-swing.jar:/srv/gump/public/workspace/ant/dist/lib/ant-apache-resolver.jar:/srv/gump/public/workspace/ant/dist/lib/ant-apache-xalan2.jar:/srv/gump/packages/junit3.8.1/junit.jar:/srv/gump/public/workspace/xml-commons/java/build/resolver.jar:/srv/gump/public/workspace/castor/core/target/castor-core-1.3.2-SNAPSHOT.jar:/srv/gump/public/workspace/castor/xml/target/castor-xml-1.3.2-SNAPSHOT.jar:/srv/gump/public/workspace/castor/codegen/target/castor-codegen-1.3.2-SNAPSHOT.jar:/srv/gump/public/workspace/castor/schema/target/castor-xml-schema-1.3.2-SNAPSHOT.jar:/srv/gump/public/workspace/apache-commons/fileup
 load/target/commons-fileupload-25092010.jar:/srv/gump/public/workspace/apache-commons/logging/target/commons-logging-25092010.jar:/srv/gump/public/workspace/apache-commons/logging/target/commons-logging-api-25092010.jar:/srv/gump/public/workspace/junit/dist/junit-25092010.jar:/srv/gump/public/workspace/junit/dist/junit-dep-25092010.jar:/srv/gump/public/workspace/jakarta-regexp/build/jakarta-regexp-25092010.jar:/srv/gump/public/workspace/jakarta-servletapi-5/jsr154/dist/lib/servlet-api.jar:/srv/gump/public/workspace/jakarta-servletapi-5/jsr152/dist/lib/jsp-api.jar:/srv/gump/public/workspace/portals-pluto-1.0/api/target/portlet-api-1.0.jar:/srv/gump/public/workspace/portals-pluto-1.0/container/target/pluto-1.0.jar:/srv/gump/public/workspace/portals-pluto-1.0/descriptors/target/pluto-descriptors-1.0.jar:/srv/gump/public/workspace/xml-commons/java/external/build/xml-apis-ext.jar
---------------------------------------------

compile-tests:

internal-test:

test:

jar:

portal:

init:
    [mkdir] Created dir: /srv/gump/public/workspace/portals-pluto-1.0/portal/target/lib

get-deps:

compile:
    [mkdir] Created dir: /srv/gump/public/workspace/portals-pluto-1.0/portal/target/classes
    [javac] Compiling 149 source files to /srv/gump/public/workspace/portals-pluto-1.0/portal/target/classes
    [javac] /srv/gump/public/workspace/portals-pluto-1.0/portal/src/java/org/apache/pluto/portalImpl/Deploy.java:62: warning: [deprecation] org.apache.xml.serialize.OutputFormat in org.apache.xml.serialize has been deprecated
    [javac] import org.apache.xml.serialize.OutputFormat;
    [javac]                                ^
    [javac] /srv/gump/public/workspace/portals-pluto-1.0/portal/src/java/org/apache/pluto/portalImpl/Deploy.java:63: warning: [deprecation] org.apache.xml.serialize.XMLSerializer in org.apache.xml.serialize has been deprecated
    [javac] import org.apache.xml.serialize.XMLSerializer;
    [javac]                                ^
    [javac] /srv/gump/public/workspace/portals-pluto-1.0/portal/src/java/org/apache/pluto/portalImpl/core/PortalURL.java:179: warning: [deprecation] encode(java.lang.String) in java.net.URLEncoder has been deprecated
    [javac]         value = URLEncoder.encode(value);
    [javac]                           ^
    [javac] /srv/gump/public/workspace/portals-pluto-1.0/portal/src/java/org/apache/pluto/portalImpl/services/portletdefinitionregistry/PortletDefinitionRegistryServiceContextImpl.java:113: exception java.io.IOException is never thrown in body of corresponding try statement
    [javac]         } catch (IOException e) {
    [javac]           ^
    [javac] /srv/gump/public/workspace/portals-pluto-1.0/portal/src/java/org/apache/pluto/portalImpl/services/portletdefinitionregistry/PortletDefinitionRegistryServiceContextImpl.java:115: exception org.exolab.castor.mapping.MappingException is never thrown in body of corresponding try statement
    [javac]         } catch (MappingException e) {
    [javac]           ^
    [javac] /srv/gump/public/workspace/portals-pluto-1.0/portal/src/java/org/apache/pluto/portalImpl/services/portletdefinitionregistry/PortletDefinitionRegistryServiceFileImpl.java:233: warning: [deprecation] toURL() in java.io.File has been deprecated
    [javac]             source.setSystemId(portletXml.toURL().toExternalForm());
    [javac]                                          ^
    [javac] /srv/gump/public/workspace/portals-pluto-1.0/portal/src/java/org/apache/pluto/portlet/admin/services/DeployWarService.java:165: warning: [deprecation] org.apache.pluto.portalImpl.Deploy in org.apache.pluto.portalImpl has been deprecated
    [javac] 		            org.apache.pluto.portalImpl.Deploy.main(args);
    [javac] 		                                       ^
    [javac] Note: Some input files use unchecked or unsafe operations.
    [javac] Note: Recompile with -Xlint:unchecked for details.
    [javac] 2 errors
    [javac] 5 warnings

BUILD FAILED
/srv/gump/public/workspace/portals-pluto-1.0/build.xml:51: The following error occurred while executing this line:
/srv/gump/public/workspace/portals-pluto-1.0/portal/build.xml:50: Compile failed; see the compiler error output for details.

Total time: 10 seconds
---------------------------------------------

To subscribe to this information via syndicated feeds:
- RSS: http://vmgump.apache.org/gump/public/portals-pluto-1.0/portals-pluto-portal-1.0/rss.xml
- Atom: http://vmgump.apache.org/gump/public/portals-pluto-1.0/portals-pluto-portal-1.0/atom.xml

============================== Gump Tracking Only ===
Produced by Gump version 2.3.
Gump Run 14000625092010, vmgump.apache.org:vmgump:14000625092010
Gump E-mail Identifier (unique within run) #29.

*********************************************************** G U M P
[GUMP@vmgump]: Project cocoon22-flowscript-impl (in module cocoon) failed
To whom it may engage...
        
This is an automated request, but not an unsolicited one. For 
more information please visit http://gump.apache.org/nagged.html, 
and/or contact the folk at general@gump.apache.org.

Project cocoon22-flowscript-impl has an issue affecting its community integration.
This issue affects 3 projects,
 and has been outstanding for 16 runs.
The current state of this project is 'Failed', with reason 'Build Failed'.
For reference only, the following projects are affected by this:
    - cocoon22-flowscript-impl :  Java XML Framework
    - lenya-core-api :  Content Management System
    - lenya-reactor :  Content Management System


Full details are available at:
    http://vmgump.apache.org/gump/public/cocoon/cocoon22-flowscript-impl/index.html

That said, some information snippets are provided here.

The following annotations (debug/informational/warning/error messages) were provided:
 -DEBUG- (Gump generated) Maven2 Settings in: /srv/gump/public/workspace/cocoon/blocks/cocoon-flowscript/cocoon-flowscript-impl/gump_mvn_settings.xml
 -INFO- Failed with reason build failed
 -DEBUG- Maven POM in: /srv/gump/public/workspace/cocoon/blocks/cocoon-flowscript/cocoon-flowscript-impl/pom.xml
 -INFO- Failed to extract fallback artifacts from Gump Repository



The following work was performed:
http://vmgump.apache.org/gump/public/cocoon/cocoon22-flowscript-impl/gump_work/build_cocoon_cocoon22-flowscript-impl.html
Work Name: build_cocoon_cocoon22-flowscript-impl (Type: Build)
Work ended in a state of : Failed
Elapsed: 42 secs
Command Line: mvn --batch-mode --settings /srv/gump/public/workspace/cocoon/blocks/cocoon-flowscript/cocoon-flowscript-impl/gump_mvn_settings.xml install 
[Working Directory: /srv/gump/public/workspace/cocoon/blocks/cocoon-flowscript/cocoon-flowscript-impl]
---------------------------------------------
[INFO] Scanning for projects...
[INFO] ------------------------------------------------------------------------
[INFO] Building Cocoon Flowscript Block Implementation
[INFO]    task-segment: [install]
[INFO] ------------------------------------------------------------------------
Downloading: http://localhost:8192/maven2/org/apache/cocoon/cocoon-maven-plugin/1.0.0-M1/cocoon-maven-plugin-1.0.0-M1.pom
4K downloaded  (cocoon-maven-plugin-1.0.0-M1.pom)
Downloading: http://localhost:8192/maven2/org/apache/cocoon/cocoon-maven-plugin/1.0.0-M1/cocoon-maven-plugin-1.0.0-M1.jar

[INFO] [enforcer:enforce-once {execution: enforce-maven}]
[INFO] [resources:resources {execution: default-resources}]
[WARNING] Using platform encoding (UTF-8 actually) to copy filtered resources, i.e. build is platform dependent!
[INFO] Copying 5 resources
[INFO] Copying 2 resources to META-INF
Downloading: http://localhost:8192/maven2/org/apache/cocoon/cocoon-expression-language-api/1.0.0/cocoon-expression-language-api-1.0.0.pom

Downloading: http://localhost:8192/maven2/org/apache/cocoon/cocoon-expression-language-api/1.0.0/cocoon-expression-language-api-1.0.0.jar
11K downloaded  (cocoon-expression-language-api-1.0.0.jar)
[INFO] [compiler:compile {execution: default-compile}]
[INFO] Compiling 20 source files to /srv/gump/public/workspace/cocoon/blocks/cocoon-flowscript/cocoon-flowscript-impl/target/classes
[INFO] ------------------------------------------------------------------------
[ERROR] BUILD FAILURE
[INFO] ------------------------------------------------------------------------
[INFO] Compilation failure
/srv/gump/public/workspace/cocoon/blocks/cocoon-flowscript/cocoon-flowscript-impl/src/main/java/org/apache/cocoon/components/flow/javascript/ScriptablePropertyPointer.java:[163,19] escape(java.lang.String) in org.apache.cocoon.components.flow.javascript.ScriptablePropertyPointer cannot override escape(java.lang.String) in org.apache.commons.jxpath.ri.model.NodePointer; attempting to assign weaker access privileges; was protected


[INFO] ------------------------------------------------------------------------
[INFO] For more information, run Maven with the -e switch
[INFO] ------------------------------------------------------------------------
[INFO] Total time: 41 seconds
[INFO] Finished at: Sat Sep 25 14:25:06 UTC 2010
[INFO] Final Memory: 50M/121M
[INFO] ------------------------------------------------------------------------
---------------------------------------------

To subscribe to this information via syndicated feeds:
- RSS: http://vmgump.apache.org/gump/public/cocoon/cocoon22-flowscript-impl/rss.xml
- Atom: http://vmgump.apache.org/gump/public/cocoon/cocoon22-flowscript-impl/atom.xml

============================== Gump Tracking Only ===
Produced by Gump version 2.3.
Gump Run 14000625092010, vmgump.apache.org:vmgump:14000625092010
Gump E-mail Identifier (unique within run) #32.

*********************************************************** G U M P
[GUMP@vmgump]: Project tapestry (in module tapestry) failed
To whom it may engage...
        
This is an automated request, but not an unsolicited one. For 
more information please visit http://gump.apache.org/nagged.html, 
and/or contact the folk at general@gump.apache.org.

Project tapestry has an issue affecting its community integration.
This issue affects 1 projects,
 and has been outstanding for 97 runs.
The current state of this project is 'Failed', with reason 'Build Failed'.
For reference only, the following projects are affected by this:
    - tapestry :  Component-based web application framework organized around i...


Full details are available at:
    http://vmgump.apache.org/gump/public/tapestry/tapestry/index.html

That said, some information snippets are provided here.

The following annotations (debug/informational/warning/error messages) were provided:
 -DEBUG- (Gump generated) Maven2 Settings in: /srv/gump/public/workspace/tapestry/gump_mvn_settings.xml
 -INFO- Failed with reason build failed
 -DEBUG- Maven POM in: /srv/gump/public/workspace/tapestry/pom.xml
 -INFO- Failed to extract fallback artifacts from Gump Repository



The following work was performed:
http://vmgump.apache.org/gump/public/tapestry/tapestry/gump_work/build_tapestry_tapestry.html
Work Name: build_tapestry_tapestry (Type: Build)
Work ended in a state of : Failed
Elapsed: 5 mins 24 secs
Command Line: mvn --batch-mode -DskipTests=true --settings /srv/gump/public/workspace/tapestry/gump_mvn_settings.xml package 
[Working Directory: /srv/gump/public/workspace/tapestry]
---------------------------------------------
Downloading: http://antlr.org/antlr-snapshot/org/antlr/antlr/3.1.1/antlr-3.1.1.jar
[INFO] Unable to find resource 'org.antlr:antlr:jar:3.1.1' in repository antlr-snapshot (http://antlr.org/antlr-snapshot)
Downloading: http://localhost:8192/maven2/org/antlr/antlr/3.1.1/antlr-3.1.1.jar

Downloading: http://antlr.org/antlr-snapshot/org/antlr/stringtemplate/3.2/stringtemplate-3.2.jar
[INFO] Unable to find resource 'org.antlr:stringtemplate:jar:3.2' in repository antlr-snapshot (http://antlr.org/antlr-snapshot)
Downloading: http://localhost:8192/maven2/org/antlr/stringtemplate/3.2/stringtemplate-3.2.jar

[INFO] [antlr3:antlr {execution: default}]
org/apache/tapestry5/internal/antlr/PropertyExpressionLexer.g
org/apache/tapestry5/internal/antlr/PropertyExpressionParser.g
Downloading: http://localhost:8192/maven2/org/antlr/antlr-runtime/3.1.1/antlr-runtime-3.1.1.pom

Downloading: http://localhost:8192/maven2/org/codehaus/groovy/groovy-all/1.7.4/groovy-all-1.7.4.pom

Downloading: http://localhost:8192/maven2/org/antlr/antlr-runtime/3.1.1/antlr-runtime-3.1.1.jar
Downloading: http://localhost:8192/maven2/org/codehaus/groovy/groovy-all/1.7.4/groovy-all-1.7.4.jar


[INFO] [remote-resources:process {execution: default}]
[INFO] [resources:resources {execution: default-resources}]
[INFO] Using 'UTF-8' encoding to copy filtered resources.
[INFO] Copying 6 resources
[INFO] Copying 178 resources
[INFO] Copying 3 resources
[INFO] [compiler:compile {execution: default-compile}]
[INFO] Compiling 907 source files to /srv/gump/public/workspace/tapestry/tapestry-core/target/classes
[INFO] ------------------------------------------------------------------------
[ERROR] BUILD FAILURE
[INFO] ------------------------------------------------------------------------
[INFO] Compilation failure

/srv/gump/public/workspace/tapestry/tapestry-core/src/main/java/org/apache/tapestry5/internal/transform/ComponentWorker.java:[124,20] setPublishedParameters(java.util.List<java.lang.String>) in org.apache.tapestry5.model.MutableEmbeddedComponentModel cannot be applied to (java.util.List<java.lang.Object>)

/srv/gump/public/workspace/tapestry/tapestry-core/src/main/java/org/apache/tapestry5/internal/services/MarkupWriterImpl.java:[264,63] incompatible types
found   : java.lang.Object
required: org.apache.tapestry5.MarkupWriterListener

/srv/gump/public/workspace/tapestry/tapestry-core/src/main/java/org/apache/tapestry5/internal/services/MarkupWriterImpl.java:[279,63] incompatible types
found   : java.lang.Object
required: org.apache.tapestry5.MarkupWriterListener


[INFO] ------------------------------------------------------------------------
[INFO] For more information, run Maven with the -e switch
[INFO] ------------------------------------------------------------------------
[INFO] Total time: 5 minutes 22 seconds
[INFO] Finished at: Sat Sep 25 14:33:02 UTC 2010
[INFO] Final Memory: 129M/416M
[INFO] ------------------------------------------------------------------------
---------------------------------------------

To subscribe to this information via syndicated feeds:
- RSS: http://vmgump.apache.org/gump/public/tapestry/tapestry/rss.xml
- Atom: http://vmgump.apache.org/gump/public/tapestry/tapestry/atom.xml

============================== Gump Tracking Only ===
Produced by Gump version 2.3.
Gump Run 14000625092010, vmgump.apache.org:vmgump:14000625092010
Gump E-mail Identifier (unique within run) #33.

*********************************************************** G U M P
[GUMP@vmgump]: Project cocoon22-reactor (in module cocoon) failed
To whom it may engage...
        
This is an automated request, but not an unsolicited one. For 
more information please visit http://gump.apache.org/nagged.html, 
and/or contact the folk at general@gump.apache.org.

Project cocoon22-reactor has an issue affecting its community integration.
This issue affects 1 projects,
 and has been outstanding for 143 runs.
The current state of this project is 'Failed', with reason 'Build Failed'.
For reference only, the following projects are affected by this:
    - cocoon22-reactor :  Java XML Framework


Full details are available at:
    http://vmgump.apache.org/gump/public/cocoon/cocoon22-reactor/index.html

That said, some information snippets are provided here.

The following annotations (debug/informational/warning/error messages) were provided:
 -INFO- Optional dependency htmlunit failed with reason build failed
 -INFO- Optional dependency cocoon22-flowscript-impl failed with reason build failed
 -INFO- Optional dependency xml-fop prerequisite failed with reason build failed
 -INFO- Optional dependency xml-batik failed with reason build failed
 -DEBUG- (Gump generated) Maven2 Settings in: /srv/gump/public/workspace/cocoon/gump_mvn_settings.xml
 -INFO- Failed with reason build failed
 -DEBUG- Maven POM in: /srv/gump/public/workspace/cocoon/pom.xml



The following work was performed:
http://vmgump.apache.org/gump/public/cocoon/cocoon22-reactor/gump_work/build_cocoon_cocoon22-reactor.html
Work Name: build_cocoon_cocoon22-reactor (Type: Build)
Work ended in a state of : Failed
Elapsed: 1 min 13 secs
Command Line: mvn --batch-mode --settings /srv/gump/public/workspace/cocoon/gump_mvn_settings.xml package 
[Working Directory: /srv/gump/public/workspace/cocoon]
---------------------------------------------
8) daisy:daisy-htmlcleaner:jar:1.5-dev

  Try downloading the file manually from the project website.

  Then, install it using the command: 
      mvn install:install-file -DgroupId=daisy -DartifactId=daisy-htmlcleaner -Dversion=1.5-dev -Dpackaging=jar -Dfile=/path/to/file

  Alternatively, if you host your own repository you can deploy the file there: 
      mvn deploy:deploy-file -DgroupId=daisy -DartifactId=daisy-htmlcleaner -Dversion=1.5-dev -Dpackaging=jar -Dfile=/path/to/file -Durl=[url] -DrepositoryId=[id]

  Path to dependency: 
  	1) org.apache.cocoon:cocoon-sitemaptags2daisy-plugin:maven-plugin:1.0.0-SNAPSHOT
  	2) daisy:daisy-htmlcleaner:jar:1.5-dev

9) daisy:daisy-util:jar:1.5-dev

  Try downloading the file manually from the project website.

  Then, install it using the command: 
      mvn install:install-file -DgroupId=daisy -DartifactId=daisy-util -Dversion=1.5-dev -Dpackaging=jar -Dfile=/path/to/file

  Alternatively, if you host your own repository you can deploy the file there: 
      mvn deploy:deploy-file -DgroupId=daisy -DartifactId=daisy-util -Dversion=1.5-dev -Dpackaging=jar -Dfile=/path/to/file -Durl=[url] -DrepositoryId=[id]

  Path to dependency: 
  	1) org.apache.cocoon:cocoon-sitemaptags2daisy-plugin:maven-plugin:1.0.0-SNAPSHOT
  	2) daisy:daisy-util:jar:1.5-dev

----------
9 required artifacts are missing.

for artifact: 
  org.apache.cocoon:cocoon-sitemaptags2daisy-plugin:maven-plugin:1.0.0-SNAPSHOT

from the specified remote repositories:
  gump-central (http://localhost:8192/maven2),
  maven-snapshot (http://snapshots.maven.codehaus.org/maven2/),
  cocoondev (http://cocoondev.org/repository),
  gump-apache.snapshots (http://localhost:8192/repo/m2-snapshot-repository),
  gkossakowski-maven2 (http://people.apache.org/~gkossakowski/maven2/repository)



[INFO] ------------------------------------------------------------------------
[INFO] For more information, run Maven with the -e switch
[INFO] ------------------------------------------------------------------------
[INFO] Total time: 1 minute 11 seconds
[INFO] Finished at: Sat Sep 25 14:55:52 UTC 2010
[INFO] Final Memory: 93M/223M
[INFO] ------------------------------------------------------------------------
---------------------------------------------

To subscribe to this information via syndicated feeds:
- RSS: http://vmgump.apache.org/gump/public/cocoon/cocoon22-reactor/rss.xml
- Atom: http://vmgump.apache.org/gump/public/cocoon/cocoon22-reactor/atom.xml

============================== Gump Tracking Only ===
Produced by Gump version 2.3.
Gump Run 14000625092010, vmgump.apache.org:vmgump:14000625092010
Gump E-mail Identifier (unique within run) #40.

*********************************************************** G U M P
[GUMP@vmgump]: Project ws-commons-axiom (in module ws-axis2-commons) failed
To whom it may engage...
        
This is an automated request, but not an unsolicited one. For 
more information please visit http://gump.apache.org/nagged.html, 
and/or contact the folk at general@gump.apache.org.

Project ws-commons-axiom has an issue affecting its community integration.
This issue affects 1 projects,
 and has been outstanding for 137 runs.
The current state of this project is 'Failed', with reason 'Build Failed'.
For reference only, the following projects are affected by this:
    - ws-commons-axiom :  Common stuff for the WS projects.


Full details are available at:
    http://vmgump.apache.org/gump/public/ws-axis2-commons/ws-commons-axiom/index.html

That said, some information snippets are provided here.

The following annotations (debug/informational/warning/error messages) were provided:
 -INFO- Optional dependency xml-batik failed with reason build failed
 -DEBUG- (Gump generated) Maven2 Settings in: /srv/gump/public/workspace/ws-axis2-commons/axiom/gump_mvn_settings.xml
 -INFO- Failed with reason build failed
 -DEBUG- Maven POM in: /srv/gump/public/workspace/ws-axis2-commons/axiom/pom.xml



The following work was performed:
http://vmgump.apache.org/gump/public/ws-axis2-commons/ws-commons-axiom/gump_work/build_ws-axis2-commons_ws-commons-axiom.html
Work Name: build_ws-axis2-commons_ws-commons-axiom (Type: Build)
Work ended in a state of : Failed
Elapsed: 1 min 37 secs
Command Line: mvn --batch-mode --settings /srv/gump/public/workspace/ws-axis2-commons/axiom/gump_mvn_settings.xml install 
[Working Directory: /srv/gump/public/workspace/ws-axis2-commons/axiom]
---------------------------------------------

Downloading: http://localhost:8192/maven2/org/apache/maven/maven-plugin-parameter-documenter/2.0/maven-plugin-parameter-documenter-2.0.pom

Downloading: http://localhost:8192/maven2/org/apache/maven/wagon/wagon-http-lightweight/1.0-alpha-5/wagon-http-lightweight-1.0-alpha-5.pom

Downloading: http://localhost:8192/maven2/org/apache/maven/reporting/maven-reporting-api/2.0/maven-reporting-api-2.0.pom

Downloading: http://localhost:8192/maven2/org/apache/maven/reporting/maven-reporting/2.0/maven-reporting-2.0.pom

Downloading: http://localhost:8192/maven2/org/apache/maven/maven-error-diagnostics/2.0/maven-error-diagnostics-2.0.pom

Downloading: http://localhost:8192/maven2/org/apache/maven/maven-plugin-registry/2.0/maven-plugin-registry-2.0.pom

Downloading: http://localhost:8192/maven2/org/apache/maven/maven-plugin-descriptor/2.0/maven-plugin-descriptor-2.0.pom

Downloading: http://localhost:8192/maven2/org/apache/maven/maven-monitor/2.0/maven-monitor-2.0.pom

Downloading: http://localhost:8192/maven2/org/apache/maven/wagon/wagon-ssh/1.0-alpha-5/wagon-ssh-1.0-alpha-5.pom

Downloading: http://localhost:8192/maven2/com/jcraft/jsch/0.1.23/jsch-0.1.23.pom

Downloading: http://localhost:8192/maven2/org/apache/maven/doxia/doxia-site-renderer/1.0-alpha-8/doxia-site-renderer-1.0-alpha-8.jar
Downloading: http://localhost:8192/maven2/org/apache/commons/commons-compress/1.0/commons-compress-1.0.jar
Downloading: http://localhost:8192/maven2/org/codehaus/plexus/plexus-utils/1.4/plexus-utils-1.4.jar
Downloading: http://localhost:8192/maven2/commons-cli/commons-cli/1.1/commons-cli-1.1.jar
Downloading: http://localhost:8192/maven2/org/apache/maven/shared/maven-plugin-testing-harness/1.0-beta-1/maven-plugin-testing-harness-1.0-beta-1.jar
47K downloaded  (commons-cli-1.1.jar)
Downloading: http://localhost:8192/maven2/org/apache/rat/apache-rat-core/0.7/apache-rat-core-0.7.jar
157K downloaded  (commons-compress-1.0.jar)
94K downloaded  (apache-rat-core-0.7.jar)


Downloading: http://localhost:8192/maven2/org/apache/maven/doxia/doxia-core/1.0-alpha-8/doxia-core-1.0-alpha-8.jar


Downloading: http://localhost:8192/maven2/org/apache/maven/doxia/doxia-decoration-model/1.0-alpha-8/doxia-decoration-model-1.0-alpha-8.jar

[INFO] [apache-rat:check {execution: default}]
[INFO] Exclude: src/test/resources/**
[INFO] ------------------------------------------------------------------------
[ERROR] BUILD FAILURE
[INFO] ------------------------------------------------------------------------
[INFO] Too many unapproved licenses: 1
[INFO] ------------------------------------------------------------------------
[INFO] For more information, run Maven with the -e switch
[INFO] ------------------------------------------------------------------------
[INFO] Total time: 1 minute 36 seconds
[INFO] Finished at: Sat Sep 25 14:58:21 UTC 2010
[INFO] Final Memory: 45M/107M
[INFO] ------------------------------------------------------------------------
---------------------------------------------

To subscribe to this information via syndicated feeds:
- RSS: http://vmgump.apache.org/gump/public/ws-axis2-commons/ws-commons-axiom/rss.xml
- Atom: http://vmgump.apache.org/gump/public/ws-axis2-commons/ws-commons-axiom/atom.xml

============================== Gump Tracking Only ===
Produced by Gump version 2.3.
Gump Run 14000625092010, vmgump.apache.org:vmgump:14000625092010
Gump E-mail Identifier (unique within run) #41.

*********************************************************** G U M P
[GUMP@vmgump]: Project openjpa-kernel (in module openjpa) failed
To whom it may engage...
        
This is an automated request, but not an unsolicited one. For 
more information please visit http://gump.apache.org/nagged.html, 
and/or contact the folk at general@gump.apache.org.

Project openjpa-kernel has an issue affecting its community integration.
This issue affects 8 projects,
 and has been outstanding for 16 runs.
The current state of this project is 'Failed', with reason 'Build Failed'.
For reference only, the following projects are affected by this:
    - openjpa :  Apache OpenJPA is a Java persistence project that can be use...
    - openjpa-jdbc :  Apache OpenJPA is a Java persistence project that can be use...
    - openjpa-kernel :  Apache OpenJPA is a Java persistence project that can be use...
    - openjpa-persistence :  Apache OpenJPA is a Java persistence project that can be use...
    - openjpa-persistence-jdbc :  Apache OpenJPA is a Java persistence project that can be use...
    - openjpa-slice :  Apache OpenJPA is a Java persistence project that can be use...
    - openjpa-testsupport :  Apache OpenJPA is a Java persistence project that can be use...
    - openjpa-xmlstore :  Apache OpenJPA is a Java persistence project that can be use...


Full details are available at:
    http://vmgump.apache.org/gump/public/openjpa/openjpa-kernel/index.html

That said, some information snippets are provided here.

The following annotations (debug/informational/warning/error messages) were provided:
 -DEBUG- Sole jar output [openjpa-kernel-*[0-9T].jar] identifier set to project name
 -DEBUG- (Gump generated) Maven2 Settings in: /srv/gump/public/workspace/openjpa/openjpa-kernel/gump_mvn_settings.xml
 -INFO- Failed with reason build failed
 -DEBUG- Maven POM in: /srv/gump/public/workspace/openjpa/openjpa-kernel/pom.xml
 -INFO- Failed to extract fallback artifacts from Gump Repository



The following work was performed:
http://vmgump.apache.org/gump/public/openjpa/openjpa-kernel/gump_work/build_openjpa_openjpa-kernel.html
Work Name: build_openjpa_openjpa-kernel (Type: Build)
Work ended in a state of : Failed
Elapsed: 34 secs
Command Line: mvn --batch-mode -Dcheckstyle.skip=true --settings /srv/gump/public/workspace/openjpa/openjpa-kernel/gump_mvn_settings.xml package 
[Working Directory: /srv/gump/public/workspace/openjpa/openjpa-kernel]
---------------------------------------------
location: class org.apache.openjpa.enhance.PCDataGenerator

/srv/gump/public/workspace/openjpa/openjpa-kernel/src/main/java/org/apache/openjpa/enhance/PCDataGenerator.java:[762,33] cannot find symbol
symbol  : class BCClass
location: class org.apache.openjpa.enhance.PCDataGenerator

/srv/gump/public/workspace/openjpa/openjpa-kernel/src/main/java/org/apache/openjpa/enhance/PCDataGenerator.java:[769,32] cannot find symbol
symbol  : class BCClass
location: class org.apache.openjpa.enhance.PCDataGenerator

/srv/gump/public/workspace/openjpa/openjpa-kernel/src/main/java/org/apache/openjpa/enhance/PCDataGenerator.java:[855,26] cannot find symbol
symbol  : class BCClass
location: class org.apache.openjpa.enhance.PCDataGenerator

/srv/gump/public/workspace/openjpa/openjpa-kernel/src/main/java/org/apache/openjpa/enhance/PCDataGenerator.java:[855,38] cannot find symbol
symbol  : class Code
location: class org.apache.openjpa.enhance.PCDataGenerator

/srv/gump/public/workspace/openjpa/openjpa-kernel/src/main/java/org/apache/openjpa/enhance/PCDataGenerator.java:[944,32] cannot find symbol
symbol  : class BCClass
location: class org.apache.openjpa.enhance.PCDataGenerator

/srv/gump/public/workspace/openjpa/openjpa-kernel/src/main/java/org/apache/openjpa/enhance/PCDataGenerator.java:[967,28] cannot find symbol
symbol  : class BCClass
location: class org.apache.openjpa.enhance.PCDataGenerator

/srv/gump/public/workspace/openjpa/openjpa-kernel/src/main/java/org/apache/openjpa/enhance/PCDataGenerator.java:[1030,38] cannot find symbol
symbol  : class BCClass
location: class org.apache.openjpa.enhance.PCDataGenerator

/srv/gump/public/workspace/openjpa/openjpa-kernel/src/main/java/org/apache/openjpa/enhance/PCDataGenerator.java:[1049,29] cannot find symbol
symbol  : class Instruction
location: class org.apache.openjpa.enhance.PCDataGenerator

/srv/gump/public/workspace/openjpa/openjpa-kernel/src/main/java/org/apache/openjpa/enhance/PCDataGenerator.java:[1049,57] cannot find symbol
symbol  : class Instruction
location: class org.apache.openjpa.enhance.PCDataGenerator

/srv/gump/public/workspace/openjpa/openjpa-kernel/src/main/java/org/apache/openjpa/enhance/DynamicStorageGenerator.java:[98,18] cannot find symbol
symbol  : class Project
location: class org.apache.openjpa.enhance.DynamicStorageGenerator


[INFO] ------------------------------------------------------------------------
[INFO] For more information, run Maven with the -e switch
[INFO] ------------------------------------------------------------------------
[INFO] Total time: 33 seconds
[INFO] Finished at: Sat Sep 25 15:56:03 UTC 2010
[INFO] Final Memory: 66M/215M
[INFO] ------------------------------------------------------------------------
---------------------------------------------

To subscribe to this information via syndicated feeds:
- RSS: http://vmgump.apache.org/gump/public/openjpa/openjpa-kernel/rss.xml
- Atom: http://vmgump.apache.org/gump/public/openjpa/openjpa-kernel/atom.xml

============================== Gump Tracking Only ===
Produced by Gump version 2.3.
Gump Run 14000625092010, vmgump.apache.org:vmgump:14000625092010
Gump E-mail Identifier (unique within run) #44.

*********************************************************** G U M P
[GUMP@vmgump]: Project portals-pluto-trunk-test (in module portals-pluto-trunk) failed
To whom it may engage...
        
This is an automated request, but not an unsolicited one. For 
more information please visit http://gump.apache.org/nagged.html, 
and/or contact the folk at general@gump.apache.org.

Project portals-pluto-trunk-test has an issue affecting its community integration.
This issue affects 1 projects,
 and has been outstanding for 16 runs.
The current state of this project is 'Failed', with reason 'Build Failed'.
For reference only, the following projects are affected by this:
    - portals-pluto-trunk-test :  JSR168 Container


Full details are available at:
    http://vmgump.apache.org/gump/public/portals-pluto-trunk/portals-pluto-trunk-test/index.html

That said, some information snippets are provided here.

The following annotations (debug/informational/warning/error messages) were provided:
 -WARNING- Overriding Maven2 settings: [/srv/gump/public/workspace/portals-pluto-trunk/gump_mvn_settings.xml]
 -DEBUG- (Gump generated) Maven2 Settings in: /srv/gump/public/workspace/portals-pluto-trunk/gump_mvn_settings.xml
 -INFO- Failed with reason build failed
 -DEBUG- Maven POM in: /srv/gump/public/workspace/portals-pluto-trunk/pom.xml



The following work was performed:
http://vmgump.apache.org/gump/public/portals-pluto-trunk/portals-pluto-trunk-test/gump_work/build_portals-pluto-trunk_portals-pluto-trunk-test.html
Work Name: build_portals-pluto-trunk_portals-pluto-trunk-test (Type: Build)
Work ended in a state of : Failed
Elapsed: 26 secs
Command Line: mvn --batch-mode --settings /srv/gump/public/workspace/portals-pluto-trunk/gump_mvn_settings.xml package 
[Working Directory: /srv/gump/public/workspace/portals-pluto-trunk]
---------------------------------------------
[ERROR] FATAL ERROR
[INFO] ------------------------------------------------------------------------
[INFO] org/xmlpull/v1/XmlPullParserFactory
org.xmlpull.v1.XmlPullParserFactory
[INFO] ------------------------------------------------------------------------
[INFO] Trace
java.lang.NoClassDefFoundError: org/xmlpull/v1/XmlPullParserFactory
	at com.thoughtworks.xstream.io.xml.XppDriver.createParser(XppDriver.java:57)
	at com.thoughtworks.xstream.io.xml.AbstractXppDriver.createReader(AbstractXppDriver.java:56)
	at com.thoughtworks.xstream.XStream.fromXML(XStream.java:879)
	at org.apache.maven.plugin.war.util.WebappStructureSerializer.fromXml(WebappStructureSerializer.java:73)
	at org.apache.maven.plugin.war.AbstractWarMojo.buildWebapp(AbstractWarMojo.java:423)
	at org.apache.maven.plugin.war.AbstractWarMojo.buildExplodedWebapp(AbstractWarMojo.java:394)
	at org.apache.maven.plugin.war.WarMojo.performPackaging(WarMojo.java:195)
	at org.apache.maven.plugin.war.WarMojo.execute(WarMojo.java:157)
	at org.apache.maven.plugin.DefaultPluginManager.executeMojo(DefaultPluginManager.java:490)
	at org.apache.maven.lifecycle.DefaultLifecycleExecutor.executeGoals(DefaultLifecycleExecutor.java:694)
	at org.apache.maven.lifecycle.DefaultLifecycleExecutor.executeGoalWithLifecycle(DefaultLifecycleExecutor.java:556)
	at org.apache.maven.lifecycle.DefaultLifecycleExecutor.executeGoal(DefaultLifecycleExecutor.java:535)
	at org.apache.maven.lifecycle.DefaultLifecycleExecutor.executeGoalAndHandleFailures(DefaultLifecycleExecutor.java:387)
	at org.apache.maven.lifecycle.DefaultLifecycleExecutor.executeTaskSegments(DefaultLifecycleExecutor.java:348)
	at org.apache.maven.lifecycle.DefaultLifecycleExecutor.execute(DefaultLifecycleExecutor.java:180)
	at org.apache.maven.DefaultMaven.doExecute(DefaultMaven.java:328)
	at org.apache.maven.DefaultMaven.execute(DefaultMaven.java:138)
	at org.apache.maven.cli.MavenCli.main(MavenCli.java:362)
	at org.apache.maven.cli.compat.CompatibleMain.main(CompatibleMain.java:60)
	at sun.reflect.NativeMethodAccessorImpl.invoke0(Native Method)
	at sun.reflect.NativeMethodAccessorImpl.invoke(NativeMethodAccessorImpl.java:57)
	at sun.reflect.DelegatingMethodAccessorImpl.invoke(DelegatingMethodAccessorImpl.java:43)
	at java.lang.reflect.Method.invoke(Method.java:616)
	at org.codehaus.classworlds.Launcher.launchEnhanced(Launcher.java:315)
	at org.codehaus.classworlds.Launcher.launch(Launcher.java:255)
	at org.codehaus.classworlds.Launcher.mainWithExitCode(Launcher.java:430)
	at org.codehaus.classworlds.Launcher.main(Launcher.java:375)
Caused by: java.lang.ClassNotFoundException: org.xmlpull.v1.XmlPullParserFactory
	at java.net.URLClassLoader$1.run(URLClassLoader.java:217)
	at java.security.AccessController.doPrivileged(Native Method)
	at java.net.URLClassLoader.findClass(URLClassLoader.java:205)
	at java.lang.ClassLoader.loadClass(ClassLoader.java:321)
	at org.codehaus.classworlds.RealmClassLoader.loadClassDirect(RealmClassLoader.java:195)
	at org.codehaus.classworlds.DefaultClassRealm.loadClass(DefaultClassRealm.java:255)
	at org.codehaus.classworlds.DefaultClassRealm.loadClass(DefaultClassRealm.java:274)
	at org.codehaus.classworlds.RealmClassLoader.loadClass(RealmClassLoader.java:214)
	at java.lang.ClassLoader.loadClass(ClassLoader.java:266)
	... 27 more
[INFO] ------------------------------------------------------------------------
[INFO] Total time: 24 seconds
[INFO] Finished at: Sat Sep 25 16:02:26 UTC 2010
[INFO] Final Memory: 50M/121M
[INFO] ------------------------------------------------------------------------
---------------------------------------------

To subscribe to this information via syndicated feeds:
- RSS: http://vmgump.apache.org/gump/public/portals-pluto-trunk/portals-pluto-trunk-test/rss.xml
- Atom: http://vmgump.apache.org/gump/public/portals-pluto-trunk/portals-pluto-trunk-test/atom.xml

============================== Gump Tracking Only ===
Produced by Gump version 2.3.
Gump Run 14000625092010, vmgump.apache.org:vmgump:14000625092010
Gump E-mail Identifier (unique within run) #45.

*********************************************************** G U M P
[GUMP@vmgump]: Project cocoon3-reactor (in module cocoon3) failed
To whom it may engage...
        
This is an automated request, but not an unsolicited one. For 
more information please visit http://gump.apache.org/nagged.html, 
and/or contact the folk at general@gump.apache.org.

Project cocoon3-reactor has an issue affecting its community integration.
This issue affects 1 projects,
 and has been outstanding for 4 runs.
The current state of this project is 'Failed', with reason 'Build Failed'.
For reference only, the following projects are affected by this:
    - cocoon3-reactor :  Java XML Framework


Full details are available at:
    http://vmgump.apache.org/gump/public/cocoon3/cocoon3-reactor/index.html

That said, some information snippets are provided here.

The following annotations (debug/informational/warning/error messages) were provided:
 -DEBUG- (Gump generated) Maven2 Settings in: /srv/gump/public/workspace/cocoon3/gump_mvn_settings.xml
 -INFO- Failed with reason build failed
 -DEBUG- Maven POM in: /srv/gump/public/workspace/cocoon3/pom.xml



The following work was performed:
http://vmgump.apache.org/gump/public/cocoon3/cocoon3-reactor/gump_work/build_cocoon3_cocoon3-reactor.html
Work Name: build_cocoon3_cocoon3-reactor (Type: Build)
Work ended in a state of : Failed
Elapsed: 38 secs
Command Line: mvn --batch-mode --settings /srv/gump/public/workspace/cocoon3/gump_mvn_settings.xml package 
[Working Directory: /srv/gump/public/workspace/cocoon3]
---------------------------------------------
[INFO] [remote-resources:process {execution: default}]
[INFO] [resources:resources {execution: default-resources}]
[INFO] Using 'UTF-8' encoding to copy filtered resources.
[INFO] Copying 2 resources
[INFO] Copying 3 resources
[INFO] [compiler:compile {execution: default-compile}]
[INFO] Nothing to compile - all classes are up to date
[INFO] [resources:testResources {execution: default-testResources}]
[INFO] Using 'UTF-8' encoding to copy filtered resources.
[INFO] Copying 4 resources
[INFO] Copying 3 resources
[INFO] [compiler:testCompile {execution: default-testCompile}]
[INFO] Nothing to compile - all classes are up to date
[INFO] [surefire:test {execution: default-test}]
[INFO] Surefire report directory: /srv/gump/public/workspace/cocoon3/cocoon-optional/target/surefire-reports

-------------------------------------------------------
 T E S T S
-------------------------------------------------------
Running org.apache.cocoon.optional.pipeline.components.sax.jaxb.JAXBGeneratorTestCase
Tests run: 3, Failures: 0, Errors: 0, Skipped: 0, Time elapsed: 1.399 sec
Running org.apache.cocoon.optional.pipeline.components.sax.betwixt.BetwixtBeanGeneratorTest
Tests run: 2, Failures: 0, Errors: 0, Skipped: 0, Time elapsed: 0.281 sec
Running org.apache.cocoon.optional.pipeline.components.sax.fop.FopSerializerTestCase
Tests run: 1, Failures: 0, Errors: 0, Skipped: 0, Time elapsed: 1.738 sec
Running org.apache.cocoon.optional.pipeline.components.sax.solr.SolrConsumerTestCase
Tests run: 1, Failures: 0, Errors: 1, Skipped: 0, Time elapsed: 0.01 sec <<< FAILURE!
Running org.apache.cocoon.optional.pipeline.components.sax.neko.NekoGeneratorTestCase
Tests run: 1, Failures: 0, Errors: 0, Skipped: 0, Time elapsed: 0.05 sec

Results :

Tests in error: 
  testPipelineWithSolrConsumer(org.apache.cocoon.optional.pipeline.components.sax.solr.SolrConsumerTestCase)

Tests run: 8, Failures: 0, Errors: 1, Skipped: 0

[INFO] ------------------------------------------------------------------------
[ERROR] BUILD FAILURE
[INFO] ------------------------------------------------------------------------
[INFO] There are test failures.

Please refer to /srv/gump/public/workspace/cocoon3/cocoon-optional/target/surefire-reports for the individual test results.
[INFO] ------------------------------------------------------------------------
[INFO] For more information, run Maven with the -e switch
[INFO] ------------------------------------------------------------------------
[INFO] Total time: 37 seconds
[INFO] Finished at: Sat Sep 25 16:04:12 UTC 2010
[INFO] Final Memory: 69M/165M
[INFO] ------------------------------------------------------------------------
---------------------------------------------

To subscribe to this information via syndicated feeds:
- RSS: http://vmgump.apache.org/gump/public/cocoon3/cocoon3-reactor/rss.xml
- Atom: http://vmgump.apache.org/gump/public/cocoon3/cocoon3-reactor/atom.xml

============================== Gump Tracking Only ===
Produced by Gump version 2.3.
Gump Run 14000625092010, vmgump.apache.org:vmgump:14000625092010
Gump E-mail Identifier (unique within run) #46.

*********************************************************** G U M P
[GUMP@vmgump]: Project portals-bridges-script-test (in module portals-bridges) failed
To whom it may engage...
        
This is an automated request, but not an unsolicited one. For 
more information please visit http://gump.apache.org/nagged.html, 
and/or contact the folk at general@gump.apache.org.

Project portals-bridges-script-test has an issue affecting its community integration.
This issue affects 1 projects,
 and has been outstanding for 16 runs.
The current state of this project is 'Failed', with reason 'Build Failed'.
For reference only, the following projects are affected by this:
    - portals-bridges-script-test :  Support for JSR168 compliant Portlet development


Full details are available at:
    http://vmgump.apache.org/gump/public/portals-bridges/portals-bridges-script-test/index.html

That said, some information snippets are provided here.

The following annotations (debug/informational/warning/error messages) were provided:
 -WARNING- Overriding Maven2 settings: [/srv/gump/public/workspace/portals-bridges/bridges-script/trunk/portlet/gump_mvn_settings.xml]
 -DEBUG- (Gump generated) Maven2 Settings in: /srv/gump/public/workspace/portals-bridges/bridges-script/trunk/portlet/gump_mvn_settings.xml
 -INFO- Failed with reason build failed
 -DEBUG- Maven POM in: /srv/gump/public/workspace/portals-bridges/bridges-script/trunk/portlet/pom.xml



The following work was performed:
http://vmgump.apache.org/gump/public/portals-bridges/portals-bridges-script-test/gump_work/build_portals-bridges_portals-bridges-script-test.html
Work Name: build_portals-bridges_portals-bridges-script-test (Type: Build)
Work ended in a state of : Failed
Elapsed: 25 secs
Command Line: mvn --batch-mode --settings /srv/gump/public/workspace/portals-bridges/bridges-script/trunk/portlet/gump_mvn_settings.xml package 
[Working Directory: /srv/gump/public/workspace/portals-bridges/bridges-script/trunk/portlet]
---------------------------------------------
[INFO] Surefire report directory: /srv/gump/public/workspace/portals-bridges/bridges-script/trunk/portlet/target/surefire-reports

-------------------------------------------------------
 T E S T S
-------------------------------------------------------
Running org.apache.portals.bridges.script.TestHelloJythonScriptPortlet
Tests run: 5, Failures: 0, Errors: 5, Skipped: 0, Time elapsed: 5.343 sec <<< FAILURE!
Running org.apache.portals.bridges.script.TestHelloJRubyScriptPortlet
Tests run: 5, Failures: 0, Errors: 0, Skipped: 0, Time elapsed: 5.617 sec
Running org.apache.portals.bridges.script.TestHelloRhinoScriptPortlet
[WARNING] Rhino script engine embedded in the default Java 1.6+ has not fully tested yet.
[WARNING] Rhino script engine embedded in the default Java 1.6+ has not fully tested yet.
[WARNING] Rhino script engine embedded in the default Java 1.6+ has not fully tested yet.
[WARNING] Rhino script engine embedded in the default Java 1.6+ has not fully tested yet.
[WARNING] Rhino script engine embedded in the default Java 1.6+ has not fully tested yet.
[WARNING] Rhino script engine embedded in the default Java 1.6+ has not fully tested yet.
[WARNING] Rhino script engine embedded in the default Java 1.6+ has not fully tested yet.
[WARNING] Rhino script engine embedded in the default Java 1.6+ has not fully tested yet.
[WARNING] Rhino script engine embedded in the default Java 1.6+ has not fully tested yet.
[WARNING] Rhino script engine embedded in the default Java 1.6+ has not fully tested yet.
Tests run: 5, Failures: 0, Errors: 0, Skipped: 0, Time elapsed: 0.02 sec
Running org.apache.portals.bridges.script.TestHelloGroovyScriptPortlet
Tests run: 5, Failures: 0, Errors: 0, Skipped: 0, Time elapsed: 5.254 sec
Running org.apache.portals.bridges.script.TestHelloBeanShellScriptPortlet
Tests run: 5, Failures: 0, Errors: 0, Skipped: 0, Time elapsed: 2.957 sec

Results :

Tests in error: 
  testInit(org.apache.portals.bridges.script.TestHelloJythonScriptPortlet)
  testRender(org.apache.portals.bridges.script.TestHelloJythonScriptPortlet)
  testProcessAction(org.apache.portals.bridges.script.TestHelloJythonScriptPortlet)
  testProcessEvent(org.apache.portals.bridges.script.TestHelloJythonScriptPortlet)
  testServeResource(org.apache.portals.bridges.script.TestHelloJythonScriptPortlet)

Tests run: 25, Failures: 0, Errors: 5, Skipped: 0

[INFO] ------------------------------------------------------------------------
[ERROR] BUILD FAILURE
[INFO] ------------------------------------------------------------------------
[INFO] There are test failures.

Please refer to /srv/gump/public/workspace/portals-bridges/bridges-script/trunk/portlet/target/surefire-reports for the individual test results.
[INFO] ------------------------------------------------------------------------
[INFO] For more information, run Maven with the -e switch
[INFO] ------------------------------------------------------------------------
[INFO] Total time: 24 seconds
[INFO] Finished at: Sat Sep 25 16:04:39 UTC 2010
[INFO] Final Memory: 24M/57M
[INFO] ------------------------------------------------------------------------
---------------------------------------------

To subscribe to this information via syndicated feeds:
- RSS: http://vmgump.apache.org/gump/public/portals-bridges/portals-bridges-script-test/rss.xml
- Atom: http://vmgump.apache.org/gump/public/portals-bridges/portals-bridges-script-test/atom.xml

============================== Gump Tracking Only ===
Produced by Gump version 2.3.
Gump Run 14000625092010, vmgump.apache.org:vmgump:14000625092010
Gump E-mail Identifier (unique within run) #47.

*********************************************************** G U M P
[GUMP@vmgump]: Project cocoon-optional-test (in module cocoon3) failed
To whom it may engage...
        
This is an automated request, but not an unsolicited one. For 
more information please visit http://gump.apache.org/nagged.html, 
and/or contact the folk at general@gump.apache.org.

Project cocoon-optional-test has an issue affecting its community integration.
This issue affects 1 projects,
 and has been outstanding for 4 runs.
The current state of this project is 'Failed', with reason 'Build Failed'.
For reference only, the following projects are affected by this:
    - cocoon-optional-test :  Java XML Framework


Full details are available at:
    http://vmgump.apache.org/gump/public/cocoon3/cocoon-optional-test/index.html

That said, some information snippets are provided here.

The following annotations (debug/informational/warning/error messages) were provided:
 -WARNING- Overriding Maven2 settings: [/srv/gump/public/workspace/cocoon3/cocoon-optional/gump_mvn_settings.xml]
 -DEBUG- (Gump generated) Maven2 Settings in: /srv/gump/public/workspace/cocoon3/cocoon-optional/gump_mvn_settings.xml
 -INFO- Failed with reason build failed
 -DEBUG- Maven POM in: /srv/gump/public/workspace/cocoon3/cocoon-optional/pom.xml
 -INFO- Project Reports in: /srv/gump/public/workspace/cocoon3/cocoon-optional/target/surefire-reports



The following work was performed:
http://vmgump.apache.org/gump/public/cocoon3/cocoon-optional-test/gump_work/build_cocoon3_cocoon-optional-test.html
Work Name: build_cocoon3_cocoon-optional-test (Type: Build)
Work ended in a state of : Failed
Elapsed: 20 secs
Command Line: mvn --batch-mode --settings /srv/gump/public/workspace/cocoon3/cocoon-optional/gump_mvn_settings.xml test 
[Working Directory: /srv/gump/public/workspace/cocoon3/cocoon-optional]
---------------------------------------------
[INFO] [remote-resources:process {execution: default}]
[INFO] [resources:resources {execution: default-resources}]
[INFO] Using 'UTF-8' encoding to copy filtered resources.
[INFO] Copying 2 resources
[INFO] Copying 3 resources
[INFO] [compiler:compile {execution: default-compile}]
[INFO] Nothing to compile - all classes are up to date
[INFO] [resources:testResources {execution: default-testResources}]
[INFO] Using 'UTF-8' encoding to copy filtered resources.
[INFO] Copying 4 resources
[INFO] Copying 3 resources
[INFO] [compiler:testCompile {execution: default-testCompile}]
[INFO] Nothing to compile - all classes are up to date
[INFO] [surefire:test {execution: default-test}]
[INFO] Surefire report directory: /srv/gump/public/workspace/cocoon3/cocoon-optional/target/surefire-reports

-------------------------------------------------------
 T E S T S
-------------------------------------------------------
Running org.apache.cocoon.optional.pipeline.components.sax.jaxb.JAXBGeneratorTestCase
Tests run: 3, Failures: 0, Errors: 0, Skipped: 0, Time elapsed: 1.331 sec
Running org.apache.cocoon.optional.pipeline.components.sax.betwixt.BetwixtBeanGeneratorTest
Tests run: 2, Failures: 0, Errors: 0, Skipped: 0, Time elapsed: 0.282 sec
Running org.apache.cocoon.optional.pipeline.components.sax.fop.FopSerializerTestCase
Tests run: 1, Failures: 0, Errors: 0, Skipped: 0, Time elapsed: 1.505 sec
Running org.apache.cocoon.optional.pipeline.components.sax.solr.SolrConsumerTestCase
Tests run: 1, Failures: 0, Errors: 1, Skipped: 0, Time elapsed: 0.015 sec <<< FAILURE!
Running org.apache.cocoon.optional.pipeline.components.sax.neko.NekoGeneratorTestCase
Tests run: 1, Failures: 0, Errors: 0, Skipped: 0, Time elapsed: 0.085 sec

Results :

Tests in error: 
  testPipelineWithSolrConsumer(org.apache.cocoon.optional.pipeline.components.sax.solr.SolrConsumerTestCase)

Tests run: 8, Failures: 0, Errors: 1, Skipped: 0

[INFO] ------------------------------------------------------------------------
[ERROR] BUILD FAILURE
[INFO] ------------------------------------------------------------------------
[INFO] There are test failures.

Please refer to /srv/gump/public/workspace/cocoon3/cocoon-optional/target/surefire-reports for the individual test results.
[INFO] ------------------------------------------------------------------------
[INFO] For more information, run Maven with the -e switch
[INFO] ------------------------------------------------------------------------
[INFO] Total time: 18 seconds
[INFO] Finished at: Sat Sep 25 16:06:46 UTC 2010
[INFO] Final Memory: 50M/120M
[INFO] ------------------------------------------------------------------------
---------------------------------------------

To subscribe to this information via syndicated feeds:
- RSS: http://vmgump.apache.org/gump/public/cocoon3/cocoon-optional-test/rss.xml
- Atom: http://vmgump.apache.org/gump/public/cocoon3/cocoon-optional-test/atom.xml

============================== Gump Tracking Only ===
Produced by Gump version 2.3.
Gump Run 14000625092010, vmgump.apache.org:vmgump:14000625092010
Gump E-mail Identifier (unique within run) #48.

*********************************************************** G U M P
[GUMP@vmgump]: Project ws-axis2 (in module ws-axis2) failed
To whom it may engage...
        
This is an automated request, but not an unsolicited one. For 
more information please visit http://gump.apache.org/nagged.html, 
and/or contact the folk at general@gump.apache.org.

Project ws-axis2 has an issue affecting its community integration.
This issue affects 2 projects,
 and has been outstanding for 527 runs.
The current state of this project is 'Failed', with reason 'Build Failed'.
For reference only, the following projects are affected by this:
    - ws-axis2 :  Apache Axis2 SOAP Stack
    - ws-axis2-test :  Apache Axis2 SOAP Stack


Full details are available at:
    http://vmgump.apache.org/gump/public/ws-axis2/ws-axis2/index.html

That said, some information snippets are provided here.

The following annotations (debug/informational/warning/error messages) were provided:
 -DEBUG- Sole jar output [ws-axis2-25092010] identifier set to project name
 -INFO- Optional dependency ws-commons-axiom failed with reason build failed
 -DEBUG- (Gump generated) Maven2 Settings in: /srv/gump/public/workspace/ws-axis2/gump_mvn_settings.xml
 -INFO- Failed with reason build failed
 -DEBUG- Maven POM in: /srv/gump/public/workspace/ws-axis2/pom.xml
 -INFO- Failed to extract fallback artifacts from Gump Repository



The following work was performed:
http://vmgump.apache.org/gump/public/ws-axis2/ws-axis2/gump_work/build_ws-axis2_ws-axis2.html
Work Name: build_ws-axis2_ws-axis2 (Type: Build)
Work ended in a state of : Failed
Elapsed: 34 secs
Command Line: mvn --batch-mode -DskipTests=true --settings /srv/gump/public/workspace/ws-axis2/gump_mvn_settings.xml package 
[Working Directory: /srv/gump/public/workspace/ws-axis2]
---------------------------------------------
Downloading: http://localhost:8192/maven2/net/sf/kxml/kxml2/2.2.2/kxml2-2.2.2.jar

[INFO] Unable to find resource 'org.osgi:org.osgi.core:jar:4.1.0' in repository eclipse-repo (http://repo1.maven.org/eclipse)
Downloading: http://download.java.net/maven/1/org.osgi/jars/org.osgi.core-4.1.0.jar
[INFO] Unable to find resource 'org.osgi:org.osgi.core:jar:4.1.0' in repository java.net (http://download.java.net/maven/1)
Downloading: http://localhost:8192/maven2/org/osgi/org.osgi.core/4.1.0/org.osgi.core-4.1.0.jar


Downloading: http://localhost:8192/maven2/org/apache/felix/org.osgi.core/1.0.0/org.osgi.core-1.0.0.jar


Downloading: http://localhost:8192/maven2/org/apache/felix/org.osgi.service.obr/1.0.1/org.osgi.service.obr-1.0.1.jar

[INFO] snapshot org.apache.axis2:axis2-mar-maven-plugin:1.5.2-SNAPSHOT: checking for updates from apache-snapshots
[INFO] snapshot org.apache.axis2:axis2-mar-maven-plugin:1.5.2-SNAPSHOT: checking for updates from apache.snapshots
Downloading: http://people.apache.org/repo/m2-snapshot-repository/org/apache/axis2/axis2-mar-maven-plugin/1.5.2-SNAPSHOT/axis2-mar-maven-plugin-1.5.2-SNAPSHOT.pom
[INFO] Unable to find resource 'org.apache.axis2:axis2-mar-maven-plugin:pom:1.5.2-SNAPSHOT' in repository apache-snapshots (http://people.apache.org/repo/m2-snapshot-repository)
Downloading: http://localhost:8192/repo/m2-snapshot-repository/org/apache/axis2/axis2-mar-maven-plugin/1.5.2-SNAPSHOT/axis2-mar-maven-plugin-1.5.2-SNAPSHOT.pom
[INFO] Unable to find resource 'org.apache.axis2:axis2-mar-maven-plugin:pom:1.5.2-SNAPSHOT' in repository apache.snapshots (http://repository.apache.org/snapshots)
Downloading: http://localhost:8192/repo/m2-snapshot-repository/org/apache/axis2/axis2-mar-maven-plugin/1.5.2-SNAPSHOT/axis2-mar-maven-plugin-1.5.2-SNAPSHOT.pom
[INFO] Unable to find resource 'org.apache.axis2:axis2-mar-maven-plugin:pom:1.5.2-SNAPSHOT' in repository apache.snapshots (http://repository.apache.org/snapshots)
[INFO] ------------------------------------------------------------------------
[ERROR] BUILD ERROR
[INFO] ------------------------------------------------------------------------
[INFO] Error building POM (may not be this project's POM).


Project ID: org.apache.axis2:axis2-mar-maven-plugin

Reason: POM 'org.apache.axis2:axis2-mar-maven-plugin' not found in repository: Unable to download the artifact from any repository

  org.apache.axis2:axis2-mar-maven-plugin:pom:1.5.2-SNAPSHOT

from the specified remote repositories:
  eclipse-repo (http://repo1.maven.org/eclipse),
  gump-central (http://localhost:8192/maven2),
  java.net (http://download.java.net/maven/1),
  apache-snapshots (http://people.apache.org/repo/m2-snapshot-repository),
  gump-apache.snapshots (http://localhost:8192/repo/m2-snapshot-repository)

 for project org.apache.axis2:axis2-mar-maven-plugin


[INFO] ------------------------------------------------------------------------
[INFO] For more information, run Maven with the -e switch
[INFO] ------------------------------------------------------------------------
[INFO] Total time: 33 seconds
[INFO] Finished at: Sat Sep 25 16:07:25 UTC 2010
[INFO] Final Memory: 22M/53M
[INFO] ------------------------------------------------------------------------
---------------------------------------------

To subscribe to this information via syndicated feeds:
- RSS: http://vmgump.apache.org/gump/public/ws-axis2/ws-axis2/rss.xml
- Atom: http://vmgump.apache.org/gump/public/ws-axis2/ws-axis2/atom.xml

============================== Gump Tracking Only ===
Produced by Gump version 2.3.
Gump Run 14000625092010, vmgump.apache.org:vmgump:14000625092010
Gump E-mail Identifier (unique within run) #49.

*********************************************************** G U M P
[GUMP@vmgump]: Project activemq-jaas (in module activemq) failed
To whom it may engage...
        
This is an automated request, but not an unsolicited one. For 
more information please visit http://gump.apache.org/nagged.html, 
and/or contact the folk at general@gump.apache.org.

Project activemq-jaas has an issue affecting its community integration.
This issue affects 5 projects,
 and has been outstanding for 21 runs.
The current state of this project is 'Failed', with reason 'Build Failed'.
For reference only, the following projects are affected by this:
    - activemq-core :  ActiveMQ :: Core
    - activemq-jaas :  ActiveMQ :: JAAS
    - activemq-jaas-test :  ActiveMQ message broker and enterprise integration patterns ...
    - activemq-pool :  ActiveMQ :: Pool
    - activemq-ra :  ActiveMQ :: RA


Full details are available at:
    http://vmgump.apache.org/gump/public/activemq/activemq-jaas/index.html

That said, some information snippets are provided here.

The following annotations (debug/informational/warning/error messages) were provided:
 -DEBUG- Sole jar output [activemq-jaas-*[0-9T].jar] identifier set to project name
 -DEBUG- (Gump generated) Maven2 Settings in: /srv/gump/public/workspace/activemq/activemq-jaas/gump_mvn_settings.xml
 -INFO- Failed with reason build failed
 -DEBUG- Maven POM in: /srv/gump/public/workspace/activemq/activemq-jaas/pom.xml
 -INFO- Failed to extract fallback artifacts from Gump Repository



The following work was performed:
http://vmgump.apache.org/gump/public/activemq/activemq-jaas/gump_work/build_activemq_activemq-jaas.html
Work Name: build_activemq_activemq-jaas (Type: Build)
Work ended in a state of : Failed
Elapsed: 32 secs
Command Line: mvn --batch-mode -DskipTests=true --settings /srv/gump/public/workspace/activemq/activemq-jaas/gump_mvn_settings.xml install 
[Working Directory: /srv/gump/public/workspace/activemq/activemq-jaas]
---------------------------------------------
[INFO] [remote-resources:process {execution: default}]
[INFO] [resources:resources {execution: default-resources}]
[INFO] Using 'UTF-8' encoding to copy filtered resources.
[INFO] skip non existing resourceDirectory /srv/gump/public/workspace/activemq/activemq-jaas/src/main/resources
[INFO] Copying 3 resources
[INFO] [compiler:compile {execution: default-compile}]
[INFO] Compiling 11 source files to /srv/gump/public/workspace/activemq/activemq-jaas/target/classes
[INFO] [resources:testResources {execution: default-testResources}]
[INFO] Using 'UTF-8' encoding to copy filtered resources.
[INFO] Copying 4 resources
[INFO] Copying 3 resources
[INFO] [compiler:testCompile {execution: default-testCompile}]
[INFO] Compiling 7 source files to /srv/gump/public/workspace/activemq/activemq-jaas/target/test-classes
[INFO] ------------------------------------------------------------------------
[ERROR] BUILD FAILURE
[INFO] ------------------------------------------------------------------------
[INFO] Compilation failure

/srv/gump/public/workspace/activemq/activemq-jaas/src/test/java/org/apache/activemq/jaas/LDAPLoginModuleTest.java:[39,45] cannot find symbol
symbol  : class Level
location: package org.apache.directory.server.core.integ

/srv/gump/public/workspace/activemq/activemq-jaas/src/test/java/org/apache/activemq/jaas/LDAPLoginModuleTest.java:[40,57] package org.apache.directory.server.core.integ.annotations does not exist

/srv/gump/public/workspace/activemq/activemq-jaas/src/test/java/org/apache/activemq/jaas/LDAPLoginModuleTest.java:[41,57] package org.apache.directory.server.core.integ.annotations does not exist

/srv/gump/public/workspace/activemq/activemq-jaas/src/test/java/org/apache/activemq/jaas/LDAPLoginModuleTest.java:[42,40] cannot find symbol
symbol  : class SiRunner
location: package org.apache.directory.server.integ

/srv/gump/public/workspace/activemq/activemq-jaas/src/test/java/org/apache/activemq/jaas/LDAPLoginModuleTest.java:[49,1] cannot find symbol
symbol: class CleanupLevel
@CleanupLevel ( Level.CLASS )

/srv/gump/public/workspace/activemq/activemq-jaas/src/test/java/org/apache/activemq/jaas/LDAPLoginModuleTest.java:[50,1] cannot find symbol
symbol: class ApplyLdifs
@ApplyLdifs( {

/srv/gump/public/workspace/activemq/activemq-jaas/src/test/java/org/apache/activemq/jaas/LDAPLoginModuleTest.java:[48,11] cannot find symbol
symbol: class SiRunner
@RunWith ( SiRunner.class ) 


[INFO] ------------------------------------------------------------------------
[INFO] For more information, run Maven with the -e switch
[INFO] ------------------------------------------------------------------------
[INFO] Total time: 31 seconds
[INFO] Finished at: Sat Sep 25 16:15:06 UTC 2010
[INFO] Final Memory: 56M/135M
[INFO] ------------------------------------------------------------------------
---------------------------------------------

To subscribe to this information via syndicated feeds:
- RSS: http://vmgump.apache.org/gump/public/activemq/activemq-jaas/rss.xml
- Atom: http://vmgump.apache.org/gump/public/activemq/activemq-jaas/atom.xml

============================== Gump Tracking Only ===
Produced by Gump version 2.3.
Gump Run 14000625092010, vmgump.apache.org:vmgump:14000625092010
Gump E-mail Identifier (unique within run) #50.

*********************************************************** G U M P
[GUMP@vmgump]: Project james-imap-test (in module james-imap) failed
To whom it may engage...
        
This is an automated request, but not an unsolicited one. For 
more information please visit http://gump.apache.org/nagged.html, 
and/or contact the folk at general@gump.apache.org.

Project james-imap-test has an issue affecting its community integration.
This issue affects 1 projects,
 and has been outstanding for 6 runs.
The current state of this project is 'Failed', with reason 'Build Failed'.
For reference only, the following projects are affected by this:
    - james-imap-test :  A library providing a flexible codec for IMAP, command proce...


Full details are available at:
    http://vmgump.apache.org/gump/public/james-imap/james-imap-test/index.html

That said, some information snippets are provided here.

The following annotations (debug/informational/warning/error messages) were provided:
 -WARNING- Overriding Maven2 settings: [/srv/gump/public/workspace/james-imap/gump_mvn_settings.xml]
 -DEBUG- (Gump generated) Maven2 Settings in: /srv/gump/public/workspace/james-imap/gump_mvn_settings.xml
 -INFO- Failed with reason build failed
 -DEBUG- Maven POM in: /srv/gump/public/workspace/james-imap/pom.xml



The following work was performed:
http://vmgump.apache.org/gump/public/james-imap/james-imap-test/gump_work/build_james-imap_james-imap-test.html
Work Name: build_james-imap_james-imap-test (Type: Build)
Work ended in a state of : Failed
Elapsed: 5 mins 59 secs
Command Line: mvn --batch-mode --settings /srv/gump/public/workspace/james-imap/gump_mvn_settings.xml test 
[Working Directory: /srv/gump/public/workspace/james-imap]
---------------------------------------------
  testValidNonAuthenticatedITALY(org.apache.james.mailbox.jcr.AuthenticatedStateTest)
  testCreateITALY(org.apache.james.mailbox.jcr.AuthenticatedStateTest)
  testExamineEmptyITALY(org.apache.james.mailbox.jcr.AuthenticatedStateTest)
  testSelectEmptyITALY(org.apache.james.mailbox.jcr.AuthenticatedStateTest)
  testListNamespaceITALY(org.apache.james.mailbox.jcr.AuthenticatedStateTest)
  testListMailboxesITALY(org.apache.james.mailbox.jcr.AuthenticatedStateTest)
  testStatusITALY(org.apache.james.mailbox.jcr.AuthenticatedStateTest)
  testStringArgsITALY(org.apache.james.mailbox.jcr.AuthenticatedStateTest)
  testSubscribeITALY(org.apache.james.mailbox.jcr.AuthenticatedStateTest)
  testAppendITALY(org.apache.james.mailbox.jcr.AuthenticatedStateTest)
  testDeleteITALY(org.apache.james.mailbox.jcr.AuthenticatedStateTest)
  testValidNonAuthenticatedKOREA(org.apache.james.mailbox.jcr.AuthenticatedStateTest)
  testCreateKOREA(org.apache.james.mailbox.jcr.AuthenticatedStateTest)
  testExamineEmptyKOREA(org.apache.james.mailbox.jcr.AuthenticatedStateTest)
  testSelectEmptyKOREA(org.apache.james.mailbox.jcr.AuthenticatedStateTest)
  testListNamespaceKOREA(org.apache.james.mailbox.jcr.AuthenticatedStateTest)
  testListMailboxesKOREA(org.apache.james.mailbox.jcr.AuthenticatedStateTest)
  testStatusKOREA(org.apache.james.mailbox.jcr.AuthenticatedStateTest)
  testStringArgsKOREA(org.apache.james.mailbox.jcr.AuthenticatedStateTest)
  testSubscribeKOREA(org.apache.james.mailbox.jcr.AuthenticatedStateTest)
  testAppendKOREA(org.apache.james.mailbox.jcr.AuthenticatedStateTest)
  testDeleteKOREA(org.apache.james.mailbox.jcr.AuthenticatedStateTest)
  testAppendExamineInboxUS(org.apache.james.mailbox.jcr.AuthenticatedStateTest)
  testAppendSelectInboxUS(org.apache.james.mailbox.jcr.AuthenticatedStateTest)
  testAppendExpungeUS(org.apache.james.mailbox.jcr.AuthenticatedStateTest)
  testSelectAppendUS(org.apache.james.mailbox.jcr.AuthenticatedStateTest)
  testAppendExamineInboxITALY(org.apache.james.mailbox.jcr.AuthenticatedStateTest)
  testAppendSelectInboxITALY(org.apache.james.mailbox.jcr.AuthenticatedStateTest)
  testAppendExpungeITALY(org.apache.james.mailbox.jcr.AuthenticatedStateTest)
  testSelectAppendITALY(org.apache.james.mailbox.jcr.AuthenticatedStateTest)
  testAppendExamineInboxKOREA(org.apache.james.mailbox.jcr.AuthenticatedStateTest)
  testAppendSelectInboxKOREA(org.apache.james.mailbox.jcr.AuthenticatedStateTest)
  testAppendExpungeKOREA(org.apache.james.mailbox.jcr.AuthenticatedStateTest)
  testSelectAppendKOREA(org.apache.james.mailbox.jcr.AuthenticatedStateTest)

Tests run: 293, Failures: 0, Errors: 293, Skipped: 0

[INFO] ------------------------------------------------------------------------
[ERROR] BUILD FAILURE
[INFO] ------------------------------------------------------------------------
[INFO] There are test failures.

Please refer to /srv/gump/public/workspace/james-imap/jcr/target/surefire-reports for the individual test results.
[INFO] ------------------------------------------------------------------------
[INFO] For more information, run Maven with the -e switch
[INFO] ------------------------------------------------------------------------
[INFO] Total time: 5 minutes 58 seconds
[INFO] Finished at: Sat Sep 25 16:24:19 UTC 2010
[INFO] Final Memory: 51M/122M
[INFO] ------------------------------------------------------------------------
---------------------------------------------

To subscribe to this information via syndicated feeds:
- RSS: http://vmgump.apache.org/gump/public/james-imap/james-imap-test/rss.xml
- Atom: http://vmgump.apache.org/gump/public/james-imap/james-imap-test/atom.xml

============================== Gump Tracking Only ===
Produced by Gump version 2.3.
Gump Run 14000625092010, vmgump.apache.org:vmgump:14000625092010
Gump E-mail Identifier (unique within run) #51.

*********************************************************** G U M P
[GUMP@vmgump]: Project james-server (in module james-server) failed
To whom it may engage...
        
This is an automated request, but not an unsolicited one. For 
more information please visit http://gump.apache.org/nagged.html, 
and/or contact the folk at general@gump.apache.org.

Project james-server has an issue affecting its community integration.
This issue affects 2 projects,
 and has been outstanding for 36 runs.
The current state of this project is 'Failed', with reason 'Build Failed'.
For reference only, the following projects are affected by this:
    - james-server :  James Server
    - james-server-test :  James Server


Full details are available at:
    http://vmgump.apache.org/gump/public/james-server/james-server/index.html

That said, some information snippets are provided here.

The following annotations (debug/informational/warning/error messages) were provided:
 -INFO- Optional dependency james-jsieve failed with reason build failed
 -INFO- Optional dependency org.apache.db.torque_runtime prerequisite failed with reason build failed
 -INFO- Optional dependency openjpa prerequisite failed with reason build failed
 -INFO- Optional dependency activemq-pool prerequisite failed with reason build failed
 -INFO- Optional dependency activemq-core prerequisite failed with reason build failed
 -DEBUG- (Gump generated) Maven2 Settings in: /srv/gump/public/workspace/james-server/gump_mvn_settings.xml
 -INFO- Failed with reason build failed
 -DEBUG- Maven POM in: /srv/gump/public/workspace/james-server/pom.xml
 -DEBUG- Extracted fallback artifacts from Gump Repository



The following work was performed:
http://vmgump.apache.org/gump/public/james-server/james-server/gump_work/build_james-server_james-server.html
Work Name: build_james-server_james-server (Type: Build)
Work ended in a state of : Failed
Elapsed: 4 mins 1 sec
Command Line: mvn --batch-mode -DskipTests=true --settings /srv/gump/public/workspace/james-server/gump_mvn_settings.xml install 
[Working Directory: /srv/gump/public/workspace/james-server]
---------------------------------------------
66K downloaded  (apache-standard-mailets-1.0-tests.jar)
[INFO] [resources:resources {execution: default-resources}]
[INFO] Using 'UTF-8' encoding to copy filtered resources.
[INFO] Copying 1 resource
[INFO] Copying 3 resources
[INFO] [compiler:compile {execution: default-compile}]
[INFO] Compiling 69 source files to /srv/gump/public/workspace/james-server/mailets/target/classes
[INFO] [bundle:manifest {execution: bundle-manifest}]
[WARNING] Embed-Dependency: clause "*;scope=runtime" did not match any dependencies
[INFO] [resources:testResources {execution: default-testResources}]
[INFO] Using 'UTF-8' encoding to copy filtered resources.
[INFO] Copying 0 resource
[INFO] Copying 3 resources
[INFO] [compiler:testCompile {execution: default-testCompile}]
[INFO] Compiling 30 source files to /srv/gump/public/workspace/james-server/mailets/target/test-classes
[INFO] [surefire:test {execution: default-test}]
[INFO] Tests are skipped.
[INFO] [jar:jar {execution: default-jar}]
[INFO] Building jar: /srv/gump/public/workspace/james-server/mailets/target/james-server-mailets-3.0-SNAPSHOT.jar
[INFO] [jar:jar {execution: default}]
[INFO] [jar:test-jar {execution: default}]
[INFO] Building jar: /srv/gump/public/workspace/james-server/mailets/target/james-server-mailets-3.0-SNAPSHOT-tests.jar
[INFO] [install:install {execution: default-install}]
[INFO] Installing /srv/gump/public/workspace/james-server/mailets/target/james-server-mailets-3.0-SNAPSHOT.jar to /srv/gump/public/workspace/mvnlocalrepo/shared/org/apache/james/james-server-mailets/3.0-SNAPSHOT/james-server-mailets-3.0-SNAPSHOT.jar
[INFO] Installing /srv/gump/public/workspace/james-server/mailets/target/james-server-mailets-3.0-SNAPSHOT-tests.jar to /srv/gump/public/workspace/mvnlocalrepo/shared/org/apache/james/james-server-mailets/3.0-SNAPSHOT/james-server-mailets-3.0-SNAPSHOT-tests.jar
[INFO] ------------------------------------------------------------------------
[INFO] Building Apache James Server FetchMail
[INFO]    task-segment: [install]
[INFO] ------------------------------------------------------------------------
[INFO] [remote-resources:process {execution: default}]
[INFO] [resources:resources {execution: default-resources}]
[INFO] Using 'UTF-8' encoding to copy filtered resources.
[INFO] Copying 0 resource
[INFO] Copying 3 resources
[INFO] [compiler:compile {execution: default-compile}]
[INFO] Compiling 10 source files to /srv/gump/public/workspace/james-server/fetchmail/target/classes
[INFO] ------------------------------------------------------------------------
[ERROR] BUILD ERROR
[INFO] ------------------------------------------------------------------------
[INFO] Fatal error compiling

Embedded error: Error while executing the compiler.
PermGen space
[INFO] ------------------------------------------------------------------------
[INFO] For more information, run Maven with the -e switch
[INFO] ------------------------------------------------------------------------
[INFO] Total time: 4 minutes 
[INFO] Finished at: Sat Sep 25 16:30:28 UTC 2010
[INFO] Final Memory: 103M/483M
[INFO] ------------------------------------------------------------------------
---------------------------------------------

To subscribe to this information via syndicated feeds:
- RSS: http://vmgump.apache.org/gump/public/james-server/james-server/rss.xml
- Atom: http://vmgump.apache.org/gump/public/james-server/james-server/atom.xml

============================== Gump Tracking Only ===
Produced by Gump version 2.3.
Gump Run 14000625092010, vmgump.apache.org:vmgump:14000625092010
Gump E-mail Identifier (unique within run) #52.


--
Apache Gump
http://gump.apache.org/ [Instance: vmgump]

---------------------------------------------------------------------
To unsubscribe, e-mail: general-unsubscribe@gump.apache.org
For additional commands, e-mail: general-help@gump.apache.org


Mime
View raw message