gump-general mailing list archives

Site index · List index
Message view « Date » · « Thread »
Top « Date » · « Thread »
From g...@vmgump.apache.org
Subject BATCH: All dressed up, with nowhere to go...
Date Mon, 20 Sep 2010 15:49:37 GMT
Dear Gumpmeisters,
            
The following 32 notifys should have been sent

*********************************************************** G U M P
[GUMP@vmgump]: Project google-collect (in module checkstyle) failed
[GUMP@vmgump]: Project expat-configure (in module expat) failed
[GUMP@vmgump]: Project hamcrest-java-unit-test (in module hamcrest) failed
[GUMP@vmgump]: Module xml-security success, but with warnings.
[GUMP@vmgump]: Project velocity-anakia (in module velocity-anakia) failed
[GUMP@vmgump]: Project xml-security-tests (in module xml-security) failed
[GUMP@vmgump]: Project velocity-dvsl (in module velocity-dvsl) failed
[GUMP@vmgump]: Project lucene-java-contrib-test (in module lucene-java) failed
[GUMP@vmgump]: Project pdfbox-lucene (in module pdfbox) failed
[GUMP@vmgump]: Project cocoon-monitoring-test (in module cocoon3) failed
[GUMP@vmgump]: Project tika-reactor (in module tika) failed
[GUMP@vmgump]: Project tika-parsers-test (in module tika) failed
[GUMP@vmgump]: Project apache-mime4j-reactor (in module james-mime4j) failed
[GUMP@vmgump]: Project commons-jci-reactor (in module apache-commons) failed
[GUMP@vmgump]: Project castor-xml (in module castor) failed
[GUMP@vmgump]: Project james-jsieve (in module james-jsieve) failed
[GUMP@vmgump]: Project castor-reactor (in module castor) failed
[GUMP@vmgump]: Project htmlunit (in module htmlunit) failed
[GUMP@vmgump]: Project commons-jelly-tags-ant-test (in module commons-jelly) failed
[GUMP@vmgump]: Project jetty-servlets-test (in module jetty) failed
[GUMP@vmgump]: Project cocoon22-flowscript-impl (in module cocoon) failed
[GUMP@vmgump]: Project tapestry (in module tapestry) failed
[GUMP@vmgump]: Project cocoon22-reactor (in module cocoon) failed
[GUMP@vmgump]: Project ws-commons-axiom (in module ws-axis2-commons) failed
[GUMP@vmgump]: Project openjpa-kernel (in module openjpa) failed
[GUMP@vmgump]: Project portals-pluto-trunk-test (in module portals-pluto-trunk) failed
[GUMP@vmgump]: Project portals-bridges-script-test (in module portals-bridges) failed
[GUMP@vmgump]: Project ws-axis2 (in module ws-axis2) failed
[GUMP@vmgump]: Project apacheds-server-integ-test (in module apacheds) failed
[GUMP@vmgump]: Project activemq-jaas (in module activemq) failed
[GUMP@vmgump]: Project james-imap (in module james-imap) failed
[GUMP@vmgump]: Project james-server (in module james-server) failed
*********************************************************** G U M P
[GUMP@vmgump]: Project google-collect (in module checkstyle) failed
To whom it may engage...
        
This is an automated request, but not an unsolicited one. For 
more information please visit http://gump.apache.org/nagged.html, 
and/or contact the folk at general@gump.apache.org.

Project google-collect has an issue affecting its community integration.
This issue affects 5 projects,
 and has been outstanding for 96 runs.
The current state of this project is 'Failed', with reason 'Missing Build Outputs'.
For reference only, the following projects are affected by this:
    - checkstyle :  Java style checker
    - google-collect :  Java style checker
    - tomcat-trunk :  Java Servlet 3.0, Java Server Pages 2.2 & Expression Languag...
    - tomcat-trunk-test :  Java Servlet 3.0, Java Server Pages 2.2 & Expression Languag...
    - tomcat-trunk-validate :  Java Servlet 3.0, Java Server Pages 2.2 & Expression Languag...


Full details are available at:
    http://vmgump.apache.org/gump/public/checkstyle/google-collect/index.html

That said, some information snippets are provided here.

The following annotations (debug/informational/warning/error messages) were provided:
 -DEBUG- Sole jar output [google-collect-*[0-9T].jar] identifier set to project name
 -INFO- Failed with reason missing build outputs
 -ERROR- Missing Output: /srv/gump/public/workspace/checkstyle/lib/google-collect-*[0-9T].jar
 -ERROR- No such directory (where output is expected) : /srv/gump/public/workspace/checkstyle/lib
 -INFO- Failed to extract fallback artifacts from Gump Repository

To subscribe to this information via syndicated feeds:
- RSS: http://vmgump.apache.org/gump/public/checkstyle/google-collect/rss.xml
- Atom: http://vmgump.apache.org/gump/public/checkstyle/google-collect/atom.xml

============================== Gump Tracking Only ===
Produced by Gump version 2.3.
Gump Run 13000620092010, vmgump.apache.org:vmgump:13000620092010
Gump E-mail Identifier (unique within run) #1.

*********************************************************** G U M P
[GUMP@vmgump]: Project expat-configure (in module expat) failed
To whom it may engage...
        
This is an automated request, but not an unsolicited one. For 
more information please visit http://gump.apache.org/nagged.html, 
and/or contact the folk at general@gump.apache.org.

Project expat-configure has an issue affecting its community integration.
This issue affects 22 projects,
 and has been outstanding for 84 runs.
The current state of this project is 'Failed', with reason 'Build Failed'.
For reference only, the following projects are affected by this:
    - apache-httpd-buildconf :  Apache HTTP Server
    - apache-httpd-configure :  Apache HTTP Server
    - apache-httpd-make :  Apache HTTP Server
    - apache-httpd-make-install :  Apache HTTP Server
    - apr-configure :  Apache Portable Runtime
    - apr-iconv-buildconf :  Apache Portable Runtime
    - apr-iconv-configure :  Apache Portable Runtime
    - apr-iconv-make :  Apache Portable Runtime
    - apr-make :  Apache Portable Runtime
    - apr-make-install :  Apache Portable Runtime
    - expat :  The Expat XML Parser
    - expat-configure :  The Expat XML Parser
    - expat-make :  The Expat XML Parser
    - jakarta-tomcat-jk-native :  Connectors to various web servers
    - jakarta-tomcat-jk-native-buildconf :  Connectors to various web servers
    - jakarta-tomcat-jk-native-configure :  Connectors to various web servers
    - logging-log4cxx-ant :  Apache log4cxx
    - logging-log4cxx-ant-no_wchar_t :  Apache log4cxx
    - logging-log4cxx-ant-static :  Apache log4cxx
    - logging-log4cxx-configure :  Apache log4cxx
    - logging-log4cxx-make :  Apache log4cxx
    - logging-log4cxx-make-install :  Apache log4cxx


Full details are available at:
    http://vmgump.apache.org/gump/public/expat/expat-configure/index.html

That said, some information snippets are provided here.

The following annotations (debug/informational/warning/error messages) were provided:
 -INFO- Failed with reason build failed



The following work was performed:
http://vmgump.apache.org/gump/public/expat/expat-configure/gump_work/buildscript_expat_expat-configure.html
Work Name: buildscript_expat_expat-configure (Type: Build)
Work ended in a state of : Failed
Elapsed: 2 secs
Command Line: /srv/gump/public/workspace/expat/configure --prefix=/srv/gump/public/workspace/expat/dest-20092010 
[Working Directory: /srv/gump/public/workspace/expat]
---------------------------------------------
/srv/gump/public/workspace/expat/configure: line 3336: AC_LIBTOOL_WIN32_DLL: command not found
/srv/gump/public/workspace/expat/configure: line 3343: LTOPTIONS_VERSION: command not found
/srv/gump/public/workspace/expat/configure: line 3344: LTSUGAR_VERSION: command not found
/srv/gump/public/workspace/expat/configure: line 3345: LTVERSION_VERSION: command not found
/srv/gump/public/workspace/expat/configure: line 3346: LTOBSOLETE_VERSION: command not found
checking build system type... x86_64-unknown-linux-gnu
checking host system type... x86_64-unknown-linux-gnu
checking for gcc... gcc
checking whether the C compiler works... yes
checking for C compiler default output file name... a.out
checking for suffix of executables... 
checking whether we are cross compiling... no
checking for suffix of object files... o
checking whether we are using the GNU C compiler... yes
checking whether gcc accepts -g... yes
checking for gcc option to accept ISO C89... none needed
checking for a sed that does not truncate output... /bin/sed
/srv/gump/public/workspace/expat/configure: line 4283: syntax error near unexpected token `lt_decl_varnames,'
/srv/gump/public/workspace/expat/configure: line 4283: `lt_if_append_uniq(lt_decl_varnames, SED, , ,'
---------------------------------------------

To subscribe to this information via syndicated feeds:
- RSS: http://vmgump.apache.org/gump/public/expat/expat-configure/rss.xml
- Atom: http://vmgump.apache.org/gump/public/expat/expat-configure/atom.xml

============================== Gump Tracking Only ===
Produced by Gump version 2.3.
Gump Run 13000620092010, vmgump.apache.org:vmgump:13000620092010
Gump E-mail Identifier (unique within run) #2.

*********************************************************** G U M P
[GUMP@vmgump]: Project hamcrest-java-unit-test (in module hamcrest) failed
To whom it may engage...
        
This is an automated request, but not an unsolicited one. For 
more information please visit http://gump.apache.org/nagged.html, 
and/or contact the folk at general@gump.apache.org.

Project hamcrest-java-unit-test has an issue affecting its community integration.
This issue affects 2 projects,
 and has been outstanding for 51 runs.
The current state of this project is 'Failed', with reason 'Build Failed'.
For reference only, the following projects are affected by this:
    - hamcrest-java-unit-test :  Provides a library of matcher objects (also known as constra...
    - jmock2 :  jMock is a library for testing Java code using mock objects.


Full details are available at:
    http://vmgump.apache.org/gump/public/hamcrest/hamcrest-java-unit-test/index.html

That said, some information snippets are provided here.

The following annotations (debug/informational/warning/error messages) were provided:
 -INFO- Failed with reason build failed
 -INFO- Failed to extract fallback artifacts from Gump Repository



The following work was performed:
http://vmgump.apache.org/gump/public/hamcrest/hamcrest-java-unit-test/gump_work/build_hamcrest_hamcrest-java-unit-test.html
Work Name: build_hamcrest_hamcrest-java-unit-test (Type: Build)
Work ended in a state of : Failed
Elapsed: 13 secs
Command Line: /usr/lib/jvm/java-6-openjdk/bin/java -Djava.awt.headless=true -Xbootclasspath/p:/srv/gump/public/workspace/xml-commons/java/external/build/xml-apis.jar:/srv/gump/public/workspace/xml-xerces2/build/xercesImpl.jar org.apache.tools.ant.Main -Dgump.merge=/srv/gump/public/gump/work/merge.xml -Dbuild.sysclasspath=only -Dversion=20092010 unit-test 
[Working Directory: /srv/gump/public/workspace/hamcrest/hamcrest-java]
CLASSPATH: /usr/lib/jvm/java-6-openjdk/lib/tools.jar:/srv/gump/public/workspace/hamcrest/hamcrest-java/lib/integration/easymock-2.2.jar:/srv/gump/public/workspace/hamcrest/hamcrest-java/build/temp/build/hamcrest-unit-test-20092010.jar.contents:/srv/gump/public/workspace/ant/dist/lib/ant.jar:/srv/gump/public/workspace/ant/dist/lib/ant-launcher.jar:/srv/gump/public/workspace/ant/dist/lib/ant-jmf.jar:/srv/gump/public/workspace/ant/dist/lib/ant-junit.jar:/srv/gump/public/workspace/ant/dist/lib/ant-swing.jar:/srv/gump/public/workspace/ant/dist/lib/ant-apache-resolver.jar:/srv/gump/public/workspace/ant/dist/lib/ant-apache-xalan2.jar:/srv/gump/public/workspace/hamcrest/hamcrest-java/build/hamcrest-integration-20092010.jar:/srv/gump/public/workspace/hamcrest/hamcrest-java/build/hamcrest-all-20092010.jar:/srv/gump/packages/jarjar/jarjar-0.6.jar:/srv/gump/public/workspace/jmock/build/dist/jmock-core-20092010.jar:/srv/gump/public/workspace/jmock/build/dist/jmock-cglib-20092010.jar:/srv/
 gump/public/workspace/junit/dist/junit-20092010.jar:/srv/gump/public/workspace/junit/dist/junit-dep-20092010.jar:/srv/gump/packages/qdox-1.6.3/qdox-1.6.3.jar:/srv/gump/public/workspace/xml-commons/java/external/build/xml-apis-ext.jar
---------------------------------------------
     [java]              [T] isIn(Collection<T> collection)
     [java]              [T] isIn(T[] param1)
     [java]              [T] isOneOf(T... elements)
     [java]         [Double] closeTo(double operand, double error)
     [java]      [? super T] comparesEqualTo(T value)
     [java]      [? super T] greaterThan(T value)
     [java]      [? super T] greaterThanOrEqualTo(T value)
     [java]      [? super T] lessThan(T value)
     [java]      [? super T] lessThanOrEqualTo(T value)
     [java]         [String] equalToIgnoringCase(String string)
     [java]         [String] equalToIgnoringWhiteSpace(String string)
     [java]              [T] hasToString(Matcher<String> toStringMatcher)
     [java]              [T] hasToString(String expectedToString)
     [java]       [Class<?>] typeCompatibleWith(Class<T> baseType)
     [java]    [EventObject] eventFrom(Class<EventObject> eventClass, Object source)
     [java]    [EventObject] eventFrom(Object source)
     [java]              [T] hasProperty(String propertyName)
     [java]              [T] hasProperty(String propertyName, Matcher<?> value)
     [java]              [T] samePropertyValuesAs(T expectedBean)
     [java]           [Node] hasXPath(String xPath, Matcher<String> valueMatcher)
     [java]           [Node] hasXPath(String xPath, NamespaceContext namespaceContext, Matcher<String> valueMatcher)
     [java]           [Node] hasXPath(String xPath)
     [java]           [Node] hasXPath(String xPath, NamespaceContext namespaceContext)
    [javac] Compiling 1 source file to /srv/gump/public/workspace/hamcrest/hamcrest-java/build/temp/build/hamcrest-library-20092010.jar.contents
    [javac] Note: /srv/gump/public/workspace/hamcrest/hamcrest-java/build/temp/hamcrest-library/generated-code/org/hamcrest/Matchers.java uses or overrides a deprecated API.
    [javac] Note: Recompile with -Xlint:deprecation for details.
     [copy] Copying 1 file to /srv/gump/public/workspace/hamcrest/hamcrest-java/build/temp/build/hamcrest-library-20092010.jar.contents
      [jar] Building jar: /srv/gump/public/workspace/hamcrest/hamcrest-java/build/hamcrest-library-20092010.jar

integration:

unit-test:
    [mkdir] Created dir: /srv/gump/public/workspace/hamcrest/hamcrest-java/build/temp/build/hamcrest-unit-test-20092010.jar.contents
    [javac] Compiling 62 source files to /srv/gump/public/workspace/hamcrest/hamcrest-java/build/temp/build/hamcrest-unit-test-20092010.jar.contents
    [javac] /srv/gump/public/workspace/hamcrest/hamcrest-java/hamcrest-unit-test/src/main/java/org/hamcrest/collection/IsIterableContainingInOrderTest.java:15: incompatible types; no instance(s) of type variable(s) E,C exist so that org.hamcrest.Matcher<C> conforms to org.hamcrest.Matcher<java.lang.Iterable<? extends org.hamcrest.collection.IsIterableContainingInOrderTest.WithValue>>
    [javac] found   : <E,C>org.hamcrest.Matcher<C>
    [javac] required: org.hamcrest.Matcher<java.lang.Iterable<? extends org.hamcrest.collection.IsIterableContainingInOrderTest.WithValue>>
    [javac]     private final Matcher<Iterable<? extends WithValue>> contains123 = contains(value(1), value(2), value(3));
    [javac]                                                                                ^
    [javac] Note: /srv/gump/public/workspace/hamcrest/hamcrest-java/hamcrest-unit-test/src/main/java/org/hamcrest/core/IsTest.java uses or overrides a deprecated API.
    [javac] Note: Recompile with -Xlint:deprecation for details.
    [javac] Note: Some input files use unchecked or unsafe operations.
    [javac] Note: Recompile with -Xlint:unchecked for details.
    [javac] 1 error

BUILD FAILED
/srv/gump/public/workspace/hamcrest/hamcrest-java/build.xml:117: The following error occurred while executing this line:
/srv/gump/public/workspace/hamcrest/hamcrest-java/build.xml:231: Compile failed; see the compiler error output for details.

Total time: 12 seconds
---------------------------------------------

To subscribe to this information via syndicated feeds:
- RSS: http://vmgump.apache.org/gump/public/hamcrest/hamcrest-java-unit-test/rss.xml
- Atom: http://vmgump.apache.org/gump/public/hamcrest/hamcrest-java-unit-test/atom.xml

============================== Gump Tracking Only ===
Produced by Gump version 2.3.
Gump Run 13000620092010, vmgump.apache.org:vmgump:13000620092010
Gump E-mail Identifier (unique within run) #3.

*********************************************************** G U M P
[GUMP@vmgump]: Module xml-security success, but with warnings.
To whom it may engage...
        
This is an automated request, but not an unsolicited one. For 
more information please visit http://gump.apache.org/nagged.html, 
and/or contact the folk at general@gump.apache.org.

Module xml-security contains errors.
The current state of this module is 'Success'.

Full details are available at:
    http://vmgump.apache.org/gump/public/xml-security/index.html

That said, some information snippets are provided here.

The following annotations (debug/informational/warning/error messages) were provided:
 -ERROR- *** Failed to update from source control.Stale contents ***



The following work was performed:
http://vmgump.apache.org/gump/public/xml-security/gump_work/update_xml-security.html
Work Name: update_xml-security (Type: Update)
Work ended in a state of : Failed
Elapsed: 5 secs
Command Line: svn --quiet update --non-interactive xml-security 
[Working Directory: /srv/gump/public/workspace/cvs]
---------------------------------------------
svn: Target path '/xml/security/trunk' does not exist
---------------------------------------------

To subscribe to this information via syndicated feeds:
- RSS: http://vmgump.apache.org/gump/public/xml-security/rss.xml
- Atom: http://vmgump.apache.org/gump/public/xml-security/atom.xml

============================== Gump Tracking Only ===
Produced by Gump version 2.3.
Gump Run 13000620092010, vmgump.apache.org:vmgump:13000620092010
Gump E-mail Identifier (unique within run) #8.

*********************************************************** G U M P
[GUMP@vmgump]: Project velocity-anakia (in module velocity-anakia) failed
To whom it may engage...
        
This is an automated request, but not an unsolicited one. For 
more information please visit http://gump.apache.org/nagged.html, 
and/or contact the folk at general@gump.apache.org.

Project velocity-anakia has an issue affecting its community integration.
This issue affects 7 projects,
 and has been outstanding for 3 runs.
The current state of this project is 'Failed', with reason 'Missing Build Outputs'.
For reference only, the following projects are affected by this:
    - db-torque-generator :  Persistence Layer
    - db-torque-templates :  Persistence Layer
    - db-torque-templates-test :  Persistence Layer
    - velocity-anakia :  Anakia uses Apache Velocity to generate documents based on X...
    - velocity-anakia-test :  Anakia uses Apache Velocity to generate documents based on X...
    - velocity-texen :  Texen is a general purpose text generating utility based on ...
    - velocity-texen-test :  Texen is a general purpose text generating utility based on ...


Full details are available at:
    http://vmgump.apache.org/gump/public/velocity-anakia/velocity-anakia/index.html

That said, some information snippets are provided here.

The following annotations (debug/informational/warning/error messages) were provided:
 -DEBUG- (Gump generated) Maven2 Settings in: /srv/gump/public/workspace/velocity-anakia/gump_mvn_settings.xml
 -DEBUG- Maven POM in: /srv/gump/public/workspace/velocity-anakia/pom.xml
 -INFO- Failed with reason missing build outputs
 -ERROR- Missing Output: /srv/gump/public/workspace/velocity-anakia/anakia-20092010.jar
 -ERROR- See Directory Listing Work for Missing Outputs
 -DEBUG- Extracted fallback artifacts from Gump Repository



The following work was performed:
http://vmgump.apache.org/gump/public/velocity-anakia/velocity-anakia/gump_work/build_velocity-anakia_velocity-anakia.html
Work Name: build_velocity-anakia_velocity-anakia (Type: Build)
Work ended in a state of : Success
Elapsed: 2 mins 50 secs
Command Line: mvn --batch-mode -DskipTests=true --settings /srv/gump/public/workspace/velocity-anakia/gump_mvn_settings.xml install 
[Working Directory: /srv/gump/public/workspace/velocity-anakia]
---------------------------------------------

Downloading: http://localhost:8192/maven2/org/codehaus/plexus/plexus-components/1.1.9/plexus-components-1.1.9.pom

Downloading: http://localhost:8192/maven2/org/codehaus/plexus/plexus/1.0.10/plexus-1.0.10.pom

Downloading: http://localhost:8192/maven2/org/codehaus/plexus/plexus-container-default/1.0-alpha-15/plexus-container-default-1.0-alpha-15.pom

Downloading: http://localhost:8192/maven2/org/codehaus/plexus/plexus-containers/1.0-alpha-15/plexus-containers-1.0-alpha-15.pom

Downloading: http://localhost:8192/maven2/org/codehaus/plexus/plexus/1.0.9/plexus-1.0.9.pom

Downloading: http://localhost:8192/maven2/org/codehaus/plexus/plexus-component-api/1.0-alpha-15/plexus-component-api-1.0-alpha-15.pom

Downloading: http://localhost:8192/maven2/org/codehaus/plexus/plexus-classworlds/1.2-alpha-6/plexus-classworlds-1.2-alpha-6.pom

Downloading: http://localhost:8192/maven2/org/codehaus/plexus/plexus-io/1.0-alpha-3/plexus-io-1.0-alpha-3.pom

Downloading: http://localhost:8192/maven2/org/codehaus/plexus/plexus-component-api/1.0-alpha-16/plexus-component-api-1.0-alpha-16.pom

Downloading: http://localhost:8192/maven2/org/codehaus/plexus/plexus-containers/1.0-alpha-16/plexus-containers-1.0-alpha-16.pom

Downloading: http://localhost:8192/maven2/org/codehaus/plexus/plexus-utils/1.4.9/plexus-utils-1.4.9.pom

Downloading: http://localhost:8192/maven2/org/codehaus/plexus/plexus-interpolation/1.6/plexus-interpolation-1.6.pom

Downloading: http://localhost:8192/maven2/org/codehaus/plexus/plexus-archiver/1.0-alpha-12/plexus-archiver-1.0-alpha-12.pom

Downloading: http://localhost:8192/maven2/org/codehaus/plexus/plexus-io/1.0-alpha-4/plexus-io-1.0-alpha-4.pom

Downloading: http://localhost:8192/maven2/org/codehaus/plexus/plexus-utils/1.4.9/plexus-utils-1.4.9.jar
Downloading: http://localhost:8192/maven2/org/apache/maven/maven-archiver/2.4/maven-archiver-2.4.jar


Downloading: http://localhost:8192/maven2/org/codehaus/plexus/plexus-archiver/1.0-alpha-12/plexus-archiver-1.0-alpha-12.jar

Downloading: http://localhost:8192/maven2/org/codehaus/plexus/plexus-io/1.0-alpha-4/plexus-io-1.0-alpha-4.jar

Downloading: http://localhost:8192/maven2/org/codehaus/plexus/plexus-interpolation/1.6/plexus-interpolation-1.6.jar

[INFO] [jar:jar {execution: default-jar}]
[INFO] Building jar: /srv/gump/public/workspace/velocity-anakia/target/velocity-anakia-1.1.0-SNAPSHOT.jar
[INFO] [install:install {execution: default-install}]
[INFO] Installing /srv/gump/public/workspace/velocity-anakia/target/velocity-anakia-1.1.0-SNAPSHOT.jar to /srv/gump/public/workspace/mvnlocalrepo/velocity/org/apache/velocity/velocity-anakia/1.1.0-SNAPSHOT/velocity-anakia-1.1.0-SNAPSHOT.jar
[INFO] ------------------------------------------------------------------------
[INFO] BUILD SUCCESSFUL
[INFO] ------------------------------------------------------------------------
[INFO] Total time: 2 minutes 49 seconds
[INFO] Finished at: Mon Sep 20 08:34:43 UTC 2010
[INFO] Final Memory: 39M/93M
[INFO] ------------------------------------------------------------------------
---------------------------------------------

To subscribe to this information via syndicated feeds:
- RSS: http://vmgump.apache.org/gump/public/velocity-anakia/velocity-anakia/rss.xml
- Atom: http://vmgump.apache.org/gump/public/velocity-anakia/velocity-anakia/atom.xml

============================== Gump Tracking Only ===
Produced by Gump version 2.3.
Gump Run 13000620092010, vmgump.apache.org:vmgump:13000620092010
Gump E-mail Identifier (unique within run) #10.

*********************************************************** G U M P
[GUMP@vmgump]: Project xml-security-tests (in module xml-security) failed
To whom it may engage...
        
This is an automated request, but not an unsolicited one. For 
more information please visit http://gump.apache.org/nagged.html, 
and/or contact the folk at general@gump.apache.org.

Project xml-security-tests has an issue affecting its community integration.
This issue affects 1 projects,
 and has been outstanding for 65 runs.
The current state of this project is 'Failed', with reason 'Build Failed'.
For reference only, the following projects are affected by this:
    - xml-security-tests :  XML-Signature Syntax and Processing


Full details are available at:
    http://vmgump.apache.org/gump/public/xml-security/xml-security-tests/index.html

That said, some information snippets are provided here.

The following annotations (debug/informational/warning/error messages) were provided:
 -DEBUG- Dependency on jce exists, no need to add for property lib.jce.
 -INFO- Failed with reason build failed



The following work was performed:
http://vmgump.apache.org/gump/public/xml-security/xml-security-tests/gump_work/build_xml-security_xml-security-tests.html
Work Name: build_xml-security_xml-security-tests (Type: Build)
Work ended in a state of : Failed
Elapsed: 4 secs
Command Line: /usr/lib/jvm/java-6-openjdk/bin/java -Djava.awt.headless=true -Dant.build.clonevm=true -Xbootclasspath/p:/srv/gump/public/workspace/xml-commons/java/external/build/xml-apis.jar:/srv/gump/public/workspace/xml-xerces2/build/xercesImpl.jar:/srv/gump/public/workspace/xml-xalan/build/xalan-unbundled.jar:/srv/gump/public/workspace/xml-xalan/build/serializer.jar org.apache.tools.ant.Main -Dgump.merge=/srv/gump/public/gump/work/merge.xml -Dbuild.sysclasspath=only -Djce.download.sha1=c1f0e975e8c8e0a0105787b249a50615b485d109 -Dlib.jce=/srv/gump/packages/jce/jce-jdk13-116.jar -Djce.download.md5=85c64cd754719a4bc8da7e9aa0e113fd test 
[Working Directory: /srv/gump/public/workspace/xml-security]
CLASSPATH: /usr/lib/jvm/java-6-openjdk/lib/tools.jar:/srv/gump/public/workspace/xml-security/build/test:/srv/gump/public/workspace/xml-security:/srv/gump/public/workspace/xml-security/build/xmlsec-20092010.jar:/srv/gump/public/workspace/ant/dist/lib/ant.jar:/srv/gump/public/workspace/ant/dist/lib/ant-launcher.jar:/srv/gump/public/workspace/ant/dist/lib/ant-jmf.jar:/srv/gump/public/workspace/ant/dist/lib/ant-junit.jar:/srv/gump/public/workspace/ant/dist/lib/ant-swing.jar:/srv/gump/public/workspace/ant/dist/lib/ant-apache-resolver.jar:/srv/gump/public/workspace/ant/dist/lib/ant-apache-xalan2.jar:/srv/gump/packages/junit3.8.1/junit.jar:/srv/gump/public/workspace/xml-commons/java/build/resolver.jar:/srv/gump/public/workspace/xml-commons/java/external/build/xml-apis-ext.jar:/srv/gump/packages/jce/jce-jdk13-116.jar:/srv/gump/public/workspace/apache-commons/logging/target/commons-logging-20092010.jar:/srv/gump/public/workspace/apache-commons/logging/target/commons-logging-api-200920
 10.jar:/srv/gump/public/workspace/junit/dist/junit-20092010.jar:/srv/gump/public/workspace/junit/dist/junit-dep-20092010.jar
---------------------------------------------
Buildfile: /srv/gump/public/workspace/xml-security/build.xml
  [taskdef] Could not load definitions from resource clovertasks. It could not be found.

manifest:

do.build.src:

init:
     [echo] 
     [echo] -------------------------------------------------------------------
     [echo] --------- Apache-XML-Security-J v1.4.4-SNAPSHOT [2000-2010] -----------
     [echo] -------------------------------------------------------------------
     [echo] Building with Apache Ant version 1.8.2alpha compiled on September 20 2010
     [echo] Java 1.6.0_18 located at /usr/lib/jvm/java-6-openjdk/jre 
     [echo] -------------------------------------------------------------------
     [echo] 

env.mk.dirs:

do.check.bindist:

build.src:

build.test:

build.samples:

build.jar:
      [jar] Building jar: /srv/gump/public/workspace/xml-security/build/xmlsec-1.4.4-SNAPSHOT.jar
      [jar] Building jar: /srv/gump/public/workspace/xml-security/build/xmlsecSamples-1.4.4-SNAPSHOT.jar
      [jar] Building jar: /srv/gump/public/workspace/xml-security/build/xmlsecTests-1.4.4-SNAPSHOT.jar

test:
    [mkdir] Created dir: /srv/gump/public/workspace/xml-security/build/docs/xml/junit
    [mkdir] Created dir: /srv/gump/public/workspace/xml-security/build/docs/html/junit
     [copy] Copying 1 file to /srv/gump/public/workspace/xml-security/build/libs/endorsed
     [copy] Copying 1 file to /srv/gump/public/workspace/xml-security/build/libs/endorsed
     [copy] Copying 1 file to /srv/gump/public/workspace/xml-security/build/libs/endorsed

BUILD FAILED
/srv/gump/public/workspace/xml-security/build.xml:350: Warning: Could not find file /srv/gump/public/workspace/xml-security/libs/junit-4.8.1.jar to copy.

Total time: 4 seconds
---------------------------------------------

To subscribe to this information via syndicated feeds:
- RSS: http://vmgump.apache.org/gump/public/xml-security/xml-security-tests/rss.xml
- Atom: http://vmgump.apache.org/gump/public/xml-security/xml-security-tests/atom.xml

============================== Gump Tracking Only ===
Produced by Gump version 2.3.
Gump Run 13000620092010, vmgump.apache.org:vmgump:13000620092010
Gump E-mail Identifier (unique within run) #11.

*********************************************************** G U M P
[GUMP@vmgump]: Project velocity-dvsl (in module velocity-dvsl) failed
To whom it may engage...
        
This is an automated request, but not an unsolicited one. For 
more information please visit http://gump.apache.org/nagged.html, 
and/or contact the folk at general@gump.apache.org.

Project velocity-dvsl has an issue affecting its community integration.
This issue affects 5 projects,
 and has been outstanding for 3 runs.
The current state of this project is 'Failed', with reason 'Missing Build Outputs'.
For reference only, the following projects are affected by this:
    - fulcrum-dvsl :  Services Framework
    - solr :  Java Based Search Engine
    - solr-test :  Java Based Search Engine
    - velocity-dvsl :  Template engine
    - velocity-tools :  VelocityTools project


Full details are available at:
    http://vmgump.apache.org/gump/public/velocity-dvsl/velocity-dvsl/index.html

That said, some information snippets are provided here.

The following annotations (debug/informational/warning/error messages) were provided:
 -DEBUG- (Gump generated) Maven2 Settings in: /srv/gump/public/workspace/velocity-dvsl/gump_mvn_settings.xml
 -DEBUG- Maven POM in: /srv/gump/public/workspace/velocity-dvsl/pom.xml
 -INFO- Failed with reason missing build outputs
 -ERROR- Missing Output: /srv/gump/public/workspace/velocity-dvsl/dist/velocity-dvsl-20092010.jar
 -ERROR- No such directory (where output is expected) : /srv/gump/public/workspace/velocity-dvsl/dist
 -DEBUG- Extracted fallback artifacts from Gump Repository



The following work was performed:
http://vmgump.apache.org/gump/public/velocity-dvsl/velocity-dvsl/gump_work/build_velocity-dvsl_velocity-dvsl.html
Work Name: build_velocity-dvsl_velocity-dvsl (Type: Build)
Work ended in a state of : Success
Elapsed: 1 min 41 secs
Command Line: mvn --batch-mode --settings /srv/gump/public/workspace/velocity-dvsl/gump_mvn_settings.xml package 
[Working Directory: /srv/gump/public/workspace/velocity-dvsl]
---------------------------------------------
Downloading: http://localhost:8192/maven2/org/codehaus/plexus/plexus-utils/1.5.5/plexus-utils-1.5.5.jar
Downloading: http://localhost:8192/maven2/org/apache/maven/shared/maven-dependency-tree/1.1/maven-dependency-tree-1.1.jar
Downloading: http://localhost:8192/maven2/org/jdom/jdom/1.1/jdom-1.1.jar
Downloading: http://localhost:8192/maven2/asm/asm/3.2/asm-3.2.jar
42K downloaded  (asm-3.2.jar)
Downloading: http://localhost:8192/maven2/asm/asm-commons/3.2/asm-commons-3.2.jar
146K downloaded  (jdom-1.1.jar)
32K downloaded  (asm-commons-3.2.jar)
Downloading: http://localhost:8192/maven2/asm/asm-tree/3.2/asm-tree-3.2.jar
21K downloaded  (asm-tree-3.2.jar)


[INFO] [shade:shade {execution: default}]
[INFO] Including org.apache.velocity:velocity-dvsl-core:jar:1.1.0-SNAPSHOT in the shaded jar.
[INFO] Excluding velocity:velocity:jar:1.5 from the shaded jar.
[INFO] Excluding commons-collections:commons-collections:jar:3.1 from the shaded jar.
[INFO] Excluding commons-lang:commons-lang:jar:2.1 from the shaded jar.
[INFO] Excluding oro:oro:jar:2.0.8 from the shaded jar.
[INFO] Excluding dom4j:dom4j:jar:1.6.1 from the shaded jar.
[INFO] Excluding jaxen:jaxen:jar:1.1.1 from the shaded jar.
[INFO] Excluding jdom:jdom:jar:1.0 from the shaded jar.
[INFO] Excluding xalan:xalan:jar:2.7.0 from the shaded jar.
[INFO] Excluding xalan:serializer:jar:2.7.1 from the shaded jar.
[INFO] Including org.apache.velocity:velocity-dvsl-ant:jar:1.1.0-SNAPSHOT in the shaded jar.
[INFO] Replacing original artifact with shaded artifact.
[INFO] Replacing /srv/gump/public/workspace/velocity-dvsl/velocity-dvsl-uberjar/target/velocity-dvsl-uberjar-1.1.0-SNAPSHOT.jar with /srv/gump/public/workspace/velocity-dvsl/velocity-dvsl-uberjar/target/velocity-dvsl-uberjar-1.1.0-SNAPSHOT-shaded.jar
[INFO] ------------------------------------------------------------------------
[INFO] Building Apache Velocity DVSL - Assembly
[INFO]    task-segment: [package]
[INFO] ------------------------------------------------------------------------
[INFO] [remote-resources:process {execution: default}]
[INFO] [site:attach-descriptor {execution: default-attach-descriptor}]
[INFO] 
[INFO] 
[INFO] ------------------------------------------------------------------------
[INFO] Reactor Summary:
[INFO] ------------------------------------------------------------------------
[INFO] Apache Velocity DVSL .................................. SUCCESS [1:01.554s]
[INFO] Apache Velocity DVSL - Core ........................... SUCCESS [21.288s]
[INFO] Apache Velocity DVSL - Ant integration ................ SUCCESS [6.306s]
[INFO] Apache Velocity DVSL - Uberjar ........................ SUCCESS [9.786s]
[INFO] Apache Velocity DVSL - Assembly ....................... SUCCESS [0.331s]
[INFO] ------------------------------------------------------------------------
[INFO] ------------------------------------------------------------------------
[INFO] BUILD SUCCESSFUL
[INFO] ------------------------------------------------------------------------
[INFO] Total time: 1 minute 40 seconds
[INFO] Finished at: Mon Sep 20 09:16:04 UTC 2010
[INFO] Final Memory: 54M/130M
[INFO] ------------------------------------------------------------------------
---------------------------------------------

To subscribe to this information via syndicated feeds:
- RSS: http://vmgump.apache.org/gump/public/velocity-dvsl/velocity-dvsl/rss.xml
- Atom: http://vmgump.apache.org/gump/public/velocity-dvsl/velocity-dvsl/atom.xml

============================== Gump Tracking Only ===
Produced by Gump version 2.3.
Gump Run 13000620092010, vmgump.apache.org:vmgump:13000620092010
Gump E-mail Identifier (unique within run) #12.

*********************************************************** G U M P
[GUMP@vmgump]: Project lucene-java-contrib-test (in module lucene-java) failed
To whom it may engage...
        
This is an automated request, but not an unsolicited one. For 
more information please visit http://gump.apache.org/nagged.html, 
and/or contact the folk at general@gump.apache.org.

Project lucene-java-contrib-test has an issue affecting its community integration.
This issue affects 1 projects,
 and has been outstanding for 10 runs.
The current state of this project is 'Failed', with reason 'Build Failed'.
For reference only, the following projects are affected by this:
    - lucene-java-contrib-test :  Java Based Search Engine


Full details are available at:
    http://vmgump.apache.org/gump/public/lucene-java/lucene-java-contrib-test/index.html

That said, some information snippets are provided here.

The following annotations (debug/informational/warning/error messages) were provided:
 -DEBUG- Dependency on javacc exists, no need to add for property javacc.home.
 -INFO- Failed with reason build failed



The following work was performed:
http://vmgump.apache.org/gump/public/lucene-java/lucene-java-contrib-test/gump_work/build_lucene-java_lucene-java-contrib-test.html
Work Name: build_lucene-java_lucene-java-contrib-test (Type: Build)
Work ended in a state of : Failed
Elapsed: 7 mins 45 secs
Command Line: /usr/lib/jvm/java-6-openjdk/bin/java -Djava.awt.headless=true -Xbootclasspath/p:/srv/gump/public/workspace/xml-commons/java/external/build/xml-apis.jar:/srv/gump/public/workspace/xml-xerces2/build/xercesImpl.jar org.apache.tools.ant.Main -Dgump.merge=/srv/gump/public/gump/work/merge.xml -Dbuild.sysclasspath=only -Dversion=20092010 -Djavacc.home=/srv/gump/packages/javacc-3.1 test 
[Working Directory: /srv/gump/public/workspace/lucene-java/lucene]
CLASSPATH: /usr/lib/jvm/java-6-openjdk/lib/tools.jar:/srv/gump/public/workspace/lucene-java/lucene/build/classes/test:/srv/gump/public/workspace/lucene-java/lucene/contrib/db/bdb/lib/db-4.7.25.jar:/srv/gump/public/workspace/lucene-java/lucene/build/contrib/ant/classes/test:/srv/gump/public/workspace/lucene-java/lucene/build/contrib/benchmark/classes/test:/srv/gump/public/workspace/lucene-java/lucene/build/contrib/db/bdb-je/classes/test:/srv/gump/public/workspace/lucene-java/lucene/build/contrib/db/bdb/classes/test:/srv/gump/public/workspace/lucene-java/lucene/build/contrib/demo/classes/test:/srv/gump/public/workspace/lucene-java/lucene/build/contrib/highlighter/classes/test:/srv/gump/public/workspace/lucene-java/lucene/build/contrib/instantiated/classes/test:/srv/gump/public/workspace/lucene-java/lucene/build/contrib/lucli/classes/test:/srv/gump/public/workspace/lucene-java/lucene/build/contrib/memory/classes/test:/srv/gump/public/workspace/lucene-java/lucene/build/contrib/mi
 sc/classes/test:/srv/gump/public/workspace/lucene-java/lucene/build/contrib/queries/classes/test:/srv/gump/public/workspace/lucene-java/lucene/build/contrib/queryparser/classes/test:/srv/gump/public/workspace/lucene-java/lucene/build/contrib/remote/classes/test:/srv/gump/public/workspace/lucene-java/lucene/build/contrib/spatial/classes/test:/srv/gump/public/workspace/lucene-java/lucene/build/contrib/spellchecker/classes/test:/srv/gump/public/workspace/lucene-java/lucene/build/contrib/swing/classes/test:/srv/gump/public/workspace/lucene-java/lucene/build/contrib/wordnet/classes/test:/srv/gump/public/workspace/lucene-java/lucene/build/contrib/xml-query-parser/classes/test:/srv/gump/public/workspace/ant/dist/lib/ant.jar:/srv/gump/public/workspace/ant/dist/lib/ant-launcher.jar:/srv/gump/public/workspace/ant/dist/lib/ant-jmf.jar:/srv/gump/public/workspace/ant/dist/lib/ant-junit.jar:/srv/gump/public/workspace/ant/dist/lib/ant-swing.jar:/srv/gump/public/workspace/ant/dist/lib/ant-a
 pache-resolver.jar:/srv/gump/public/workspace/ant/dist/lib/ant-apache-xalan2.jar:/srv/gump/packages/junit3.8.1/junit.jar:/srv/gump/public/workspace/xml-commons/java/build/resolver.jar:/srv/gump/packages/je-1.7.1/lib/je.jar:/srv/gump/public/workspace/apache-commons/compress/target/commons-compress-1.2-SNAPSHOT.jar:/srv/gump/public/workspace/apache-commons/digester/target/commons-digester-2.1-SNAPSHOT.jar:/srv/gump/public/workspace/apache-commons/logging/target/commons-logging-20092010.jar:/srv/gump/public/workspace/apache-commons/logging/target/commons-logging-api-20092010.jar:/srv/gump/packages/caucho-libs/hessian-3.0.8.jar:/srv/gump/public/workspace/icu4j/main/classes/core/out/lib/icu4j-core.jar:/srv/gump/public/workspace/icu4j/main/classes/collate/out/lib/icu4j-collate.jar:/srv/gump/public/workspace/icu4j/main/classes/currdata/out/lib/icu4j-currdata.jar:/srv/gump/public/workspace/icu4j/main/classes/langdata/out/lib/icu4j-langdata.jar:/srv/gump/public/workspace/icu4j/main/c
 lasses/regiondata/out/lib/icu4j-regiondata.jar:/srv/gump/public/workspace/icu4j/main/classes/translit/out/lib/icu4j-translit.jar:/srv/gump/public/workspace/icu4j/main/classes/charset/out/lib/icu4j-charset.jar:/srv/gump/public/workspace/icu4j/main/classes/localespi/out/lib/icu4j-localespi.jar:/srv/gump/public/workspace/jakarta-regexp/build/jakarta-regexp-20092010.jar:/srv/gump/public/workspace/jakarta-servletapi-5/jsr154/dist/lib/servlet-api.jar:/srv/gump/packages/javacc-3.1/bin/lib/javacc.jar:/srv/gump/public/workspace/jline/target/jline-0.9.95-SNAPSHOT.jar:/srv/gump/packages/jtidy/jtidy-r938.jar:/srv/gump/public/workspace/junit/dist/junit-20092010.jar:/srv/gump/public/workspace/junit/dist/junit-dep-20092010.jar:/srv/gump/public/workspace/lucene-java/lucene/build/lucene-core-20092010.jar:/srv/gump/public/workspace/lucene-java/modules/analysis/build/icu/lucene-analyzers-icu-20092010.jar:/srv/gump/public/workspace/lucene-java/modules/analysis/build/smartcn/lucene-analyzers-sma
 rtcn-20092010.jar:/srv/gump/public/workspace/lucene-java/modules/analysis/build/common/lucene-analyzers-common-20092010.jar:/srv/gump/public/workspace/lucene-java/modules/analysis/build/stempel/lucene-analyzers-stempel-20092010.jar:/srv/gump/public/workspace/lucene-java/modules/analysis/build/phonetic/lucene-analyzers-phonetic-20092010.jar:/srv/gump/public/workspace/lucene-java/lucene/build/contrib/ant/lucene-ant-20092010.jar:/srv/gump/public/workspace/lucene-java/lucene/build/contrib/demo/lucene-demo-20092010.jar:/srv/gump/public/workspace/lucene-java/lucene/build/contrib/memory/lucene-memory-20092010.jar:/srv/gump/public/workspace/lucene-java/lucene/build/contrib/queries/lucene-queries-20092010.jar:/srv/gump/public/workspace/lucene-java/lucene/build/contrib/highlighter/lucene-highlighter-20092010.jar:/srv/gump/public/workspace/lucene-java/lucene/build/contrib/benchmark/lucene-benchmark-20092010.jar:/srv/gump/public/workspace/lucene-java/lucene/build/contrib/db/bdb/lucene-b
 db-20092010.jar:/srv/gump/public/workspace/lucene-java/lucene/build/contrib/db/bdb-je/lucene-bdb-je-20092010.jar:/srv/gump/public/workspace/lucene-java/lucene/build/contrib/instantiated/lucene-instantiated-20092010.jar:/srv/gump/public/workspace/lucene-java/lucene/build/contrib/lucli/lucene-lucli-20092010.jar:/srv/gump/public/workspace/lucene-java/lucene/build/contrib/misc/lucene-misc-20092010.jar:/srv/gump/public/workspace/lucene-java/lucene/build/contrib/queryparser/lucene-queryparser-20092010.jar:/srv/gump/public/workspace/lucene-java/lucene/build/contrib/remote/lucene-remote-20092010.jar:/srv/gump/public/workspace/lucene-java/lucene/build/contrib/spatial/lucene-spatial-20092010.jar:/srv/gump/public/workspace/lucene-java/lucene/build/contrib/spellchecker/lucene-spellchecker-20092010.jar:/srv/gump/public/workspace/lucene-java/lucene/build/contrib/swing/lucene-swing-20092010.jar:/srv/gump/public/workspace/lucene-java/lucene/build/contrib/wordnet/lucene-wordnet-20092010.jar:
 /srv/gump/public/workspace/lucene-java/lucene/build/contrib/xml-query-parser/lucene-xml-query-parser-20092010.jar:/srv/gump/packages/nekohtml-0.9.5/nekohtml.jar:/srv/gump/public/workspace/xml-commons/java/external/build/xml-apis-ext.jar
---------------------------------------------
    [junit] 	at java.lang.ClassLoader.loadClass(ClassLoader.java:266)
    [junit] 	at java.lang.Class.forName0(Native Method)
    [junit] 	at java.lang.Class.forName(Class.java:186)
    [junit] Caused by: java.io.FileNotFoundException: /srv/gump/public/workspace/lucene-java/lucene/build/classes/test/org/apache/lucene/util/TestPriorityQueue.class (Too many open files)
    [junit] 	at java.io.FileInputStream.open(Native Method)
    [junit] 	at java.io.FileInputStream.<init>(FileInputStream.java:137)
    [junit] 	at sun.misc.URLClassPath$FileLoader$1.getInputStream(URLClassPath.java:1005)
    [junit] 	at sun.misc.Resource.cachedInputStream(Resource.java:77)
    [junit] 	at sun.misc.Resource.getByteBuffer(Resource.java:160)
    [junit] 	at java.net.URLClassLoader.defineClass(URLClassLoader.java:266)
    [junit] 	at java.net.URLClassLoader.access$000(URLClassLoader.java:73)
    [junit] 	at java.net.URLClassLoader$1.run(URLClassLoader.java:212)
    [junit] 
    [junit] 
    [junit] Tests run: 1, Failures: 0, Errors: 1, Time elapsed: 0 sec
    [junit] 
    [junit] TEST org.apache.lucene.util.TestPriorityQueue FAILED
    [junit] Testsuite: org.apache.lucene.util.automaton.TestUTF32ToUTF8
    [junit] Null Test: 	Caused an ERROR
    [junit] org.apache.lucene.util.automaton.TestUTF32ToUTF8
    [junit] java.lang.ClassNotFoundException: org.apache.lucene.util.automaton.TestUTF32ToUTF8
    [junit] 	at java.net.URLClassLoader$1.run(URLClassLoader.java:214)
    [junit] 	at java.security.AccessController.doPrivileged(Native Method)
    [junit] 	at java.net.URLClassLoader.findClass(URLClassLoader.java:205)
    [junit] 	at java.lang.ClassLoader.loadClass(ClassLoader.java:321)
    [junit] 	at sun.misc.Launcher$AppClassLoader.loadClass(Launcher.java:294)
    [junit] 	at java.lang.ClassLoader.loadClass(ClassLoader.java:266)
    [junit] 	at java.lang.Class.forName0(Native Method)
    [junit] 	at java.lang.Class.forName(Class.java:186)
    [junit] Caused by: java.io.FileNotFoundException: /srv/gump/public/workspace/lucene-java/lucene/build/classes/test/org/apache/lucene/util/automaton/TestUTF32ToUTF8.class (Too many open files)
    [junit] 	at java.io.FileInputStream.open(Native Method)
    [junit] 	at java.io.FileInputStream.<init>(FileInputStream.java:137)
    [junit] 	at sun.misc.URLClassPath$FileLoader$1.getInputStream(URLClassPath.java:1005)
    [junit] 	at sun.misc.Resource.cachedInputStream(Resource.java:77)
    [junit] 	at sun.misc.Resource.getByteBuffer(Resource.java:160)
    [junit] 	at java.net.URLClassLoader.defineClass(URLClassLoader.java:266)
    [junit] 	at java.net.URLClassLoader.access$000(URLClassLoader.java:73)
    [junit] 	at java.net.URLClassLoader$1.run(URLClassLoader.java:212)
    [junit] 
    [junit] 
    [junit] Tests run: 1, Failures: 0, Errors: 1, Time elapsed: 0 sec
    [junit] 
    [junit] TEST org.apache.lucene.util.automaton.TestUTF32ToUTF8 FAILED
    [junit] Tests FAILED

BUILD FAILED
/srv/gump/public/workspace/lucene-java/lucene/common-build.xml:518: The following error occurred while executing this line:
/srv/gump/public/workspace/lucene-java/lucene/common-build.xml:495: Tests failed!

Total time: 7 minutes 44 seconds
---------------------------------------------

To subscribe to this information via syndicated feeds:
- RSS: http://vmgump.apache.org/gump/public/lucene-java/lucene-java-contrib-test/rss.xml
- Atom: http://vmgump.apache.org/gump/public/lucene-java/lucene-java-contrib-test/atom.xml

============================== Gump Tracking Only ===
Produced by Gump version 2.3.
Gump Run 13000620092010, vmgump.apache.org:vmgump:13000620092010
Gump E-mail Identifier (unique within run) #14.

*********************************************************** G U M P
[GUMP@vmgump]: Project pdfbox-lucene (in module pdfbox) failed
To whom it may engage...
        
This is an automated request, but not an unsolicited one. For 
more information please visit http://gump.apache.org/nagged.html, 
and/or contact the folk at general@gump.apache.org.

Project pdfbox-lucene has an issue affecting its community integration.
This issue affects 1 projects,
 and has been outstanding for 3 runs.
The current state of this project is 'Failed', with reason 'Build Failed'.
For reference only, the following projects are affected by this:
    - pdfbox-lucene :  Apache PDFBox is an open source Java PDF library for working...


Full details are available at:
    http://vmgump.apache.org/gump/public/pdfbox/pdfbox-lucene/index.html

That said, some information snippets are provided here.

The following annotations (debug/informational/warning/error messages) were provided:
 -DEBUG- Sole jar output [pdfbox-lucene-*[0-9T].jar] identifier set to project name
 -DEBUG- (Gump generated) Maven2 Settings in: /srv/gump/public/workspace/pdfbox/lucene/gump_mvn_settings.xml
 -INFO- Failed with reason build failed
 -DEBUG- Maven POM in: /srv/gump/public/workspace/pdfbox/lucene/pom.xml
 -INFO- Failed to extract fallback artifacts from Gump Repository



The following work was performed:
http://vmgump.apache.org/gump/public/pdfbox/pdfbox-lucene/gump_work/build_pdfbox_pdfbox-lucene.html
Work Name: build_pdfbox_pdfbox-lucene (Type: Build)
Work ended in a state of : Failed
Elapsed: 10 secs
Command Line: mvn --batch-mode --settings /srv/gump/public/workspace/pdfbox/lucene/gump_mvn_settings.xml package 
[Working Directory: /srv/gump/public/workspace/pdfbox/lucene]
---------------------------------------------
3349K downloaded  (pdfbox-1.3.0-SNAPSHOT.jar)
1288K downloaded  (lucene-core-2.4.1.jar)
Downloading: http://localhost:8192/maven2/org/apache/lucene/lucene-demos/2.4.1/lucene-demos-2.4.1.jar
57K downloaded  (lucene-demos-2.4.1.jar)
[INFO] Setting property: classpath.resource.loader.class => 'org.codehaus.plexus.velocity.ContextClassLoaderResourceLoader'.
[INFO] Setting property: velocimacro.messages.on => 'false'.
[INFO] Setting property: resource.loader => 'classpath'.
[INFO] Setting property: resource.manager.logwhenfound => 'false'.
[INFO] [remote-resources:process {execution: default}]
[INFO] [resources:resources {execution: default-resources}]
[INFO] Using 'ISO-8859-1' encoding to copy filtered resources.
[INFO] skip non existing resourceDirectory /srv/gump/public/workspace/pdfbox/lucene/src/main/resources
[INFO] Copying 3 resources
[INFO] [compiler:compile {execution: default-compile}]
[INFO] Compiling 4 source files to /srv/gump/public/workspace/pdfbox/lucene/target/classes
[INFO] ------------------------------------------------------------------------
[ERROR] BUILD FAILURE
[INFO] ------------------------------------------------------------------------
[INFO] Compilation failure

/srv/gump/public/workspace/pdfbox/lucene/src/main/java/org/apache/pdfbox/lucene/IndexFiles.java:[25,42] package org.apache.lucene.analysis.standard does not exist

/srv/gump/public/workspace/pdfbox/lucene/src/main/java/org/apache/pdfbox/lucene/IndexFiles.java:[34,30] cannot find symbol
symbol  : class TermEnum
location: package org.apache.lucene.index

/srv/gump/public/workspace/pdfbox/lucene/src/main/java/org/apache/pdfbox/lucene/IndexFiles.java:[59,12] cannot find symbol
symbol  : class TermEnum
location: class org.apache.pdfbox.lucene.IndexFiles

/srv/gump/public/workspace/pdfbox/lucene/src/main/java/org/apache/pdfbox/lucene/IndexFiles.java:[120,48] cannot find symbol
symbol  : class StandardAnalyzer
location: class org.apache.pdfbox.lucene.IndexFiles

/srv/gump/public/workspace/pdfbox/lucene/src/main/java/org/apache/pdfbox/lucene/IndexFiles.java:[120,21] internal error; cannot instantiate org.apache.lucene.index.IndexWriter.<init> at org.apache.lucene.index.IndexWriter to ()

/srv/gump/public/workspace/pdfbox/lucene/src/main/java/org/apache/pdfbox/lucene/IndexFiles.java:[163,32] cannot find symbol
symbol  : method open(java.lang.String)
location: class org.apache.lucene.index.IndexReader

/srv/gump/public/workspace/pdfbox/lucene/src/main/java/org/apache/pdfbox/lucene/IndexFiles.java:[164,28] terms(java.lang.String) in org.apache.lucene.index.IndexReader cannot be applied to (org.apache.lucene.index.Term)


[INFO] ------------------------------------------------------------------------
[INFO] For more information, run Maven with the -e switch
[INFO] ------------------------------------------------------------------------
[INFO] Total time: 9 seconds
[INFO] Finished at: Mon Sep 20 09:55:32 UTC 2010
[INFO] Final Memory: 29M/69M
[INFO] ------------------------------------------------------------------------
---------------------------------------------

To subscribe to this information via syndicated feeds:
- RSS: http://vmgump.apache.org/gump/public/pdfbox/pdfbox-lucene/rss.xml
- Atom: http://vmgump.apache.org/gump/public/pdfbox/pdfbox-lucene/atom.xml

============================== Gump Tracking Only ===
Produced by Gump version 2.3.
Gump Run 13000620092010, vmgump.apache.org:vmgump:13000620092010
Gump E-mail Identifier (unique within run) #16.

*********************************************************** G U M P
[GUMP@vmgump]: Project cocoon-monitoring-test (in module cocoon3) failed
To whom it may engage...
        
This is an automated request, but not an unsolicited one. For 
more information please visit http://gump.apache.org/nagged.html, 
and/or contact the folk at general@gump.apache.org.

Project cocoon-monitoring-test has an issue affecting its community integration.
This issue affects 1 projects,
 and has been outstanding for 6 runs.
The current state of this project is 'Failed', with reason 'Build Failed'.
For reference only, the following projects are affected by this:
    - cocoon-monitoring-test :  Java XML Framework


Full details are available at:
    http://vmgump.apache.org/gump/public/cocoon3/cocoon-monitoring-test/index.html

That said, some information snippets are provided here.

The following annotations (debug/informational/warning/error messages) were provided:
 -WARNING- Overriding Maven2 settings: [/srv/gump/public/workspace/cocoon3/cocoon-monitoring/gump_mvn_settings.xml]
 -DEBUG- (Gump generated) Maven2 Settings in: /srv/gump/public/workspace/cocoon3/cocoon-monitoring/gump_mvn_settings.xml
 -INFO- Failed with reason build failed
 -DEBUG- Maven POM in: /srv/gump/public/workspace/cocoon3/cocoon-monitoring/pom.xml
 -INFO- Project Reports in: /srv/gump/public/workspace/cocoon3/cocoon-monitoring/target/surefire-reports



The following work was performed:
http://vmgump.apache.org/gump/public/cocoon3/cocoon-monitoring-test/gump_work/build_cocoon3_cocoon-monitoring-test.html
Work Name: build_cocoon3_cocoon-monitoring-test (Type: Build)
Work ended in a state of : Failed
Elapsed: 11 secs
Command Line: mvn --batch-mode --settings /srv/gump/public/workspace/cocoon3/cocoon-monitoring/gump_mvn_settings.xml test 
[Working Directory: /srv/gump/public/workspace/cocoon3/cocoon-monitoring]
---------------------------------------------
[INFO] Building Apache Cocoon 3: Monitoring
[INFO]    task-segment: [test]
[INFO] ------------------------------------------------------------------------
[INFO] [enforcer:enforce {execution: enforce-maven}]
[INFO] Setting property: classpath.resource.loader.class => 'org.codehaus.plexus.velocity.ContextClassLoaderResourceLoader'.
[INFO] Setting property: velocimacro.messages.on => 'false'.
[INFO] Setting property: resource.loader => 'classpath'.
[INFO] Setting property: resource.manager.logwhenfound => 'false'.
[INFO] [remote-resources:process {execution: default}]
[INFO] [resources:resources {execution: default-resources}]
[INFO] Using 'UTF-8' encoding to copy filtered resources.
[INFO] Copying 1 resource
[INFO] Copying 3 resources
[INFO] [compiler:compile {execution: default-compile}]
[INFO] Nothing to compile - all classes are up to date
[INFO] [resources:testResources {execution: default-testResources}]
[INFO] Using 'UTF-8' encoding to copy filtered resources.
[INFO] skip non existing resourceDirectory /srv/gump/public/workspace/cocoon3/cocoon-monitoring/src/test/resources
[INFO] Copying 3 resources
[INFO] [compiler:testCompile {execution: default-testCompile}]
[INFO] Nothing to compile - all classes are up to date
[INFO] [surefire:test {execution: default-test}]
[INFO] Surefire report directory: /srv/gump/public/workspace/cocoon3/cocoon-monitoring/target/surefire-reports

-------------------------------------------------------
 T E S T S
-------------------------------------------------------
Running org.apache.cocoon.monitoring.statistics.StatisticsCollectorTest
Tests run: 7, Failures: 1, Errors: 0, Skipped: 0, Time elapsed: 2.483 sec <<< FAILURE!

Results :

Failed tests: 
  testGetHitCountList(org.apache.cocoon.monitoring.statistics.StatisticsCollectorTest)

Tests run: 7, Failures: 1, Errors: 0, Skipped: 0

[INFO] ------------------------------------------------------------------------
[ERROR] BUILD FAILURE
[INFO] ------------------------------------------------------------------------
[INFO] There are test failures.

Please refer to /srv/gump/public/workspace/cocoon3/cocoon-monitoring/target/surefire-reports for the individual test results.
[INFO] ------------------------------------------------------------------------
[INFO] For more information, run Maven with the -e switch
[INFO] ------------------------------------------------------------------------
[INFO] Total time: 10 seconds
[INFO] Finished at: Mon Sep 20 09:57:31 UTC 2010
[INFO] Final Memory: 41M/98M
[INFO] ------------------------------------------------------------------------
---------------------------------------------

To subscribe to this information via syndicated feeds:
- RSS: http://vmgump.apache.org/gump/public/cocoon3/cocoon-monitoring-test/rss.xml
- Atom: http://vmgump.apache.org/gump/public/cocoon3/cocoon-monitoring-test/atom.xml

============================== Gump Tracking Only ===
Produced by Gump version 2.3.
Gump Run 13000620092010, vmgump.apache.org:vmgump:13000620092010
Gump E-mail Identifier (unique within run) #17.

*********************************************************** G U M P
[GUMP@vmgump]: Project tika-reactor (in module tika) failed
To whom it may engage...
        
This is an automated request, but not an unsolicited one. For 
more information please visit http://gump.apache.org/nagged.html, 
and/or contact the folk at general@gump.apache.org.

Project tika-reactor has an issue affecting its community integration.
This issue affects 1 projects,
 and has been outstanding for 3 runs.
The current state of this project is 'Failed', with reason 'Build Failed'.
For reference only, the following projects are affected by this:
    - tika-reactor :  Apache Tika is a toolkit for detecting and extracting metada...


Full details are available at:
    http://vmgump.apache.org/gump/public/tika/tika-reactor/index.html

That said, some information snippets are provided here.

The following annotations (debug/informational/warning/error messages) were provided:
 -DEBUG- (Gump generated) Maven2 Settings in: /srv/gump/public/workspace/tika/gump_mvn_settings.xml
 -INFO- Failed with reason build failed
 -DEBUG- Maven POM in: /srv/gump/public/workspace/tika/pom.xml



The following work was performed:
http://vmgump.apache.org/gump/public/tika/tika-reactor/gump_work/build_tika_tika-reactor.html
Work Name: build_tika_tika-reactor (Type: Build)
Work ended in a state of : Failed
Elapsed: 60 secs
Command Line: mvn --batch-mode --settings /srv/gump/public/workspace/tika/gump_mvn_settings.xml install 
[Working Directory: /srv/gump/public/workspace/tika]
---------------------------------------------
Tests run: 2, Failures: 0, Errors: 0, Skipped: 0, Time elapsed: 0.121 sec
Running org.apache.tika.parser.mbox.MboxParserTest
Tests run: 5, Failures: 0, Errors: 0, Skipped: 0, Time elapsed: 0.403 sec
Running org.apache.tika.parser.pkg.Bzip2ParserTest
Tests run: 2, Failures: 0, Errors: 0, Skipped: 0, Time elapsed: 0.714 sec
Running org.apache.tika.parser.microsoft.ooxml.OOXMLContainerExtractionTest
Tests run: 3, Failures: 0, Errors: 0, Skipped: 0, Time elapsed: 6.284 sec
Running org.apache.tika.parser.microsoft.WordParserTest
Tests run: 2, Failures: 0, Errors: 0, Skipped: 0, Time elapsed: 0.01 sec
Running org.apache.tika.parser.image.TiffParserTest
Tests run: 1, Failures: 0, Errors: 0, Skipped: 0, Time elapsed: 0.007 sec
Running org.apache.tika.parser.epub.EpubParserTest
Tests run: 1, Failures: 0, Errors: 0, Skipped: 0, Time elapsed: 0.018 sec
Running org.apache.tika.mime.MimeTypesTest
Tests run: 6, Failures: 0, Errors: 0, Skipped: 0, Time elapsed: 0.004 sec
Running org.apache.tika.parser.asm.ClassParserTest
Tests run: 1, Failures: 0, Errors: 0, Skipped: 0, Time elapsed: 0.06 sec
Running org.apache.tika.parser.opendocument.ODFParserTest
Tests run: 1, Failures: 0, Errors: 0, Skipped: 0, Time elapsed: 0.014 sec
Running org.apache.tika.parser.video.FLVParserTest
Tests run: 1, Failures: 0, Errors: 0, Skipped: 0, Time elapsed: 0.093 sec
Running org.apache.tika.parser.audio.AudioParserTest
Tests run: 3, Failures: 0, Errors: 0, Skipped: 0, Time elapsed: 0.163 sec
Running org.apache.tika.parser.microsoft.ooxml.OOXMLParserTest
Tests run: 6, Failures: 0, Errors: 0, Skipped: 0, Time elapsed: 1.623 sec
Running org.apache.tika.TestParsers
Tests run: 12, Failures: 0, Errors: 0, Skipped: 0, Time elapsed: 0.853 sec
Running org.apache.tika.parser.html.HtmlParserTest
Tests run: 25, Failures: 0, Errors: 0, Skipped: 0, Time elapsed: 1.241 sec

Results :

Failed tests: 
  testEmbeddedOfficeFiles(org.apache.tika.parser.microsoft.POIContainerExtractionTest)

Tests run: 177, Failures: 1, Errors: 0, Skipped: 0

[INFO] ------------------------------------------------------------------------
[ERROR] BUILD FAILURE
[INFO] ------------------------------------------------------------------------
[INFO] There are test failures.

Please refer to /srv/gump/public/workspace/tika/tika-parsers/target/surefire-reports for the individual test results.
[INFO] ------------------------------------------------------------------------
[INFO] For more information, run Maven with the -e switch
[INFO] ------------------------------------------------------------------------
[INFO] Total time: 59 seconds
[INFO] Finished at: Mon Sep 20 10:40:14 UTC 2010
[INFO] Final Memory: 39M/94M
[INFO] ------------------------------------------------------------------------
---------------------------------------------

To subscribe to this information via syndicated feeds:
- RSS: http://vmgump.apache.org/gump/public/tika/tika-reactor/rss.xml
- Atom: http://vmgump.apache.org/gump/public/tika/tika-reactor/atom.xml

============================== Gump Tracking Only ===
Produced by Gump version 2.3.
Gump Run 13000620092010, vmgump.apache.org:vmgump:13000620092010
Gump E-mail Identifier (unique within run) #19.

*********************************************************** G U M P
[GUMP@vmgump]: Project tika-parsers-test (in module tika) failed
To whom it may engage...
        
This is an automated request, but not an unsolicited one. For 
more information please visit http://gump.apache.org/nagged.html, 
and/or contact the folk at general@gump.apache.org.

Project tika-parsers-test has an issue affecting its community integration.
This issue affects 1 projects,
 and has been outstanding for 3 runs.
The current state of this project is 'Failed', with reason 'Build Failed'.
For reference only, the following projects are affected by this:
    - tika-parsers-test :  Apache Tika is a toolkit for detecting and extracting metada...


Full details are available at:
    http://vmgump.apache.org/gump/public/tika/tika-parsers-test/index.html

That said, some information snippets are provided here.

The following annotations (debug/informational/warning/error messages) were provided:
 -WARNING- Overriding Maven2 settings: [/srv/gump/public/workspace/tika/tika-parsers/gump_mvn_settings.xml]
 -DEBUG- (Gump generated) Maven2 Settings in: /srv/gump/public/workspace/tika/tika-parsers/gump_mvn_settings.xml
 -INFO- Failed with reason build failed
 -DEBUG- Maven POM in: /srv/gump/public/workspace/tika/tika-parsers/pom.xml
 -INFO- Project Reports in: /srv/gump/public/workspace/tika/tika-parsers/target/surefire-reports



The following work was performed:
http://vmgump.apache.org/gump/public/tika/tika-parsers-test/gump_work/build_tika_tika-parsers-test.html
Work Name: build_tika_tika-parsers-test (Type: Build)
Work ended in a state of : Failed
Elapsed: 43 secs
Command Line: mvn --batch-mode --settings /srv/gump/public/workspace/tika/tika-parsers/gump_mvn_settings.xml test 
[Working Directory: /srv/gump/public/workspace/tika/tika-parsers]
---------------------------------------------
Tests run: 2, Failures: 0, Errors: 0, Skipped: 0, Time elapsed: 0.109 sec
Running org.apache.tika.parser.mbox.MboxParserTest
Tests run: 5, Failures: 0, Errors: 0, Skipped: 0, Time elapsed: 0.295 sec
Running org.apache.tika.parser.pkg.Bzip2ParserTest
Tests run: 2, Failures: 0, Errors: 0, Skipped: 0, Time elapsed: 0.738 sec
Running org.apache.tika.parser.microsoft.ooxml.OOXMLContainerExtractionTest
Tests run: 3, Failures: 0, Errors: 0, Skipped: 0, Time elapsed: 4.634 sec
Running org.apache.tika.parser.microsoft.WordParserTest
Tests run: 2, Failures: 0, Errors: 0, Skipped: 0, Time elapsed: 0.011 sec
Running org.apache.tika.parser.image.TiffParserTest
Tests run: 1, Failures: 0, Errors: 0, Skipped: 0, Time elapsed: 0.007 sec
Running org.apache.tika.parser.epub.EpubParserTest
Tests run: 1, Failures: 0, Errors: 0, Skipped: 0, Time elapsed: 0.009 sec
Running org.apache.tika.mime.MimeTypesTest
Tests run: 6, Failures: 0, Errors: 0, Skipped: 0, Time elapsed: 0.007 sec
Running org.apache.tika.parser.asm.ClassParserTest
Tests run: 1, Failures: 0, Errors: 0, Skipped: 0, Time elapsed: 0.049 sec
Running org.apache.tika.parser.opendocument.ODFParserTest
Tests run: 1, Failures: 0, Errors: 0, Skipped: 0, Time elapsed: 0.026 sec
Running org.apache.tika.parser.video.FLVParserTest
Tests run: 1, Failures: 0, Errors: 0, Skipped: 0, Time elapsed: 0.038 sec
Running org.apache.tika.parser.audio.AudioParserTest
Tests run: 3, Failures: 0, Errors: 0, Skipped: 0, Time elapsed: 0.07 sec
Running org.apache.tika.parser.microsoft.ooxml.OOXMLParserTest
Tests run: 6, Failures: 0, Errors: 0, Skipped: 0, Time elapsed: 1.367 sec
Running org.apache.tika.TestParsers
Tests run: 12, Failures: 0, Errors: 0, Skipped: 0, Time elapsed: 0.98 sec
Running org.apache.tika.parser.html.HtmlParserTest
Tests run: 25, Failures: 0, Errors: 0, Skipped: 0, Time elapsed: 1.27 sec

Results :

Failed tests: 
  testEmbeddedOfficeFiles(org.apache.tika.parser.microsoft.POIContainerExtractionTest)

Tests run: 177, Failures: 1, Errors: 0, Skipped: 0

[INFO] ------------------------------------------------------------------------
[ERROR] BUILD FAILURE
[INFO] ------------------------------------------------------------------------
[INFO] There are test failures.

Please refer to /srv/gump/public/workspace/tika/tika-parsers/target/surefire-reports for the individual test results.
[INFO] ------------------------------------------------------------------------
[INFO] For more information, run Maven with the -e switch
[INFO] ------------------------------------------------------------------------
[INFO] Total time: 41 seconds
[INFO] Finished at: Mon Sep 20 10:51:23 UTC 2010
[INFO] Final Memory: 25M/61M
[INFO] ------------------------------------------------------------------------
---------------------------------------------

To subscribe to this information via syndicated feeds:
- RSS: http://vmgump.apache.org/gump/public/tika/tika-parsers-test/rss.xml
- Atom: http://vmgump.apache.org/gump/public/tika/tika-parsers-test/atom.xml

============================== Gump Tracking Only ===
Produced by Gump version 2.3.
Gump Run 13000620092010, vmgump.apache.org:vmgump:13000620092010
Gump E-mail Identifier (unique within run) #21.

*********************************************************** G U M P
[GUMP@vmgump]: Project apache-mime4j-reactor (in module james-mime4j) failed
To whom it may engage...
        
This is an automated request, but not an unsolicited one. For 
more information please visit http://gump.apache.org/nagged.html, 
and/or contact the folk at general@gump.apache.org.

Project apache-mime4j-reactor has an issue affecting its community integration.
This issue affects 1 projects,
 and has been outstanding for 6 runs.
The current state of this project is 'Failed', with reason 'Build Failed'.
For reference only, the following projects are affected by this:
    - apache-mime4j-reactor :  Java stream based MIME message parser


Full details are available at:
    http://vmgump.apache.org/gump/public/james-mime4j/apache-mime4j-reactor/index.html

That said, some information snippets are provided here.

The following annotations (debug/informational/warning/error messages) were provided:
 -WARNING- Overriding Maven2 settings: [/srv/gump/public/workspace/james-mime4j/gump_mvn_settings.xml]
 -DEBUG- (Gump generated) Maven2 Settings in: /srv/gump/public/workspace/james-mime4j/gump_mvn_settings.xml
 -INFO- Failed with reason build failed
 -DEBUG- Maven POM in: /srv/gump/public/workspace/james-mime4j/pom.xml



The following work was performed:
http://vmgump.apache.org/gump/public/james-mime4j/apache-mime4j-reactor/gump_work/build_james-mime4j_apache-mime4j-reactor.html
Work Name: build_james-mime4j_apache-mime4j-reactor (Type: Build)
Work ended in a state of : Failed
Elapsed: 52 secs
Command Line: mvn --batch-mode --settings /srv/gump/public/workspace/james-mime4j/gump_mvn_settings.xml package 
[Working Directory: /srv/gump/public/workspace/james-mime4j]
---------------------------------------------
Running org.apache.james.mime4j.stream.MimeTokenStreamTest
Tests run: 1, Failures: 0, Errors: 0, Skipped: 0, Time elapsed: 0.014 sec
Running org.apache.james.mime4j.TestUtil
Tests run: 0, Failures: 0, Errors: 0, Skipped: 0, Time elapsed: 0.003 sec
Running org.apache.james.mime4j.io.PositionInputStreamTest
Tests run: 1, Failures: 0, Errors: 0, Skipped: 0, Time elapsed: 0.003 sec
Running org.apache.james.mime4j.stream.MimeTokenNoRecurseTest
Tests run: 4, Failures: 0, Errors: 0, Skipped: 0, Time elapsed: 0.011 sec
Running org.apache.james.mime4j.parser.MimeStreamParserTest
Tests run: 11, Failures: 0, Errors: 0, Skipped: 0, Time elapsed: 0.056 sec
Running org.apache.james.mime4j.codec.DecoderUtilTest
Tests run: 13, Failures: 0, Errors: 0, Skipped: 0, Time elapsed: 0.09 sec
Running org.apache.james.mime4j.MimeExceptionTest
Tests run: 3, Failures: 0, Errors: 0, Skipped: 0, Time elapsed: 0.003 sec
Running org.apache.james.mime4j.codec.QuotedPrintableEncodeTest
Tests run: 5, Failures: 0, Errors: 0, Skipped: 0, Time elapsed: 0.011 sec
Running org.apache.james.mime4j.MimeIOExceptionTest
Tests run: 1, Failures: 0, Errors: 0, Skipped: 0, Time elapsed: 0.007 sec
Running org.apache.james.mime4j.codec.QuotedPrintableInputStreamTest
Tests run: 19, Failures: 0, Errors: 0, Skipped: 0, Time elapsed: 0.009 sec
Running org.apache.james.mime4j.stream.MimeTokenStreamBodyDescriptorTest
Tests run: 2, Failures: 0, Errors: 0, Skipped: 0, Time elapsed: 0.016 sec
Running org.apache.james.mime4j.codec.CodecUtilTest
Tests run: 5, Failures: 0, Errors: 0, Skipped: 0, Time elapsed: 0.044 sec
Running org.apache.james.mime4j.stream.MultipartStreamTest
Tests run: 2, Failures: 0, Errors: 0, Skipped: 0, Time elapsed: 0.004 sec

Results :

Tests run: 225, Failures: 0, Errors: 0, Skipped: 0

[INFO] [jar:jar {execution: default-jar}]
[INFO] Building jar: /srv/gump/public/workspace/james-mime4j/core/target/apache-mime4j-core-0.7-SNAPSHOT.jar
[INFO] [jar:test-jar {execution: default}]
[INFO] Building jar: /srv/gump/public/workspace/james-mime4j/core/target/apache-mime4j-core-0.7-SNAPSHOT-tests.jar
[INFO] [javadoc:jar {execution: javadoc-jar}]
[INFO] The goal 'org.apache.maven.plugins:maven-javadoc-plugin:2.6.1:javadoc' has not be previously called for the project: 'org.apache.james:apache-mime4j-benchmark:jar:0.7-SNAPSHOT'. Trying to invoke it...
[ERROR] MavenInvocationException: Error when invoking Maven, consult the invoker log file: /srv/gump/public/workspace/james-mime4j/core/target/invoker/maven-javadoc-plugin1083579317.txt
[INFO] ------------------------------------------------------------------------
[ERROR] BUILD ERROR
[INFO] ------------------------------------------------------------------------
[INFO] MavenReportException: Error while creating archive:Error when invoking Maven, consult the invoker log file: /srv/gump/public/workspace/james-mime4j/core/target/invoker/maven-javadoc-plugin1083579317.txt

[INFO] ------------------------------------------------------------------------
[INFO] For more information, run Maven with the -e switch
[INFO] ------------------------------------------------------------------------
[INFO] Total time: 51 seconds
[INFO] Finished at: Mon Sep 20 11:00:58 UTC 2010
[INFO] Final Memory: 61M/147M
[INFO] ------------------------------------------------------------------------
---------------------------------------------

To subscribe to this information via syndicated feeds:
- RSS: http://vmgump.apache.org/gump/public/james-mime4j/apache-mime4j-reactor/rss.xml
- Atom: http://vmgump.apache.org/gump/public/james-mime4j/apache-mime4j-reactor/atom.xml

============================== Gump Tracking Only ===
Produced by Gump version 2.3.
Gump Run 13000620092010, vmgump.apache.org:vmgump:13000620092010
Gump E-mail Identifier (unique within run) #22.

*********************************************************** G U M P
[GUMP@vmgump]: Project commons-jci-reactor (in module apache-commons) failed
To whom it may engage...
        
This is an automated request, but not an unsolicited one. For 
more information please visit http://gump.apache.org/nagged.html, 
and/or contact the folk at general@gump.apache.org.

Project commons-jci-reactor has an issue affecting its community integration.
This issue affects 1 projects,
 and has been outstanding for 65 runs.
The current state of this project is 'Failed', with reason 'Build Failed'.
For reference only, the following projects are affected by this:
    - commons-jci-reactor :  Apache Commons


Full details are available at:
    http://vmgump.apache.org/gump/public/apache-commons/commons-jci-reactor/index.html

That said, some information snippets are provided here.

The following annotations (debug/informational/warning/error messages) were provided:
 -WARNING- Overriding Maven2 settings: [/srv/gump/public/workspace/apache-commons/jci/gump_mvn_settings.xml]
 -DEBUG- (Gump generated) Maven2 Settings in: /srv/gump/public/workspace/apache-commons/jci/gump_mvn_settings.xml
 -INFO- Failed with reason build failed
 -DEBUG- Maven POM in: /srv/gump/public/workspace/apache-commons/jci/pom.xml
 -INFO- Project Reports in: /srv/gump/public/workspace/apache-commons/jci/compilers/groovy/target/surefire-reports



The following work was performed:
http://vmgump.apache.org/gump/public/apache-commons/commons-jci-reactor/gump_work/build_apache-commons_commons-jci-reactor.html
Work Name: build_apache-commons_commons-jci-reactor (Type: Build)
Work ended in a state of : Failed
Elapsed: 3 mins 35 secs
Command Line: mvn --batch-mode --settings /srv/gump/public/workspace/apache-commons/jci/gump_mvn_settings.xml package 
[Working Directory: /srv/gump/public/workspace/apache-commons/jci]
---------------------------------------------
Downloading: http://localhost:8192/maven2/asm/asm-analysis/2.2.1/asm-analysis-2.2.1.jar
17K downloaded  (asm-analysis-2.2.1.jar)
Downloading: http://localhost:8192/maven2/asm/asm-tree/2.2.1/asm-tree-2.2.1.jar
21K downloaded  (asm-tree-2.2.1.jar)
Downloading: http://localhost:8192/maven2/asm/asm-attrs/2.2.1/asm-attrs-2.2.1.jar


[INFO] [antrun:run {execution: javadoc.resources}]
[INFO] Executing tasks
[INFO] Executed tasks
[INFO] [remote-resources:process {execution: default}]
[INFO] [resources:resources {execution: default-resources}]
[INFO] Using 'iso-8859-1' encoding to copy filtered resources.
[INFO] Copying 0 resource to META-INF
[INFO] [compiler:compile {execution: default-compile}]
[INFO] Compiling 6 source files to /srv/gump/public/workspace/apache-commons/jci/compilers/javac/target/classes
[INFO] -------------------------------------------------------------
[ERROR] COMPILATION ERROR : 
[INFO] -------------------------------------------------------------
[ERROR] /srv/gump/public/workspace/apache-commons/jci/compilers/javac/src/main/java/org/apache/commons/jci/compilers/JavacClassLoader.java:[108,46] cannot find symbol
symbol  : constructor ClassWriter(boolean,boolean)
location: class org.objectweb.asm.ClassWriter

[ERROR] /srv/gump/public/workspace/apache-commons/jci/compilers/javac/src/main/java/org/apache/commons/jci/compilers/JavacClassLoader.java:[109,44] cannot find symbol
symbol  : method accept(org.vafer.dependency.asm.RenamingVisitor,boolean)
location: class org.objectweb.asm.ClassReader

[INFO] 2 errors 
[INFO] -------------------------------------------------------------
[INFO] ------------------------------------------------------------------------
[ERROR] BUILD FAILURE
[INFO] ------------------------------------------------------------------------
[INFO] Compilation failure

/srv/gump/public/workspace/apache-commons/jci/compilers/javac/src/main/java/org/apache/commons/jci/compilers/JavacClassLoader.java:[108,46] cannot find symbol
symbol  : constructor ClassWriter(boolean,boolean)
location: class org.objectweb.asm.ClassWriter

/srv/gump/public/workspace/apache-commons/jci/compilers/javac/src/main/java/org/apache/commons/jci/compilers/JavacClassLoader.java:[109,44] cannot find symbol
symbol  : method accept(org.vafer.dependency.asm.RenamingVisitor,boolean)
location: class org.objectweb.asm.ClassReader


[INFO] ------------------------------------------------------------------------
[INFO] For more information, run Maven with the -e switch
[INFO] ------------------------------------------------------------------------
[INFO] Total time: 3 minutes 34 seconds
[INFO] Finished at: Mon Sep 20 11:15:58 UTC 2010
[INFO] Final Memory: 78M/186M
[INFO] ------------------------------------------------------------------------
---------------------------------------------

To subscribe to this information via syndicated feeds:
- RSS: http://vmgump.apache.org/gump/public/apache-commons/commons-jci-reactor/rss.xml
- Atom: http://vmgump.apache.org/gump/public/apache-commons/commons-jci-reactor/atom.xml

============================== Gump Tracking Only ===
Produced by Gump version 2.3.
Gump Run 13000620092010, vmgump.apache.org:vmgump:13000620092010
Gump E-mail Identifier (unique within run) #23.

*********************************************************** G U M P
[GUMP@vmgump]: Project castor-xml (in module castor) failed
To whom it may engage...
        
This is an automated request, but not an unsolicited one. For 
more information please visit http://gump.apache.org/nagged.html, 
and/or contact the folk at general@gump.apache.org.

Project castor-xml has an issue affecting its community integration.
This issue affects 2 projects,
 and has been outstanding for 2 runs.
The current state of this project is 'Failed', with reason 'Build Failed'.
For reference only, the following projects are affected by this:
    - castor-xml :  Java to XML, SQL, LDAP bindings
    - castor-xml-test :  Java to XML, SQL, LDAP bindings


Full details are available at:
    http://vmgump.apache.org/gump/public/castor/castor-xml/index.html

That said, some information snippets are provided here.

The following annotations (debug/informational/warning/error messages) were provided:
 -DEBUG- Sole jar output [castor-xml-1.3.2-SNAPSHOT.jar] identifier set to project name
 -DEBUG- (Gump generated) Maven2 Settings in: /srv/gump/public/workspace/castor/xml/gump_mvn_settings.xml
 -INFO- Failed with reason build failed
 -DEBUG- Maven POM in: /srv/gump/public/workspace/castor/xml/pom.xml
 -INFO- Failed to extract fallback artifacts from Gump Repository



The following work was performed:
http://vmgump.apache.org/gump/public/castor/castor-xml/gump_work/build_castor_castor-xml.html
Work Name: build_castor_castor-xml (Type: Build)
Work ended in a state of : Failed
Elapsed: 6 secs
Command Line: mvn --batch-mode -DskipTests=true --settings /srv/gump/public/workspace/castor/xml/gump_mvn_settings.xml package 
[Working Directory: /srv/gump/public/workspace/castor/xml]
---------------------------------------------
[INFO] Scanning for projects...
[INFO] ------------------------------------------------------------------------
[INFO] Building Castor XML - core
[INFO]    task-segment: [package]
[INFO] ------------------------------------------------------------------------
[INFO] snapshot org.codehaus.mojo:castor-maven-plugin:2.1-SNAPSHOT: checking for updates from Maven Codehaus Snapshots
[WARNING] *** CHECKSUM FAILED - Checksum failed on download: local = '324ae2809e19be647aef59d83d556e393e032a12'; remote = '<!DOCTYPE' - RETRYING
[WARNING] *** CHECKSUM FAILED - Checksum failed on download: local = '324ae2809e19be647aef59d83d556e393e032a12'; remote = '<!DOCTYPE' - IGNORING
[INFO] snapshot org.codehaus.mojo:castor-maven-plugin:2.1-SNAPSHOT: checking for updates from codehaus-snapshots
[WARNING] *** CHECKSUM FAILED - Checksum failed on download: local = '324ae2809e19be647aef59d83d556e393e032a12'; remote = '<!DOCTYPE' - RETRYING
[WARNING] *** CHECKSUM FAILED - Checksum failed on download: local = '324ae2809e19be647aef59d83d556e393e032a12'; remote = '<!DOCTYPE' - IGNORING
[INFO] ------------------------------------------------------------------------
[ERROR] BUILD ERROR
[INFO] ------------------------------------------------------------------------
[INFO] Error building POM (may not be this project's POM).


Project ID: org.codehaus.mojo:castor-maven-plugin

Reason: Error getting POM for 'org.codehaus.mojo:castor-maven-plugin' from the repository: Unable to read local copy of metadata: Cannot read metadata from '/srv/gump/public/workspace/mvnlocalrepo/castor/org/codehaus/mojo/castor-maven-plugin/2.1-SNAPSHOT/maven-metadata-Maven Codehaus Snapshots.xml': end tag name </body> must match start tag name <hr> from line 7 (position: TEXT seen ...</address>\n</body>... @9:8) 
  org.codehaus.mojo:castor-maven-plugin:pom:2.1-SNAPSHOT


 for project org.codehaus.mojo:castor-maven-plugin


[INFO] ------------------------------------------------------------------------
[INFO] For more information, run Maven with the -e switch
[INFO] ------------------------------------------------------------------------
[INFO] Total time: 5 seconds
[INFO] Finished at: Mon Sep 20 11:24:01 UTC 2010
[INFO] Final Memory: 11M/27M
[INFO] ------------------------------------------------------------------------
---------------------------------------------

To subscribe to this information via syndicated feeds:
- RSS: http://vmgump.apache.org/gump/public/castor/castor-xml/rss.xml
- Atom: http://vmgump.apache.org/gump/public/castor/castor-xml/atom.xml

============================== Gump Tracking Only ===
Produced by Gump version 2.3.
Gump Run 13000620092010, vmgump.apache.org:vmgump:13000620092010
Gump E-mail Identifier (unique within run) #24.

*********************************************************** G U M P
[GUMP@vmgump]: Project james-jsieve (in module james-jsieve) failed
To whom it may engage...
        
This is an automated request, but not an unsolicited one. For 
more information please visit http://gump.apache.org/nagged.html, 
and/or contact the folk at general@gump.apache.org.

Project james-jsieve has an issue affecting its community integration.
This issue affects 1 projects,
 and has been outstanding for 151 runs.
The current state of this project is 'Failed', with reason 'Build Failed'.
For reference only, the following projects are affected by this:
    - james-jsieve :  Implements JSIEVE Mail Filtering Language


Full details are available at:
    http://vmgump.apache.org/gump/public/james-jsieve/james-jsieve/index.html

That said, some information snippets are provided here.

The following annotations (debug/informational/warning/error messages) were provided:
 -WARNING- Overriding Maven2 settings: [/srv/gump/public/workspace/james-jsieve/gump_mvn_settings.xml]
 -DEBUG- (Gump generated) Maven2 Settings in: /srv/gump/public/workspace/james-jsieve/gump_mvn_settings.xml
 -INFO- Failed with reason build failed
 -DEBUG- Maven POM in: /srv/gump/public/workspace/james-jsieve/pom.xml



The following work was performed:
http://vmgump.apache.org/gump/public/james-jsieve/james-jsieve/gump_work/build_james-jsieve_james-jsieve.html
Work Name: build_james-jsieve_james-jsieve (Type: Build)
Work ended in a state of : Failed
Elapsed: 15 secs
Command Line: mvn --batch-mode --settings /srv/gump/public/workspace/james-jsieve/gump_mvn_settings.xml install 
[Working Directory: /srv/gump/public/workspace/james-jsieve]
---------------------------------------------
[INFO]   Apache JAMES jSieve Utilities
[INFO]   Apache JAMES jSieve Assembly
[INFO] ------------------------------------------------------------------------
[INFO] Building Apache JAMES JSieve Project
[INFO]    task-segment: [install]
[INFO] ------------------------------------------------------------------------
[INFO] Setting property: classpath.resource.loader.class => 'org.codehaus.plexus.velocity.ContextClassLoaderResourceLoader'.
[INFO] Setting property: velocimacro.messages.on => 'false'.
[INFO] Setting property: resource.loader => 'classpath'.
[INFO] Setting property: resource.manager.logwhenfound => 'false'.
[INFO] [remote-resources:process {execution: default}]
[INFO] [site:attach-descriptor {execution: default-attach-descriptor}]
[INFO] Unable to load parent project from a relative path: Could not find the model file '/srv/gump/public/workspace/pom.xml'. for project unknown
[INFO] Parent project loaded from repository.
[INFO] [install:install {execution: default-install}]
[INFO] Installing /srv/gump/public/workspace/james-jsieve/pom.xml to /srv/gump/public/workspace/mvnlocalrepo/shared/org/apache/james/jsieve-project/0.5-SNAPSHOT/jsieve-project-0.5-SNAPSHOT.pom
[INFO] ------------------------------------------------------------------------
[INFO] Building Apache JAMES jSieve
[INFO]    task-segment: [install]
[INFO] ------------------------------------------------------------------------
[INFO] [javacc:jjtree-javacc {execution: generate-jjtree}]
[INFO] Skipping - all parsers are up to date
[INFO] [remote-resources:process {execution: default}]
[INFO] [resources:resources {execution: default-resources}]
[INFO] Using 'UTF-8' encoding to copy filtered resources.
[INFO] Copying 3 resources
[INFO] Copying 3 resources
[INFO] [compiler:compile {execution: default-compile}]
[INFO] Nothing to compile - all classes are up to date
[INFO] [bundle:manifest {execution: bundle-manifest}]
[INFO] [resources:testResources {execution: default-testResources}]
[INFO] Using 'UTF-8' encoding to copy filtered resources.
[INFO] Copying 2 resources
[INFO] Copying 3 resources
[INFO] [compiler:testCompile {execution: default-testCompile}]
[INFO] Compiling 50 source files to /srv/gump/public/workspace/james-jsieve/main/target/test-classes
[INFO] ------------------------------------------------------------------------
[ERROR] BUILD FAILURE
[INFO] ------------------------------------------------------------------------
[INFO] Compilation failure
/srv/gump/public/workspace/james-jsieve/main/src/test/java/org/apache/jsieve/AllTests.java:[31,21] package junit.swingui does not exist


[INFO] ------------------------------------------------------------------------
[INFO] For more information, run Maven with the -e switch
[INFO] ------------------------------------------------------------------------
[INFO] Total time: 14 seconds
[INFO] Finished at: Mon Sep 20 11:35:38 UTC 2010
[INFO] Final Memory: 46M/111M
[INFO] ------------------------------------------------------------------------
---------------------------------------------

To subscribe to this information via syndicated feeds:
- RSS: http://vmgump.apache.org/gump/public/james-jsieve/james-jsieve/rss.xml
- Atom: http://vmgump.apache.org/gump/public/james-jsieve/james-jsieve/atom.xml

============================== Gump Tracking Only ===
Produced by Gump version 2.3.
Gump Run 13000620092010, vmgump.apache.org:vmgump:13000620092010
Gump E-mail Identifier (unique within run) #27.

*********************************************************** G U M P
[GUMP@vmgump]: Project castor-reactor (in module castor) failed
To whom it may engage...
        
This is an automated request, but not an unsolicited one. For 
more information please visit http://gump.apache.org/nagged.html, 
and/or contact the folk at general@gump.apache.org.

Project castor-reactor has an issue affecting its community integration.
This issue affects 22 projects,
 and has been outstanding for 2 runs.
The current state of this project is 'Failed', with reason 'Build Failed'.
For reference only, the following projects are affected by this:
    - castor :  Java to XML, SQL, LDAP bindings
    - castor-reactor :  Java to XML, SQL, LDAP bindings
    - castor-test :  Java to XML, SQL, LDAP bindings
    - commons-chain :  GoF "Chain of Responsibility" pattern
    - commons-fileupload :  Commons File Upload Package
    - fulcrum-intake :  Services Framework
    - fulcrum-parser :  Services Framework
    - fulcrum-upload :  Services Framework
    - jakarta-tomcat-4.0 :  Servlet 2.3 and JSP 1.2 Reference Implementation
    - jakarta-tomcat-catalina :  Servlet 2.4 Reference Implementation
    - jakarta-tomcat-coyote-tomcat4 :  Connectors to various web servers
    - jakarta-tomcat-jk :  Connectors to various web servers
    - portals-jetspeed-1 :  Enterprise Information Portal
    - portals-pluto-api-1.0 :  JSR168 Container
    - portals-pluto-container-1.0 :  JSR168 Container
    - portals-pluto-deploy-1.0 :  JSR168 Container
    - portals-pluto-descriptors-1.0 :  JSR168 Container
    - portals-pluto-portal-1.0 :  JSR168 Container
    - tomcat-catalina :  Servlet 2.3 and JSP 1.2 Reference Implementation
    - turbine-core :  A servlet based framework.
    - turbine-core-test :  A servlet based framework.
    - xml-xindice :  native XML database


Full details are available at:
    http://vmgump.apache.org/gump/public/castor/castor-reactor/index.html

That said, some information snippets are provided here.

The following annotations (debug/informational/warning/error messages) were provided:
 -INFO- Optional dependency castor-xml failed with reason build failed
 -DEBUG- (Gump generated) Maven2 Settings in: /srv/gump/public/workspace/castor/gump_mvn_settings.xml
 -INFO- Failed with reason build failed
 -DEBUG- Maven POM in: /srv/gump/public/workspace/castor/pom.xml



The following work was performed:
http://vmgump.apache.org/gump/public/castor/castor-reactor/gump_work/build_castor_castor-reactor.html
Work Name: build_castor_castor-reactor (Type: Build)
Work ended in a state of : Failed
Elapsed: 15 secs
Command Line: mvn --batch-mode -DskipTests=true --settings /srv/gump/public/workspace/castor/gump_mvn_settings.xml package 
[Working Directory: /srv/gump/public/workspace/castor]
---------------------------------------------
[INFO] ------------------------------------------------------------------------
[INFO] [resources:resources {execution: default-resources}]
[INFO] Using 'UTF-8' encoding to copy filtered resources.
[INFO] Copying 4 resources
[INFO] [compiler:compile {execution: default-compile}]
[INFO] Nothing to compile - all classes are up to date
[INFO] [resources:testResources {execution: default-testResources}]
[INFO] Using 'UTF-8' encoding to copy filtered resources.
[INFO] Copying 0 resource
[INFO] [compiler:testCompile {execution: default-testCompile}]
[INFO] Nothing to compile - all classes are up to date
[INFO] [surefire:test {execution: default-test}]
[INFO] Tests are skipped.
[INFO] [jar:jar {execution: default-jar}]
[INFO] Preparing source:jar
[WARNING] Removing: jar from forked lifecycle, to prevent recursive invocation.
[INFO] No goals needed for project - skipping
[INFO] [source:jar {execution: default}]
[INFO] ------------------------------------------------------------------------
[INFO] Building Castor XML - core
[INFO]    task-segment: [package]
[INFO] ------------------------------------------------------------------------
[INFO] snapshot org.codehaus.mojo:castor-maven-plugin:2.1-SNAPSHOT: checking for updates from Maven Codehaus Snapshots
[WARNING] *** CHECKSUM FAILED - Checksum failed on download: local = '324ae2809e19be647aef59d83d556e393e032a12'; remote = '<!DOCTYPE' - RETRYING
[WARNING] *** CHECKSUM FAILED - Checksum failed on download: local = '324ae2809e19be647aef59d83d556e393e032a12'; remote = '<!DOCTYPE' - IGNORING
[INFO] snapshot org.codehaus.mojo:castor-maven-plugin:2.1-SNAPSHOT: checking for updates from codehaus-snapshots
[WARNING] *** CHECKSUM FAILED - Checksum failed on download: local = '324ae2809e19be647aef59d83d556e393e032a12'; remote = '<!DOCTYPE' - RETRYING
[WARNING] *** CHECKSUM FAILED - Checksum failed on download: local = '324ae2809e19be647aef59d83d556e393e032a12'; remote = '<!DOCTYPE' - IGNORING
[INFO] ------------------------------------------------------------------------
[ERROR] BUILD ERROR
[INFO] ------------------------------------------------------------------------
[INFO] Error building POM (may not be this project's POM).


Project ID: org.codehaus.mojo:castor-maven-plugin

Reason: Error getting POM for 'org.codehaus.mojo:castor-maven-plugin' from the repository: Unable to read local copy of metadata: Cannot read metadata from '/srv/gump/public/workspace/mvnlocalrepo/shared/org/codehaus/mojo/castor-maven-plugin/2.1-SNAPSHOT/maven-metadata-Maven Codehaus Snapshots.xml': end tag name </body> must match start tag name <hr> from line 7 (position: TEXT seen ...</address>\n</body>... @9:8) 
  org.codehaus.mojo:castor-maven-plugin:pom:2.1-SNAPSHOT


 for project org.codehaus.mojo:castor-maven-plugin


[INFO] ------------------------------------------------------------------------
[INFO] For more information, run Maven with the -e switch
[INFO] ------------------------------------------------------------------------
[INFO] Total time: 14 seconds
[INFO] Finished at: Mon Sep 20 11:42:01 UTC 2010
[INFO] Final Memory: 36M/87M
[INFO] ------------------------------------------------------------------------
---------------------------------------------

To subscribe to this information via syndicated feeds:
- RSS: http://vmgump.apache.org/gump/public/castor/castor-reactor/rss.xml
- Atom: http://vmgump.apache.org/gump/public/castor/castor-reactor/atom.xml

============================== Gump Tracking Only ===
Produced by Gump version 2.3.
Gump Run 13000620092010, vmgump.apache.org:vmgump:13000620092010
Gump E-mail Identifier (unique within run) #28.

*********************************************************** G U M P
[GUMP@vmgump]: Project htmlunit (in module htmlunit) failed
To whom it may engage...
        
This is an automated request, but not an unsolicited one. For 
more information please visit http://gump.apache.org/nagged.html, 
and/or contact the folk at general@gump.apache.org.

Project htmlunit has an issue affecting its community integration.
This issue affects 1 projects,
 and has been outstanding for 171 runs.
The current state of this project is 'Failed', with reason 'Build Failed'.
For reference only, the following projects are affected by this:
    - htmlunit :  A tool for testing web based applications


Full details are available at:
    http://vmgump.apache.org/gump/public/htmlunit/htmlunit/index.html

That said, some information snippets are provided here.

The following annotations (debug/informational/warning/error messages) were provided:
 -DEBUG- Sole jar output [htmlunit-*[0-9T].jar] identifier set to project name
 -INFO- Optional dependency apache-mime4j-reactor failed with reason build failed
 -INFO- Optional dependency commons-fileupload prerequisite failed with reason build failed
 -DEBUG- (Gump generated) Maven2 Settings in: /srv/gump/public/workspace/htmlunit/htmlunit/gump_mvn_settings.xml
 -INFO- Failed with reason build failed
 -DEBUG- Maven POM in: /srv/gump/public/workspace/htmlunit/htmlunit/pom.xml
 -INFO- Failed to extract fallback artifacts from Gump Repository



The following work was performed:
http://vmgump.apache.org/gump/public/htmlunit/htmlunit/gump_work/build_htmlunit_htmlunit.html
Work Name: build_htmlunit_htmlunit (Type: Build)
Work ended in a state of : Failed
Elapsed: 1 min 8 secs
Command Line: mvn --batch-mode --settings /srv/gump/public/workspace/htmlunit/htmlunit/gump_mvn_settings.xml package 
[Working Directory: /srv/gump/public/workspace/htmlunit/htmlunit]
---------------------------------------------

Downloading: http://localhost:8192/maven2/org/seleniumhq/selenium/selenium-ie-driver/2.0a5/selenium-ie-driver-2.0a5.pom

Downloading: http://localhost:8192/maven2/org/seleniumhq/selenium/selenium-firefox-driver/2.0a5/selenium-firefox-driver-2.0a5.pom

Downloading: http://localhost:8192/maven2/org/seleniumhq/selenium/selenium-remote-client/2.0a5/selenium-remote-client-2.0a5.pom

Downloading: http://localhost:8192/maven2/org/seleniumhq/selenium/selenium-remote-common/2.0a5/selenium-remote-common-2.0a5.pom

Downloading: http://localhost:8192/maven2/net/sourceforge/htmlunit/htmlunit-core-js/2.8/htmlunit-core-js-2.8.jar
Downloading: http://localhost:8192/maven2/net/sourceforge/cssparser/cssparser/0.9.5/cssparser-0.9.5.jar
Downloading: http://localhost:8192/maven2/org/apache/httpcomponents/httpclient/4.0.1/httpclient-4.0.1.jar
Downloading: http://localhost:8192/maven2/net/sourceforge/nekohtml/nekohtml/1.9.14/nekohtml-1.9.14.jar
Downloading: http://localhost:8192/maven2/org/w3c/css/sac/1.3/sac-1.3.jar
323K downloaded  (httpclient-4.0.1.jar)
Downloading: http://localhost:8192/maven2/org/apache/httpcomponents/httpcore/4.0.1/httpcore-4.0.1.jar
891K downloaded  (htmlunit-core-js-2.8.jar)
176K downloaded  (httpcore-4.0.1.jar)
Downloading: http://localhost:8192/maven2/org/apache/httpcomponents/httpmime/4.0.1/httpmime-4.0.1.jar
25K downloaded  (httpmime-4.0.1.jar)



[INFO] [compiler:compile {execution: default-compile}]
[INFO] Compiling 441 source files to /srv/gump/public/workspace/htmlunit/htmlunit/target/classes
[INFO] -------------------------------------------------------------
[ERROR] COMPILATION ERROR : 
[INFO] -------------------------------------------------------------
[ERROR] /srv/gump/public/workspace/htmlunit/htmlunit/src/main/java/com/gargoylesoftware/htmlunit/HttpWebConnection.java:[339,65] incompatible types
found   : org.apache.http.entity.mime.FormBodyPart
required: org.apache.james.mime4j.message.BodyPart

[INFO] 1error
[INFO] -------------------------------------------------------------
[INFO] ------------------------------------------------------------------------
[ERROR] BUILD FAILURE
[INFO] ------------------------------------------------------------------------
[INFO] Compilation failure
/srv/gump/public/workspace/htmlunit/htmlunit/src/main/java/com/gargoylesoftware/htmlunit/HttpWebConnection.java:[339,65] incompatible types
found   : org.apache.http.entity.mime.FormBodyPart
required: org.apache.james.mime4j.message.BodyPart


[INFO] ------------------------------------------------------------------------
[INFO] For more information, run Maven with the -e switch
[INFO] ------------------------------------------------------------------------
[INFO] Total time: 1 minute 7 seconds
[INFO] Finished at: Mon Sep 20 12:20:41 UTC 2010
[INFO] Final Memory: 39M/114M
[INFO] ------------------------------------------------------------------------
---------------------------------------------

To subscribe to this information via syndicated feeds:
- RSS: http://vmgump.apache.org/gump/public/htmlunit/htmlunit/rss.xml
- Atom: http://vmgump.apache.org/gump/public/htmlunit/htmlunit/atom.xml

============================== Gump Tracking Only ===
Produced by Gump version 2.3.
Gump Run 13000620092010, vmgump.apache.org:vmgump:13000620092010
Gump E-mail Identifier (unique within run) #31.

*********************************************************** G U M P
[GUMP@vmgump]: Project commons-jelly-tags-ant-test (in module commons-jelly) failed
To whom it may engage...
        
This is an automated request, but not an unsolicited one. For 
more information please visit http://gump.apache.org/nagged.html, 
and/or contact the folk at general@gump.apache.org.

Project commons-jelly-tags-ant-test has an issue affecting its community integration.
This issue affects 1 projects,
 and has been outstanding for 3 runs.
The current state of this project is 'Failed', with reason 'Build Failed'.
For reference only, the following projects are affected by this:
    - commons-jelly-tags-ant-test :  Commons Jelly


Full details are available at:
    http://vmgump.apache.org/gump/public/commons-jelly/commons-jelly-tags-ant-test/index.html

That said, some information snippets are provided here.

The following annotations (debug/informational/warning/error messages) were provided:
 -DEBUG- Dependency on ant exists, no need to add for property maven.jar.ant-optional.
 -DEBUG- Dependency on xml-xerces exists, no need to add for property maven.jar.xerces.
 -DEBUG- Dependency on commons-jexl-1.x exists, no need to add for property maven.jar.commons-jexl.
 -WARNING- Overriding Maven properties: [/srv/gump/public/workspace/commons-jelly/jelly-tags/ant/build.properties]
 -DEBUG- (Gump generated) Maven Properties in: /srv/gump/public/workspace/commons-jelly/jelly-tags/ant/build.properties
 -INFO- Failed with reason build failed
 -DEBUG- Maven POM in: /srv/gump/public/workspace/commons-jelly/jelly-tags/ant/project.xml
 -DEBUG- Maven project properties in: /srv/gump/public/workspace/commons-jelly/jelly-tags/ant/project.properties
 -INFO- Project Reports in: /srv/gump/public/workspace/commons-jelly/jelly-tags/ant/target/test-reports



The following work was performed:
http://vmgump.apache.org/gump/public/commons-jelly/commons-jelly-tags-ant-test/gump_work/build_commons-jelly_commons-jelly-tags-ant-test.html
Work Name: build_commons-jelly_commons-jelly-tags-ant-test (Type: Build)
Work ended in a state of : Failed
Elapsed: 11 secs
Command Line: maven --offline jar 
[Working Directory: /srv/gump/public/workspace/commons-jelly/jelly-tags/ant]
---------------------------------------------
    [junit] Actual expression: (${foo4.1})=(null)
    [junit] 	at org.apache.commons.jelly.tags.junit.AssertTagSupport.fail(AssertTagSupport.java:44)
    [junit] 	at org.apache.commons.jelly.tags.junit.AssertTagSupport.failNotEquals(AssertTagSupport.java:77)
    [junit] 	at org.apache.commons.jelly.tags.junit.AssertEqualsTag.doTag(AssertEqualsTag.java:56)
    [junit] 	at org.apache.commons.jelly.impl.TagScript.run(TagScript.java:267)
    [junit] 	at org.apache.commons.jelly.impl.ScriptBlock.run(ScriptBlock.java:96)
    [junit] 	at org.apache.commons.jelly.tags.junit.CaseTag$1.runTest(CaseTag.java:60)
    [junit] 
    [junit] 
    [junit] Testcase: startUpReadWrite(org.apache.commons.jelly.tags.junit.CaseTag$1):	Caused an ERROR
    [junit] file:/srv/gump/public/workspace/commons-jelly/jelly-tags/ant/target/test-classes/org/apache/commons/jelly/ant/suite.jelly:98:5: <test:assertEquals> file:/srv/gump/public/workspace/commons-jelly/jelly-tags/ant/target/test-classes/org/apache/commons/jelly/ant/suite.jelly:98:5: <test:assertEquals>  expected:[bar5] but was:[null]
    [junit] Expected expression: (bar5)=(bar5)
    [junit] Actual expression: (${foo5.1})=(null)
    [junit] org.apache.commons.jelly.JellyTagException: file:/srv/gump/public/workspace/commons-jelly/jelly-tags/ant/target/test-classes/org/apache/commons/jelly/ant/suite.jelly:98:5: <test:assertEquals> file:/srv/gump/public/workspace/commons-jelly/jelly-tags/ant/target/test-classes/org/apache/commons/jelly/ant/suite.jelly:98:5: <test:assertEquals>  expected:[bar5] but was:[null]
    [junit] Expected expression: (bar5)=(bar5)
    [junit] Actual expression: (${foo5.1})=(null)
    [junit] 	at org.apache.commons.jelly.impl.TagScript.handleException(TagScript.java:732)
    [junit] 	at org.apache.commons.jelly.impl.TagScript.run(TagScript.java:287)
    [junit] 	at org.apache.commons.jelly.impl.ScriptBlock.run(ScriptBlock.java:96)
    [junit] 	at org.apache.commons.jelly.tags.junit.CaseTag$1.runTest(CaseTag.java:60)
    [junit] Caused by: org.apache.commons.jelly.tags.junit.JellyAssertionFailedError: file:/srv/gump/public/workspace/commons-jelly/jelly-tags/ant/target/test-classes/org/apache/commons/jelly/ant/suite.jelly:98:5: <test:assertEquals>  expected:[bar5] but was:[null]
    [junit] Expected expression: (bar5)=(bar5)
    [junit] Actual expression: (${foo5.1})=(null)
    [junit] 	at org.apache.commons.jelly.tags.junit.AssertTagSupport.fail(AssertTagSupport.java:44)
    [junit] 	at org.apache.commons.jelly.tags.junit.AssertTagSupport.failNotEquals(AssertTagSupport.java:77)
    [junit] 	at org.apache.commons.jelly.tags.junit.AssertEqualsTag.doTag(AssertEqualsTag.java:56)
    [junit] 	at org.apache.commons.jelly.impl.TagScript.run(TagScript.java:267)
    [junit] Root cause
    [junit] org.apache.commons.jelly.tags.junit.JellyAssertionFailedError: file:/srv/gump/public/workspace/commons-jelly/jelly-tags/ant/target/test-classes/org/apache/commons/jelly/ant/suite.jelly:98:5: <test:assertEquals>  expected:[bar5] but was:[null]
    [junit] Expected expression: (bar5)=(bar5)
    [junit] Actual expression: (${foo5.1})=(null)
    [junit] 	at org.apache.commons.jelly.tags.junit.AssertTagSupport.fail(AssertTagSupport.java:44)
    [junit] 	at org.apache.commons.jelly.tags.junit.AssertTagSupport.failNotEquals(AssertTagSupport.java:77)
    [junit] 	at org.apache.commons.jelly.tags.junit.AssertEqualsTag.doTag(AssertEqualsTag.java:56)
    [junit] 	at org.apache.commons.jelly.impl.TagScript.run(TagScript.java:267)
    [junit] 	at org.apache.commons.jelly.impl.ScriptBlock.run(ScriptBlock.java:96)
    [junit] 	at org.apache.commons.jelly.tags.junit.CaseTag$1.runTest(CaseTag.java:60)
    [junit] 
    [junit] 
    [junit] [ERROR] TEST org.apache.commons.jelly.ant.TestJelly FAILED

BUILD FAILED
File...... /home/gump/.maven/cache/maven-test-plugin-1.6.2/plugin.jelly
Element... fail
Line...... 181
Column.... 54
There were test failures.
Total time: 11 seconds
Finished at: Mon Sep 20 12:20:54 UTC 2010

---------------------------------------------

To subscribe to this information via syndicated feeds:
- RSS: http://vmgump.apache.org/gump/public/commons-jelly/commons-jelly-tags-ant-test/rss.xml
- Atom: http://vmgump.apache.org/gump/public/commons-jelly/commons-jelly-tags-ant-test/atom.xml

============================== Gump Tracking Only ===
Produced by Gump version 2.3.
Gump Run 13000620092010, vmgump.apache.org:vmgump:13000620092010
Gump E-mail Identifier (unique within run) #32.

*********************************************************** G U M P
[GUMP@vmgump]: Project jetty-servlets-test (in module jetty) failed
To whom it may engage...
        
This is an automated request, but not an unsolicited one. For 
more information please visit http://gump.apache.org/nagged.html, 
and/or contact the folk at general@gump.apache.org.

Project jetty-servlets-test has an issue affecting its community integration.
This issue affects 1 projects,
 and has been outstanding for 19 runs.
The current state of this project is 'Failed', with reason 'Build Failed'.
For reference only, the following projects are affected by this:
    - jetty-servlets-test :  Java HTTP Servlet Server


Full details are available at:
    http://vmgump.apache.org/gump/public/jetty/jetty-servlets-test/index.html

That said, some information snippets are provided here.

The following annotations (debug/informational/warning/error messages) were provided:
 -WARNING- Overriding Maven2 settings: [/srv/gump/public/workspace/jetty/jetty-servlets/gump_mvn_settings.xml]
 -DEBUG- (Gump generated) Maven2 Settings in: /srv/gump/public/workspace/jetty/jetty-servlets/gump_mvn_settings.xml
 -INFO- Failed with reason build failed
 -DEBUG- Maven POM in: /srv/gump/public/workspace/jetty/jetty-servlets/pom.xml



The following work was performed:
http://vmgump.apache.org/gump/public/jetty/jetty-servlets-test/gump_work/build_jetty_jetty-servlets-test.html
Work Name: build_jetty_jetty-servlets-test (Type: Build)
Work ended in a state of : Failed
Elapsed: 1 min 19 secs
Command Line: mvn --batch-mode --settings /srv/gump/public/workspace/jetty/jetty-servlets/gump_mvn_settings.xml package 
[Working Directory: /srv/gump/public/workspace/jetty/jetty-servlets]
---------------------------------------------
2010-09-20 12:54:40.012:INFO::DoSFilter timer exited
2010-09-20 12:54:40.012:INFO::DoSFilter timer exited
2010-09-20 12:54:40.020:WARN::DOS ALERT: ip=127.0.0.1,session=null,user=null
2010-09-20 12:54:41.516:WARN::DOS ALERT: ip=127.0.0.1,session=null,user=null
2010-09-20 12:54:42.228:INFO::Whitelisted IP addresses: []
2010-09-20 12:54:42.229:INFO::Whitelisted IP addresses: []
2010-09-20 12:54:42.228:INFO::DoSFilter timer exited
2010-09-20 12:54:42.228:INFO::DoSFilter timer exited
2010-09-20 12:54:42.236:WARN::DOS ALERT: ip=127.0.0.1,session=null,user=null
2010-09-20 12:54:42.731:WARN::DOS ALERT: ip=127.0.0.1,session=null,user=null
2010-09-20 12:54:47.447:INFO::Whitelisted IP addresses: []
2010-09-20 12:54:47.447:INFO::Whitelisted IP addresses: []
2010-09-20 12:54:47.447:INFO::DoSFilter timer exited
2010-09-20 12:54:47.447:INFO::DoSFilter timer exited
2010-09-20 12:54:47.454:WARN::DOS ALERT: ip=127.0.0.1,session=1jnu1fmsz921l1mp6mmmxqz8e4,user=null
2010-09-20 12:54:48.555:WARN::DOS ALERT: ip=127.0.0.1,session=1jnu1fmsz921l1mp6mmmxqz8e4,user=null
2010-09-20 12:54:49.656:INFO::Whitelisted IP addresses: []
2010-09-20 12:54:49.657:INFO::Whitelisted IP addresses: []
2010-09-20 12:54:49.657:INFO::DoSFilter timer exited
2010-09-20 12:54:49.657:INFO::DoSFilter timer exited
2010-09-20 12:54:54.537:WARN::DOS ALERT: ip=127.0.0.1,session=1x3phz4vwzx811omueqdlccay4,user=null
2010-09-20 12:54:54.745:WARN::DOS ALERT: ip=127.0.0.1,session=x7dgy4a7elbmn7shu0njqq6a,user=null
2010-09-20 12:54:55.090:INFO::DoSFilter timer exited
2010-09-20 12:54:55.090:INFO::DoSFilter timer exited
2010-09-20 12:54:55.096:INFO::Whitelisted IP addresses: []
2010-09-20 12:54:55.099:INFO::Whitelisted IP addresses: []
2010-09-20 12:54:55.308:INFO::DoSFilter timer exited
2010-09-20 12:54:55.308:INFO::DoSFilter timer exited
Tests run: 8, Failures: 0, Errors: 0, Skipped: 0, Time elapsed: 23.147 sec

Results :

Failed tests: 
  testMultipleSessionTracking(org.eclipse.jetty.servlets.DoSFilterTest)

Tests run: 28, Failures: 1, Errors: 0, Skipped: 0

[INFO] ------------------------------------------------------------------------
[ERROR] BUILD FAILURE
[INFO] ------------------------------------------------------------------------
[INFO] There are test failures.

Please refer to /srv/gump/public/workspace/jetty/jetty-servlets/target/surefire-reports for the individual test results.
[INFO] ------------------------------------------------------------------------
[INFO] For more information, run Maven with the -e switch
[INFO] ------------------------------------------------------------------------
[INFO] Total time: 1 minute 18 seconds
[INFO] Finished at: Mon Sep 20 12:54:55 UTC 2010
[INFO] Final Memory: 46M/112M
[INFO] ------------------------------------------------------------------------
---------------------------------------------

To subscribe to this information via syndicated feeds:
- RSS: http://vmgump.apache.org/gump/public/jetty/jetty-servlets-test/rss.xml
- Atom: http://vmgump.apache.org/gump/public/jetty/jetty-servlets-test/atom.xml

============================== Gump Tracking Only ===
Produced by Gump version 2.3.
Gump Run 13000620092010, vmgump.apache.org:vmgump:13000620092010
Gump E-mail Identifier (unique within run) #34.

*********************************************************** G U M P
[GUMP@vmgump]: Project cocoon22-flowscript-impl (in module cocoon) failed
To whom it may engage...
        
This is an automated request, but not an unsolicited one. For 
more information please visit http://gump.apache.org/nagged.html, 
and/or contact the folk at general@gump.apache.org.

Project cocoon22-flowscript-impl has an issue affecting its community integration.
This issue affects 3 projects,
 and has been outstanding for 6 runs.
The current state of this project is 'Failed', with reason 'Build Failed'.
For reference only, the following projects are affected by this:
    - cocoon22-flowscript-impl :  Java XML Framework
    - lenya-core-api :  Content Management System
    - lenya-reactor :  Content Management System


Full details are available at:
    http://vmgump.apache.org/gump/public/cocoon/cocoon22-flowscript-impl/index.html

That said, some information snippets are provided here.

The following annotations (debug/informational/warning/error messages) were provided:
 -DEBUG- (Gump generated) Maven2 Settings in: /srv/gump/public/workspace/cocoon/blocks/cocoon-flowscript/cocoon-flowscript-impl/gump_mvn_settings.xml
 -INFO- Failed with reason build failed
 -DEBUG- Maven POM in: /srv/gump/public/workspace/cocoon/blocks/cocoon-flowscript/cocoon-flowscript-impl/pom.xml
 -INFO- Failed to extract fallback artifacts from Gump Repository



The following work was performed:
http://vmgump.apache.org/gump/public/cocoon/cocoon22-flowscript-impl/gump_work/build_cocoon_cocoon22-flowscript-impl.html
Work Name: build_cocoon_cocoon22-flowscript-impl (Type: Build)
Work ended in a state of : Failed
Elapsed: 14 secs
Command Line: mvn --batch-mode --settings /srv/gump/public/workspace/cocoon/blocks/cocoon-flowscript/cocoon-flowscript-impl/gump_mvn_settings.xml install 
[Working Directory: /srv/gump/public/workspace/cocoon/blocks/cocoon-flowscript/cocoon-flowscript-impl]
---------------------------------------------
[INFO] Scanning for projects...
[INFO] ------------------------------------------------------------------------
[INFO] Building Cocoon Flowscript Block Implementation
[INFO]    task-segment: [install]
[INFO] ------------------------------------------------------------------------
Downloading: http://localhost:8192/maven2/org/apache/cocoon/cocoon-maven-plugin/1.0.0-M1/cocoon-maven-plugin-1.0.0-M1.pom
4K downloaded  (cocoon-maven-plugin-1.0.0-M1.pom)
Downloading: http://localhost:8192/maven2/org/apache/cocoon/cocoon-maven-plugin/1.0.0-M1/cocoon-maven-plugin-1.0.0-M1.jar

[INFO] [enforcer:enforce-once {execution: enforce-maven}]
[INFO] [resources:resources {execution: default-resources}]
[WARNING] Using platform encoding (UTF-8 actually) to copy filtered resources, i.e. build is platform dependent!
[INFO] Copying 5 resources
[INFO] Copying 2 resources to META-INF
Downloading: http://localhost:8192/maven2/org/apache/cocoon/cocoon-expression-language-api/1.0.0/cocoon-expression-language-api-1.0.0.pom

Downloading: http://localhost:8192/maven2/org/apache/cocoon/cocoon-expression-language-api/1.0.0/cocoon-expression-language-api-1.0.0.jar
11K downloaded  (cocoon-expression-language-api-1.0.0.jar)
[INFO] [compiler:compile {execution: default-compile}]
[INFO] Compiling 20 source files to /srv/gump/public/workspace/cocoon/blocks/cocoon-flowscript/cocoon-flowscript-impl/target/classes
[INFO] ------------------------------------------------------------------------
[ERROR] BUILD FAILURE
[INFO] ------------------------------------------------------------------------
[INFO] Compilation failure
/srv/gump/public/workspace/cocoon/blocks/cocoon-flowscript/cocoon-flowscript-impl/src/main/java/org/apache/cocoon/components/flow/javascript/ScriptablePropertyPointer.java:[163,19] escape(java.lang.String) in org.apache.cocoon.components.flow.javascript.ScriptablePropertyPointer cannot override escape(java.lang.String) in org.apache.commons.jxpath.ri.model.NodePointer; attempting to assign weaker access privileges; was protected


[INFO] ------------------------------------------------------------------------
[INFO] For more information, run Maven with the -e switch
[INFO] ------------------------------------------------------------------------
[INFO] Total time: 13 seconds
[INFO] Finished at: Mon Sep 20 12:59:13 UTC 2010
[INFO] Final Memory: 50M/121M
[INFO] ------------------------------------------------------------------------
---------------------------------------------

To subscribe to this information via syndicated feeds:
- RSS: http://vmgump.apache.org/gump/public/cocoon/cocoon22-flowscript-impl/rss.xml
- Atom: http://vmgump.apache.org/gump/public/cocoon/cocoon22-flowscript-impl/atom.xml

============================== Gump Tracking Only ===
Produced by Gump version 2.3.
Gump Run 13000620092010, vmgump.apache.org:vmgump:13000620092010
Gump E-mail Identifier (unique within run) #35.

*********************************************************** G U M P
[GUMP@vmgump]: Project tapestry (in module tapestry) failed
To whom it may engage...
        
This is an automated request, but not an unsolicited one. For 
more information please visit http://gump.apache.org/nagged.html, 
and/or contact the folk at general@gump.apache.org.

Project tapestry has an issue affecting its community integration.
This issue affects 1 projects,
 and has been outstanding for 87 runs.
The current state of this project is 'Failed', with reason 'Build Failed'.
For reference only, the following projects are affected by this:
    - tapestry :  Component-based web application framework organized around i...


Full details are available at:
    http://vmgump.apache.org/gump/public/tapestry/tapestry/index.html

That said, some information snippets are provided here.

The following annotations (debug/informational/warning/error messages) were provided:
 -INFO- Optional dependency commons-fileupload prerequisite failed with reason build failed
 -DEBUG- (Gump generated) Maven2 Settings in: /srv/gump/public/workspace/tapestry/gump_mvn_settings.xml
 -INFO- Failed with reason build failed
 -DEBUG- Maven POM in: /srv/gump/public/workspace/tapestry/pom.xml
 -INFO- Failed to extract fallback artifacts from Gump Repository



The following work was performed:
http://vmgump.apache.org/gump/public/tapestry/tapestry/gump_work/build_tapestry_tapestry.html
Work Name: build_tapestry_tapestry (Type: Build)
Work ended in a state of : Failed
Elapsed: 3 mins 5 secs
Command Line: mvn --batch-mode -DskipTests=true --settings /srv/gump/public/workspace/tapestry/gump_mvn_settings.xml package 
[Working Directory: /srv/gump/public/workspace/tapestry]
---------------------------------------------
Downloading: http://antlr.org/antlr-snapshot/org/antlr/antlr/3.1.1/antlr-3.1.1.pom
[INFO] Unable to find resource 'org.antlr:antlr:pom:3.1.1' in repository antlr-snapshot (http://antlr.org/antlr-snapshot)
Downloading: http://localhost:8192/maven2/org/antlr/antlr/3.1.1/antlr-3.1.1.pom

Downloading: http://antlr.org/antlr-snapshot/org/antlr/antlr/3.1.1/antlr-3.1.1.jar
[INFO] Unable to find resource 'org.antlr:antlr:jar:3.1.1' in repository antlr-snapshot (http://antlr.org/antlr-snapshot)
Downloading: http://localhost:8192/maven2/org/antlr/antlr/3.1.1/antlr-3.1.1.jar

[INFO] [antlr3:antlr {execution: default}]
org/apache/tapestry5/internal/antlr/PropertyExpressionLexer.g
org/apache/tapestry5/internal/antlr/PropertyExpressionParser.g
Downloading: http://localhost:8192/maven2/org/antlr/antlr-runtime/3.1.1/antlr-runtime-3.1.1.pom

Downloading: http://localhost:8192/maven2/org/codehaus/groovy/groovy-all/1.7.4/groovy-all-1.7.4.pom

Downloading: http://localhost:8192/maven2/org/antlr/antlr-runtime/3.1.1/antlr-runtime-3.1.1.jar
Downloading: http://localhost:8192/maven2/org/codehaus/groovy/groovy-all/1.7.4/groovy-all-1.7.4.jar


[INFO] [remote-resources:process {execution: default}]
[INFO] [resources:resources {execution: default-resources}]
[INFO] Using 'UTF-8' encoding to copy filtered resources.
[INFO] Copying 5 resources
[INFO] Copying 178 resources
[INFO] Copying 3 resources
[INFO] [compiler:compile {execution: default-compile}]
[INFO] Compiling 907 source files to /srv/gump/public/workspace/tapestry/tapestry-core/target/classes
[INFO] ------------------------------------------------------------------------
[ERROR] BUILD FAILURE
[INFO] ------------------------------------------------------------------------
[INFO] Compilation failure

/srv/gump/public/workspace/tapestry/tapestry-core/src/main/java/org/apache/tapestry5/internal/transform/ComponentWorker.java:[124,20] setPublishedParameters(java.util.List<java.lang.String>) in org.apache.tapestry5.model.MutableEmbeddedComponentModel cannot be applied to (java.util.List<java.lang.Object>)

/srv/gump/public/workspace/tapestry/tapestry-core/src/main/java/org/apache/tapestry5/internal/services/MarkupWriterImpl.java:[264,63] incompatible types
found   : java.lang.Object
required: org.apache.tapestry5.MarkupWriterListener

/srv/gump/public/workspace/tapestry/tapestry-core/src/main/java/org/apache/tapestry5/internal/services/MarkupWriterImpl.java:[279,63] incompatible types
found   : java.lang.Object
required: org.apache.tapestry5.MarkupWriterListener


[INFO] ------------------------------------------------------------------------
[INFO] For more information, run Maven with the -e switch
[INFO] ------------------------------------------------------------------------
[INFO] Total time: 3 minutes 3 seconds
[INFO] Finished at: Mon Sep 20 13:04:35 UTC 2010
[INFO] Final Memory: 132M/390M
[INFO] ------------------------------------------------------------------------
---------------------------------------------

To subscribe to this information via syndicated feeds:
- RSS: http://vmgump.apache.org/gump/public/tapestry/tapestry/rss.xml
- Atom: http://vmgump.apache.org/gump/public/tapestry/tapestry/atom.xml

============================== Gump Tracking Only ===
Produced by Gump version 2.3.
Gump Run 13000620092010, vmgump.apache.org:vmgump:13000620092010
Gump E-mail Identifier (unique within run) #36.

*********************************************************** G U M P
[GUMP@vmgump]: Project cocoon22-reactor (in module cocoon) failed
To whom it may engage...
        
This is an automated request, but not an unsolicited one. For 
more information please visit http://gump.apache.org/nagged.html, 
and/or contact the folk at general@gump.apache.org.

Project cocoon22-reactor has an issue affecting its community integration.
This issue affects 1 projects,
 and has been outstanding for 133 runs.
The current state of this project is 'Failed', with reason 'Build Failed'.
For reference only, the following projects are affected by this:
    - cocoon22-reactor :  Java XML Framework


Full details are available at:
    http://vmgump.apache.org/gump/public/cocoon/cocoon22-reactor/index.html

That said, some information snippets are provided here.

The following annotations (debug/informational/warning/error messages) were provided:
 -INFO- Optional dependency htmlunit failed with reason build failed
 -INFO- Optional dependency cocoon22-flowscript-impl failed with reason build failed
 -INFO- Optional dependency xml-fop prerequisite failed with reason build failed
 -INFO- Optional dependency xml-batik failed with reason build failed
 -DEBUG- (Gump generated) Maven2 Settings in: /srv/gump/public/workspace/cocoon/gump_mvn_settings.xml
 -INFO- Failed with reason build failed
 -DEBUG- Maven POM in: /srv/gump/public/workspace/cocoon/pom.xml



The following work was performed:
http://vmgump.apache.org/gump/public/cocoon/cocoon22-reactor/gump_work/build_cocoon_cocoon22-reactor.html
Work Name: build_cocoon_cocoon22-reactor (Type: Build)
Work ended in a state of : Failed
Elapsed: 1 min 31 secs
Command Line: mvn --batch-mode --settings /srv/gump/public/workspace/cocoon/gump_mvn_settings.xml package 
[Working Directory: /srv/gump/public/workspace/cocoon]
---------------------------------------------
8) daisy:daisy-htmlcleaner:jar:1.5-dev

  Try downloading the file manually from the project website.

  Then, install it using the command: 
      mvn install:install-file -DgroupId=daisy -DartifactId=daisy-htmlcleaner -Dversion=1.5-dev -Dpackaging=jar -Dfile=/path/to/file

  Alternatively, if you host your own repository you can deploy the file there: 
      mvn deploy:deploy-file -DgroupId=daisy -DartifactId=daisy-htmlcleaner -Dversion=1.5-dev -Dpackaging=jar -Dfile=/path/to/file -Durl=[url] -DrepositoryId=[id]

  Path to dependency: 
  	1) org.apache.cocoon:cocoon-sitemaptags2daisy-plugin:maven-plugin:1.0.0-SNAPSHOT
  	2) daisy:daisy-htmlcleaner:jar:1.5-dev

9) daisy:daisy-util:jar:1.5-dev

  Try downloading the file manually from the project website.

  Then, install it using the command: 
      mvn install:install-file -DgroupId=daisy -DartifactId=daisy-util -Dversion=1.5-dev -Dpackaging=jar -Dfile=/path/to/file

  Alternatively, if you host your own repository you can deploy the file there: 
      mvn deploy:deploy-file -DgroupId=daisy -DartifactId=daisy-util -Dversion=1.5-dev -Dpackaging=jar -Dfile=/path/to/file -Durl=[url] -DrepositoryId=[id]

  Path to dependency: 
  	1) org.apache.cocoon:cocoon-sitemaptags2daisy-plugin:maven-plugin:1.0.0-SNAPSHOT
  	2) daisy:daisy-util:jar:1.5-dev

----------
9 required artifacts are missing.

for artifact: 
  org.apache.cocoon:cocoon-sitemaptags2daisy-plugin:maven-plugin:1.0.0-SNAPSHOT

from the specified remote repositories:
  gump-central (http://localhost:8192/maven2),
  maven-snapshot (http://snapshots.maven.codehaus.org/maven2/),
  cocoondev (http://cocoondev.org/repository),
  gump-apache.snapshots (http://localhost:8192/repo/m2-snapshot-repository),
  gkossakowski-maven2 (http://people.apache.org/~gkossakowski/maven2/repository)



[INFO] ------------------------------------------------------------------------
[INFO] For more information, run Maven with the -e switch
[INFO] ------------------------------------------------------------------------
[INFO] Total time: 1 minute 30 seconds
[INFO] Finished at: Mon Sep 20 13:27:25 UTC 2010
[INFO] Final Memory: 94M/226M
[INFO] ------------------------------------------------------------------------
---------------------------------------------

To subscribe to this information via syndicated feeds:
- RSS: http://vmgump.apache.org/gump/public/cocoon/cocoon22-reactor/rss.xml
- Atom: http://vmgump.apache.org/gump/public/cocoon/cocoon22-reactor/atom.xml

============================== Gump Tracking Only ===
Produced by Gump version 2.3.
Gump Run 13000620092010, vmgump.apache.org:vmgump:13000620092010
Gump E-mail Identifier (unique within run) #43.

*********************************************************** G U M P
[GUMP@vmgump]: Project ws-commons-axiom (in module ws-axis2-commons) failed
To whom it may engage...
        
This is an automated request, but not an unsolicited one. For 
more information please visit http://gump.apache.org/nagged.html, 
and/or contact the folk at general@gump.apache.org.

Project ws-commons-axiom has an issue affecting its community integration.
This issue affects 1 projects,
 and has been outstanding for 127 runs.
The current state of this project is 'Failed', with reason 'Build Failed'.
For reference only, the following projects are affected by this:
    - ws-commons-axiom :  Common stuff for the WS projects.


Full details are available at:
    http://vmgump.apache.org/gump/public/ws-axis2-commons/ws-commons-axiom/index.html

That said, some information snippets are provided here.

The following annotations (debug/informational/warning/error messages) were provided:
 -INFO- Optional dependency xml-batik failed with reason build failed
 -DEBUG- (Gump generated) Maven2 Settings in: /srv/gump/public/workspace/ws-axis2-commons/axiom/gump_mvn_settings.xml
 -INFO- Failed with reason build failed
 -DEBUG- Maven POM in: /srv/gump/public/workspace/ws-axis2-commons/axiom/pom.xml



The following work was performed:
http://vmgump.apache.org/gump/public/ws-axis2-commons/ws-commons-axiom/gump_work/build_ws-axis2-commons_ws-commons-axiom.html
Work Name: build_ws-axis2-commons_ws-commons-axiom (Type: Build)
Work ended in a state of : Failed
Elapsed: 1 min 37 secs
Command Line: mvn --batch-mode --settings /srv/gump/public/workspace/ws-axis2-commons/axiom/gump_mvn_settings.xml install 
[Working Directory: /srv/gump/public/workspace/ws-axis2-commons/axiom]
---------------------------------------------

Downloading: http://localhost:8192/maven2/org/apache/maven/maven-plugin-parameter-documenter/2.0/maven-plugin-parameter-documenter-2.0.pom

Downloading: http://localhost:8192/maven2/org/apache/maven/wagon/wagon-http-lightweight/1.0-alpha-5/wagon-http-lightweight-1.0-alpha-5.pom

Downloading: http://localhost:8192/maven2/org/apache/maven/reporting/maven-reporting-api/2.0/maven-reporting-api-2.0.pom

Downloading: http://localhost:8192/maven2/org/apache/maven/reporting/maven-reporting/2.0/maven-reporting-2.0.pom

Downloading: http://localhost:8192/maven2/org/apache/maven/maven-error-diagnostics/2.0/maven-error-diagnostics-2.0.pom

Downloading: http://localhost:8192/maven2/org/apache/maven/maven-plugin-registry/2.0/maven-plugin-registry-2.0.pom

Downloading: http://localhost:8192/maven2/org/apache/maven/maven-plugin-descriptor/2.0/maven-plugin-descriptor-2.0.pom

Downloading: http://localhost:8192/maven2/org/apache/maven/maven-monitor/2.0/maven-monitor-2.0.pom

Downloading: http://localhost:8192/maven2/org/apache/maven/wagon/wagon-ssh/1.0-alpha-5/wagon-ssh-1.0-alpha-5.pom

Downloading: http://localhost:8192/maven2/com/jcraft/jsch/0.1.23/jsch-0.1.23.pom

Downloading: http://localhost:8192/maven2/org/apache/maven/doxia/doxia-site-renderer/1.0-alpha-8/doxia-site-renderer-1.0-alpha-8.jar
Downloading: http://localhost:8192/maven2/org/apache/commons/commons-compress/1.0/commons-compress-1.0.jar
Downloading: http://localhost:8192/maven2/org/codehaus/plexus/plexus-utils/1.4/plexus-utils-1.4.jar
Downloading: http://localhost:8192/maven2/commons-cli/commons-cli/1.1/commons-cli-1.1.jar
Downloading: http://localhost:8192/maven2/org/apache/maven/shared/maven-plugin-testing-harness/1.0-beta-1/maven-plugin-testing-harness-1.0-beta-1.jar
157K downloaded  (commons-compress-1.0.jar)
Downloading: http://localhost:8192/maven2/org/apache/rat/apache-rat-core/0.7/apache-rat-core-0.7.jar
47K downloaded  (commons-cli-1.1.jar)
94K downloaded  (apache-rat-core-0.7.jar)



Downloading: http://localhost:8192/maven2/org/apache/maven/doxia/doxia-core/1.0-alpha-8/doxia-core-1.0-alpha-8.jar

Downloading: http://localhost:8192/maven2/org/apache/maven/doxia/doxia-decoration-model/1.0-alpha-8/doxia-decoration-model-1.0-alpha-8.jar

[INFO] [apache-rat:check {execution: default}]
[INFO] Exclude: src/test/resources/**
[INFO] ------------------------------------------------------------------------
[ERROR] BUILD FAILURE
[INFO] ------------------------------------------------------------------------
[INFO] Too many unapproved licenses: 1
[INFO] ------------------------------------------------------------------------
[INFO] For more information, run Maven with the -e switch
[INFO] ------------------------------------------------------------------------
[INFO] Total time: 1 minute 36 seconds
[INFO] Finished at: Mon Sep 20 13:29:48 UTC 2010
[INFO] Final Memory: 43M/104M
[INFO] ------------------------------------------------------------------------
---------------------------------------------

To subscribe to this information via syndicated feeds:
- RSS: http://vmgump.apache.org/gump/public/ws-axis2-commons/ws-commons-axiom/rss.xml
- Atom: http://vmgump.apache.org/gump/public/ws-axis2-commons/ws-commons-axiom/atom.xml

============================== Gump Tracking Only ===
Produced by Gump version 2.3.
Gump Run 13000620092010, vmgump.apache.org:vmgump:13000620092010
Gump E-mail Identifier (unique within run) #44.

*********************************************************** G U M P
[GUMP@vmgump]: Project openjpa-kernel (in module openjpa) failed
To whom it may engage...
        
This is an automated request, but not an unsolicited one. For 
more information please visit http://gump.apache.org/nagged.html, 
and/or contact the folk at general@gump.apache.org.

Project openjpa-kernel has an issue affecting its community integration.
This issue affects 8 projects,
 and has been outstanding for 6 runs.
The current state of this project is 'Failed', with reason 'Build Failed'.
For reference only, the following projects are affected by this:
    - openjpa :  Apache OpenJPA is a Java persistence project that can be use...
    - openjpa-jdbc :  Apache OpenJPA is a Java persistence project that can be use...
    - openjpa-kernel :  Apache OpenJPA is a Java persistence project that can be use...
    - openjpa-persistence :  Apache OpenJPA is a Java persistence project that can be use...
    - openjpa-persistence-jdbc :  Apache OpenJPA is a Java persistence project that can be use...
    - openjpa-slice :  Apache OpenJPA is a Java persistence project that can be use...
    - openjpa-testsupport :  Apache OpenJPA is a Java persistence project that can be use...
    - openjpa-xmlstore :  Apache OpenJPA is a Java persistence project that can be use...


Full details are available at:
    http://vmgump.apache.org/gump/public/openjpa/openjpa-kernel/index.html

That said, some information snippets are provided here.

The following annotations (debug/informational/warning/error messages) were provided:
 -DEBUG- Sole jar output [openjpa-kernel-*[0-9T].jar] identifier set to project name
 -DEBUG- (Gump generated) Maven2 Settings in: /srv/gump/public/workspace/openjpa/openjpa-kernel/gump_mvn_settings.xml
 -INFO- Failed with reason build failed
 -DEBUG- Maven POM in: /srv/gump/public/workspace/openjpa/openjpa-kernel/pom.xml
 -INFO- Failed to extract fallback artifacts from Gump Repository



The following work was performed:
http://vmgump.apache.org/gump/public/openjpa/openjpa-kernel/gump_work/build_openjpa_openjpa-kernel.html
Work Name: build_openjpa_openjpa-kernel (Type: Build)
Work ended in a state of : Failed
Elapsed: 40 secs
Command Line: mvn --batch-mode -Dcheckstyle.skip=true --settings /srv/gump/public/workspace/openjpa/openjpa-kernel/gump_mvn_settings.xml package 
[Working Directory: /srv/gump/public/workspace/openjpa/openjpa-kernel]
---------------------------------------------
location: class org.apache.openjpa.enhance.PCDataGenerator

/srv/gump/public/workspace/openjpa/openjpa-kernel/src/main/java/org/apache/openjpa/enhance/PCDataGenerator.java:[762,33] cannot find symbol
symbol  : class BCClass
location: class org.apache.openjpa.enhance.PCDataGenerator

/srv/gump/public/workspace/openjpa/openjpa-kernel/src/main/java/org/apache/openjpa/enhance/PCDataGenerator.java:[769,32] cannot find symbol
symbol  : class BCClass
location: class org.apache.openjpa.enhance.PCDataGenerator

/srv/gump/public/workspace/openjpa/openjpa-kernel/src/main/java/org/apache/openjpa/enhance/PCDataGenerator.java:[855,26] cannot find symbol
symbol  : class BCClass
location: class org.apache.openjpa.enhance.PCDataGenerator

/srv/gump/public/workspace/openjpa/openjpa-kernel/src/main/java/org/apache/openjpa/enhance/PCDataGenerator.java:[855,38] cannot find symbol
symbol  : class Code
location: class org.apache.openjpa.enhance.PCDataGenerator

/srv/gump/public/workspace/openjpa/openjpa-kernel/src/main/java/org/apache/openjpa/enhance/PCDataGenerator.java:[944,32] cannot find symbol
symbol  : class BCClass
location: class org.apache.openjpa.enhance.PCDataGenerator

/srv/gump/public/workspace/openjpa/openjpa-kernel/src/main/java/org/apache/openjpa/enhance/PCDataGenerator.java:[967,28] cannot find symbol
symbol  : class BCClass
location: class org.apache.openjpa.enhance.PCDataGenerator

/srv/gump/public/workspace/openjpa/openjpa-kernel/src/main/java/org/apache/openjpa/enhance/PCDataGenerator.java:[1030,38] cannot find symbol
symbol  : class BCClass
location: class org.apache.openjpa.enhance.PCDataGenerator

/srv/gump/public/workspace/openjpa/openjpa-kernel/src/main/java/org/apache/openjpa/enhance/PCDataGenerator.java:[1049,29] cannot find symbol
symbol  : class Instruction
location: class org.apache.openjpa.enhance.PCDataGenerator

/srv/gump/public/workspace/openjpa/openjpa-kernel/src/main/java/org/apache/openjpa/enhance/PCDataGenerator.java:[1049,57] cannot find symbol
symbol  : class Instruction
location: class org.apache.openjpa.enhance.PCDataGenerator

/srv/gump/public/workspace/openjpa/openjpa-kernel/src/main/java/org/apache/openjpa/enhance/DynamicStorageGenerator.java:[98,18] cannot find symbol
symbol  : class Project
location: class org.apache.openjpa.enhance.DynamicStorageGenerator


[INFO] ------------------------------------------------------------------------
[INFO] For more information, run Maven with the -e switch
[INFO] ------------------------------------------------------------------------
[INFO] Total time: 38 seconds
[INFO] Finished at: Mon Sep 20 14:18:05 UTC 2010
[INFO] Final Memory: 66M/219M
[INFO] ------------------------------------------------------------------------
---------------------------------------------

To subscribe to this information via syndicated feeds:
- RSS: http://vmgump.apache.org/gump/public/openjpa/openjpa-kernel/rss.xml
- Atom: http://vmgump.apache.org/gump/public/openjpa/openjpa-kernel/atom.xml

============================== Gump Tracking Only ===
Produced by Gump version 2.3.
Gump Run 13000620092010, vmgump.apache.org:vmgump:13000620092010
Gump E-mail Identifier (unique within run) #48.

*********************************************************** G U M P
[GUMP@vmgump]: Project portals-pluto-trunk-test (in module portals-pluto-trunk) failed
To whom it may engage...
        
This is an automated request, but not an unsolicited one. For 
more information please visit http://gump.apache.org/nagged.html, 
and/or contact the folk at general@gump.apache.org.

Project portals-pluto-trunk-test has an issue affecting its community integration.
This issue affects 1 projects,
 and has been outstanding for 6 runs.
The current state of this project is 'Failed', with reason 'Build Failed'.
For reference only, the following projects are affected by this:
    - portals-pluto-trunk-test :  JSR168 Container


Full details are available at:
    http://vmgump.apache.org/gump/public/portals-pluto-trunk/portals-pluto-trunk-test/index.html

That said, some information snippets are provided here.

The following annotations (debug/informational/warning/error messages) were provided:
 -WARNING- Overriding Maven2 settings: [/srv/gump/public/workspace/portals-pluto-trunk/gump_mvn_settings.xml]
 -DEBUG- (Gump generated) Maven2 Settings in: /srv/gump/public/workspace/portals-pluto-trunk/gump_mvn_settings.xml
 -INFO- Failed with reason build failed
 -DEBUG- Maven POM in: /srv/gump/public/workspace/portals-pluto-trunk/pom.xml



The following work was performed:
http://vmgump.apache.org/gump/public/portals-pluto-trunk/portals-pluto-trunk-test/gump_work/build_portals-pluto-trunk_portals-pluto-trunk-test.html
Work Name: build_portals-pluto-trunk_portals-pluto-trunk-test (Type: Build)
Work ended in a state of : Failed
Elapsed: 28 secs
Command Line: mvn --batch-mode --settings /srv/gump/public/workspace/portals-pluto-trunk/gump_mvn_settings.xml package 
[Working Directory: /srv/gump/public/workspace/portals-pluto-trunk]
---------------------------------------------
[ERROR] FATAL ERROR
[INFO] ------------------------------------------------------------------------
[INFO] org/xmlpull/v1/XmlPullParserFactory
org.xmlpull.v1.XmlPullParserFactory
[INFO] ------------------------------------------------------------------------
[INFO] Trace
java.lang.NoClassDefFoundError: org/xmlpull/v1/XmlPullParserFactory
	at com.thoughtworks.xstream.io.xml.XppDriver.createParser(XppDriver.java:57)
	at com.thoughtworks.xstream.io.xml.AbstractXppDriver.createReader(AbstractXppDriver.java:56)
	at com.thoughtworks.xstream.XStream.fromXML(XStream.java:879)
	at org.apache.maven.plugin.war.util.WebappStructureSerializer.fromXml(WebappStructureSerializer.java:73)
	at org.apache.maven.plugin.war.AbstractWarMojo.buildWebapp(AbstractWarMojo.java:423)
	at org.apache.maven.plugin.war.AbstractWarMojo.buildExplodedWebapp(AbstractWarMojo.java:394)
	at org.apache.maven.plugin.war.WarMojo.performPackaging(WarMojo.java:195)
	at org.apache.maven.plugin.war.WarMojo.execute(WarMojo.java:157)
	at org.apache.maven.plugin.DefaultPluginManager.executeMojo(DefaultPluginManager.java:490)
	at org.apache.maven.lifecycle.DefaultLifecycleExecutor.executeGoals(DefaultLifecycleExecutor.java:694)
	at org.apache.maven.lifecycle.DefaultLifecycleExecutor.executeGoalWithLifecycle(DefaultLifecycleExecutor.java:556)
	at org.apache.maven.lifecycle.DefaultLifecycleExecutor.executeGoal(DefaultLifecycleExecutor.java:535)
	at org.apache.maven.lifecycle.DefaultLifecycleExecutor.executeGoalAndHandleFailures(DefaultLifecycleExecutor.java:387)
	at org.apache.maven.lifecycle.DefaultLifecycleExecutor.executeTaskSegments(DefaultLifecycleExecutor.java:348)
	at org.apache.maven.lifecycle.DefaultLifecycleExecutor.execute(DefaultLifecycleExecutor.java:180)
	at org.apache.maven.DefaultMaven.doExecute(DefaultMaven.java:328)
	at org.apache.maven.DefaultMaven.execute(DefaultMaven.java:138)
	at org.apache.maven.cli.MavenCli.main(MavenCli.java:362)
	at org.apache.maven.cli.compat.CompatibleMain.main(CompatibleMain.java:60)
	at sun.reflect.NativeMethodAccessorImpl.invoke0(Native Method)
	at sun.reflect.NativeMethodAccessorImpl.invoke(NativeMethodAccessorImpl.java:57)
	at sun.reflect.DelegatingMethodAccessorImpl.invoke(DelegatingMethodAccessorImpl.java:43)
	at java.lang.reflect.Method.invoke(Method.java:616)
	at org.codehaus.classworlds.Launcher.launchEnhanced(Launcher.java:315)
	at org.codehaus.classworlds.Launcher.launch(Launcher.java:255)
	at org.codehaus.classworlds.Launcher.mainWithExitCode(Launcher.java:430)
	at org.codehaus.classworlds.Launcher.main(Launcher.java:375)
Caused by: java.lang.ClassNotFoundException: org.xmlpull.v1.XmlPullParserFactory
	at java.net.URLClassLoader$1.run(URLClassLoader.java:217)
	at java.security.AccessController.doPrivileged(Native Method)
	at java.net.URLClassLoader.findClass(URLClassLoader.java:205)
	at java.lang.ClassLoader.loadClass(ClassLoader.java:321)
	at org.codehaus.classworlds.RealmClassLoader.loadClassDirect(RealmClassLoader.java:195)
	at org.codehaus.classworlds.DefaultClassRealm.loadClass(DefaultClassRealm.java:255)
	at org.codehaus.classworlds.DefaultClassRealm.loadClass(DefaultClassRealm.java:274)
	at org.codehaus.classworlds.RealmClassLoader.loadClass(RealmClassLoader.java:214)
	at java.lang.ClassLoader.loadClass(ClassLoader.java:266)
	... 27 more
[INFO] ------------------------------------------------------------------------
[INFO] Total time: 26 seconds
[INFO] Finished at: Mon Sep 20 14:25:14 UTC 2010
[INFO] Final Memory: 50M/121M
[INFO] ------------------------------------------------------------------------
---------------------------------------------

To subscribe to this information via syndicated feeds:
- RSS: http://vmgump.apache.org/gump/public/portals-pluto-trunk/portals-pluto-trunk-test/rss.xml
- Atom: http://vmgump.apache.org/gump/public/portals-pluto-trunk/portals-pluto-trunk-test/atom.xml

============================== Gump Tracking Only ===
Produced by Gump version 2.3.
Gump Run 13000620092010, vmgump.apache.org:vmgump:13000620092010
Gump E-mail Identifier (unique within run) #49.

*********************************************************** G U M P
[GUMP@vmgump]: Project portals-bridges-script-test (in module portals-bridges) failed
To whom it may engage...
        
This is an automated request, but not an unsolicited one. For 
more information please visit http://gump.apache.org/nagged.html, 
and/or contact the folk at general@gump.apache.org.

Project portals-bridges-script-test has an issue affecting its community integration.
This issue affects 1 projects,
 and has been outstanding for 6 runs.
The current state of this project is 'Failed', with reason 'Build Failed'.
For reference only, the following projects are affected by this:
    - portals-bridges-script-test :  Support for JSR168 compliant Portlet development


Full details are available at:
    http://vmgump.apache.org/gump/public/portals-bridges/portals-bridges-script-test/index.html

That said, some information snippets are provided here.

The following annotations (debug/informational/warning/error messages) were provided:
 -WARNING- Overriding Maven2 settings: [/srv/gump/public/workspace/portals-bridges/bridges-script/trunk/portlet/gump_mvn_settings.xml]
 -DEBUG- (Gump generated) Maven2 Settings in: /srv/gump/public/workspace/portals-bridges/bridges-script/trunk/portlet/gump_mvn_settings.xml
 -INFO- Failed with reason build failed
 -DEBUG- Maven POM in: /srv/gump/public/workspace/portals-bridges/bridges-script/trunk/portlet/pom.xml



The following work was performed:
http://vmgump.apache.org/gump/public/portals-bridges/portals-bridges-script-test/gump_work/build_portals-bridges_portals-bridges-script-test.html
Work Name: build_portals-bridges_portals-bridges-script-test (Type: Build)
Work ended in a state of : Failed
Elapsed: 30 secs
Command Line: mvn --batch-mode --settings /srv/gump/public/workspace/portals-bridges/bridges-script/trunk/portlet/gump_mvn_settings.xml package 
[Working Directory: /srv/gump/public/workspace/portals-bridges/bridges-script/trunk/portlet]
---------------------------------------------
[INFO] Surefire report directory: /srv/gump/public/workspace/portals-bridges/bridges-script/trunk/portlet/target/surefire-reports

-------------------------------------------------------
 T E S T S
-------------------------------------------------------
Running org.apache.portals.bridges.script.TestHelloJythonScriptPortlet
Tests run: 5, Failures: 0, Errors: 5, Skipped: 0, Time elapsed: 5.578 sec <<< FAILURE!
Running org.apache.portals.bridges.script.TestHelloJRubyScriptPortlet
Tests run: 5, Failures: 0, Errors: 0, Skipped: 0, Time elapsed: 6.028 sec
Running org.apache.portals.bridges.script.TestHelloRhinoScriptPortlet
[WARNING] Rhino script engine embedded in the default Java 1.6+ has not fully tested yet.
[WARNING] Rhino script engine embedded in the default Java 1.6+ has not fully tested yet.
[WARNING] Rhino script engine embedded in the default Java 1.6+ has not fully tested yet.
[WARNING] Rhino script engine embedded in the default Java 1.6+ has not fully tested yet.
[WARNING] Rhino script engine embedded in the default Java 1.6+ has not fully tested yet.
[WARNING] Rhino script engine embedded in the default Java 1.6+ has not fully tested yet.
[WARNING] Rhino script engine embedded in the default Java 1.6+ has not fully tested yet.
[WARNING] Rhino script engine embedded in the default Java 1.6+ has not fully tested yet.
[WARNING] Rhino script engine embedded in the default Java 1.6+ has not fully tested yet.
[WARNING] Rhino script engine embedded in the default Java 1.6+ has not fully tested yet.
Tests run: 5, Failures: 0, Errors: 0, Skipped: 0, Time elapsed: 0.026 sec
Running org.apache.portals.bridges.script.TestHelloGroovyScriptPortlet
Tests run: 5, Failures: 0, Errors: 0, Skipped: 0, Time elapsed: 5.475 sec
Running org.apache.portals.bridges.script.TestHelloBeanShellScriptPortlet
Tests run: 5, Failures: 0, Errors: 0, Skipped: 0, Time elapsed: 2.462 sec

Results :

Tests in error: 
  testInit(org.apache.portals.bridges.script.TestHelloJythonScriptPortlet)
  testRender(org.apache.portals.bridges.script.TestHelloJythonScriptPortlet)
  testProcessAction(org.apache.portals.bridges.script.TestHelloJythonScriptPortlet)
  testProcessEvent(org.apache.portals.bridges.script.TestHelloJythonScriptPortlet)
  testServeResource(org.apache.portals.bridges.script.TestHelloJythonScriptPortlet)

Tests run: 25, Failures: 0, Errors: 5, Skipped: 0

[INFO] ------------------------------------------------------------------------
[ERROR] BUILD FAILURE
[INFO] ------------------------------------------------------------------------
[INFO] There are test failures.

Please refer to /srv/gump/public/workspace/portals-bridges/bridges-script/trunk/portlet/target/surefire-reports for the individual test results.
[INFO] ------------------------------------------------------------------------
[INFO] For more information, run Maven with the -e switch
[INFO] ------------------------------------------------------------------------
[INFO] Total time: 28 seconds
[INFO] Finished at: Mon Sep 20 14:28:53 UTC 2010
[INFO] Final Memory: 24M/57M
[INFO] ------------------------------------------------------------------------
---------------------------------------------

To subscribe to this information via syndicated feeds:
- RSS: http://vmgump.apache.org/gump/public/portals-bridges/portals-bridges-script-test/rss.xml
- Atom: http://vmgump.apache.org/gump/public/portals-bridges/portals-bridges-script-test/atom.xml

============================== Gump Tracking Only ===
Produced by Gump version 2.3.
Gump Run 13000620092010, vmgump.apache.org:vmgump:13000620092010
Gump E-mail Identifier (unique within run) #50.

*********************************************************** G U M P
[GUMP@vmgump]: Project ws-axis2 (in module ws-axis2) failed
To whom it may engage...
        
This is an automated request, but not an unsolicited one. For 
more information please visit http://gump.apache.org/nagged.html, 
and/or contact the folk at general@gump.apache.org.

Project ws-axis2 has an issue affecting its community integration.
This issue affects 2 projects,
 and has been outstanding for 517 runs.
The current state of this project is 'Failed', with reason 'Build Failed'.
For reference only, the following projects are affected by this:
    - ws-axis2 :  Apache Axis2 SOAP Stack
    - ws-axis2-test :  Apache Axis2 SOAP Stack


Full details are available at:
    http://vmgump.apache.org/gump/public/ws-axis2/ws-axis2/index.html

That said, some information snippets are provided here.

The following annotations (debug/informational/warning/error messages) were provided:
 -DEBUG- Sole jar output [ws-axis2-20092010] identifier set to project name
 -INFO- Optional dependency ws-commons-axiom failed with reason build failed
 -DEBUG- (Gump generated) Maven2 Settings in: /srv/gump/public/workspace/ws-axis2/gump_mvn_settings.xml
 -INFO- Failed with reason build failed
 -DEBUG- Maven POM in: /srv/gump/public/workspace/ws-axis2/pom.xml
 -INFO- Failed to extract fallback artifacts from Gump Repository



The following work was performed:
http://vmgump.apache.org/gump/public/ws-axis2/ws-axis2/gump_work/build_ws-axis2_ws-axis2.html
Work Name: build_ws-axis2_ws-axis2 (Type: Build)
Work ended in a state of : Failed
Elapsed: 32 secs
Command Line: mvn --batch-mode -DskipTests=true --settings /srv/gump/public/workspace/ws-axis2/gump_mvn_settings.xml package 
[Working Directory: /srv/gump/public/workspace/ws-axis2]
---------------------------------------------
Downloading: http://localhost:8192/maven2/net/sf/kxml/kxml2/2.2.2/kxml2-2.2.2.jar



Downloading: http://localhost:8192/maven2/org/apache/felix/org.osgi.core/1.0.0/org.osgi.core-1.0.0.jar
[INFO] Unable to find resource 'org.osgi:org.osgi.core:jar:4.1.0' in repository eclipse-repo (http://repo1.maven.org/eclipse)
Downloading: http://download.java.net/maven/1/org.osgi/jars/org.osgi.core-4.1.0.jar
[INFO] Unable to find resource 'org.osgi:org.osgi.core:jar:4.1.0' in repository java.net (http://download.java.net/maven/1)
Downloading: http://localhost:8192/maven2/org/osgi/org.osgi.core/4.1.0/org.osgi.core-4.1.0.jar


Downloading: http://localhost:8192/maven2/org/apache/felix/org.osgi.service.obr/1.0.1/org.osgi.service.obr-1.0.1.jar

[INFO] snapshot org.apache.axis2:axis2-mar-maven-plugin:1.5.2-SNAPSHOT: checking for updates from apache-snapshots
[INFO] snapshot org.apache.axis2:axis2-mar-maven-plugin:1.5.2-SNAPSHOT: checking for updates from apache.snapshots
Downloading: http://people.apache.org/repo/m2-snapshot-repository/org/apache/axis2/axis2-mar-maven-plugin/1.5.2-SNAPSHOT/axis2-mar-maven-plugin-1.5.2-SNAPSHOT.pom
[INFO] Unable to find resource 'org.apache.axis2:axis2-mar-maven-plugin:pom:1.5.2-SNAPSHOT' in repository apache-snapshots (http://people.apache.org/repo/m2-snapshot-repository)
Downloading: http://localhost:8192/repo/m2-snapshot-repository/org/apache/axis2/axis2-mar-maven-plugin/1.5.2-SNAPSHOT/axis2-mar-maven-plugin-1.5.2-SNAPSHOT.pom
[INFO] Unable to find resource 'org.apache.axis2:axis2-mar-maven-plugin:pom:1.5.2-SNAPSHOT' in repository apache.snapshots (http://repository.apache.org/snapshots)
Downloading: http://localhost:8192/repo/m2-snapshot-repository/org/apache/axis2/axis2-mar-maven-plugin/1.5.2-SNAPSHOT/axis2-mar-maven-plugin-1.5.2-SNAPSHOT.pom
[INFO] Unable to find resource 'org.apache.axis2:axis2-mar-maven-plugin:pom:1.5.2-SNAPSHOT' in repository apache.snapshots (http://repository.apache.org/snapshots)
[INFO] ------------------------------------------------------------------------
[ERROR] BUILD ERROR
[INFO] ------------------------------------------------------------------------
[INFO] Error building POM (may not be this project's POM).


Project ID: org.apache.axis2:axis2-mar-maven-plugin

Reason: POM 'org.apache.axis2:axis2-mar-maven-plugin' not found in repository: Unable to download the artifact from any repository

  org.apache.axis2:axis2-mar-maven-plugin:pom:1.5.2-SNAPSHOT

from the specified remote repositories:
  eclipse-repo (http://repo1.maven.org/eclipse),
  gump-central (http://localhost:8192/maven2),
  java.net (http://download.java.net/maven/1),
  apache-snapshots (http://people.apache.org/repo/m2-snapshot-repository),
  gump-apache.snapshots (http://localhost:8192/repo/m2-snapshot-repository)

 for project org.apache.axis2:axis2-mar-maven-plugin


[INFO] ------------------------------------------------------------------------
[INFO] For more information, run Maven with the -e switch
[INFO] ------------------------------------------------------------------------
[INFO] Total time: 31 seconds
[INFO] Finished at: Mon Sep 20 14:31:27 UTC 2010
[INFO] Final Memory: 22M/53M
[INFO] ------------------------------------------------------------------------
---------------------------------------------

To subscribe to this information via syndicated feeds:
- RSS: http://vmgump.apache.org/gump/public/ws-axis2/ws-axis2/rss.xml
- Atom: http://vmgump.apache.org/gump/public/ws-axis2/ws-axis2/atom.xml

============================== Gump Tracking Only ===
Produced by Gump version 2.3.
Gump Run 13000620092010, vmgump.apache.org:vmgump:13000620092010
Gump E-mail Identifier (unique within run) #51.

*********************************************************** G U M P
[GUMP@vmgump]: Project apacheds-server-integ-test (in module apacheds) failed
To whom it may engage...
        
This is an automated request, but not an unsolicited one. For 
more information please visit http://gump.apache.org/nagged.html, 
and/or contact the folk at general@gump.apache.org.

Project apacheds-server-integ-test has an issue affecting its community integration.
This issue affects 1 projects,
 and has been outstanding for 11 runs.
The current state of this project is 'Failed', with reason 'Build Failed'.
For reference only, the following projects are affected by this:
    - apacheds-server-integ-test :  Apache Directory Server


Full details are available at:
    http://vmgump.apache.org/gump/public/apacheds/apacheds-server-integ-test/index.html

That said, some information snippets are provided here.

The following annotations (debug/informational/warning/error messages) were provided:
 -WARNING- Overriding Maven2 settings: [/srv/gump/public/workspace/apacheds/server-integ/gump_mvn_settings.xml]
 -DEBUG- (Gump generated) Maven2 Settings in: /srv/gump/public/workspace/apacheds/server-integ/gump_mvn_settings.xml
 -INFO- Failed with reason build failed
 -DEBUG- Maven POM in: /srv/gump/public/workspace/apacheds/server-integ/pom.xml



The following work was performed:
http://vmgump.apache.org/gump/public/apacheds/apacheds-server-integ-test/gump_work/build_apacheds_apacheds-server-integ-test.html
Work Name: build_apacheds_apacheds-server-integ-test (Type: Build)
Work ended in a state of : Failed
Elapsed: 2 mins 41 secs
Command Line: mvn --batch-mode --settings /srv/gump/public/workspace/apacheds/server-integ/gump_mvn_settings.xml package 
[Working Directory: /srv/gump/public/workspace/apacheds/server-integ]
---------------------------------------------
	at org.junit.runners.ParentRunner$3.run(ParentRunner.java:246)
	at org.junit.runners.ParentRunner$1.schedule(ParentRunner.java:56)
	at org.junit.runners.ParentRunner.runChildren(ParentRunner.java:244)
	at org.junit.runners.ParentRunner.access$000(ParentRunner.java:46)
	at org.junit.runners.ParentRunner$2.evaluate(ParentRunner.java:237)
	at org.junit.runners.ParentRunner.run(ParentRunner.java:289)
	at org.apache.directory.server.core.integ.FrameworkRunner.run(FrameworkRunner.java:237)
	at org.junit.runners.Suite.runChild(Suite.java:128)
	at org.apache.directory.server.core.integ.FrameworkSuite.runChild(FrameworkSuite.java:184)
	at org.apache.directory.server.core.integ.FrameworkSuite.runChild(FrameworkSuite.java:48)
	at org.junit.runners.ParentRunner$3.run(ParentRunner.java:246)
	at org.junit.runners.ParentRunner$1.schedule(ParentRunner.java:56)
	at org.junit.runners.ParentRunner.runChildren(ParentRunner.java:244)
	at org.junit.runners.ParentRunner.access$000(ParentRunner.java:46)
	at org.junit.runners.ParentRunner$2.evaluate(ParentRunner.java:237)
	at org.junit.runners.ParentRunner.run(ParentRunner.java:289)
	at org.apache.directory.server.core.integ.FrameworkSuite.run(FrameworkSuite.java:158)
	at org.apache.maven.surefire.junit4.JUnit4TestSet.execute(JUnit4TestSet.java:59)
	at org.apache.maven.surefire.suite.AbstractDirectoryTestSuite.executeTestSet(AbstractDirectoryTestSuite.java:115)
	at org.apache.maven.surefire.suite.AbstractDirectoryTestSuite.execute(AbstractDirectoryTestSuite.java:102)
	at org.apache.maven.surefire.Surefire.run(Surefire.java:180)
	at sun.reflect.NativeMethodAccessorImpl.invoke0(Native Method)
	at sun.reflect.NativeMethodAccessorImpl.invoke(NativeMethodAccessorImpl.java:57)
	at sun.reflect.DelegatingMethodAccessorImpl.invoke(DelegatingMethodAccessorImpl.java:43)
	at java.lang.reflect.Method.invoke(Method.java:616)
	at org.apache.maven.surefire.booter.SurefireBooter.runSuitesInProcess(SurefireBooter.java:350)
	at org.apache.maven.surefire.booter.SurefireBooter.main(SurefireBooter.java:1021)
Tests run: 295, Failures: 2, Errors: 0, Skipped: 1, Time elapsed: 148.287 sec <<< FAILURE!

Results :

Failed tests: 
  testSaslCramMd5BindBadPassword(org.apache.directory.server.operations.bind.SaslBindIT)
  testSaslDigestMd5BindBadRealm(org.apache.directory.server.operations.bind.SaslBindIT)

Tests run: 295, Failures: 2, Errors: 0, Skipped: 1

[INFO] ------------------------------------------------------------------------
[ERROR] BUILD FAILURE
[INFO] ------------------------------------------------------------------------
[INFO] There are test failures.

Please refer to /srv/gump/public/workspace/apacheds/server-integ/target/surefire-reports for the individual test results.
[INFO] ------------------------------------------------------------------------
[INFO] For more information, run Maven with the -e switch
[INFO] ------------------------------------------------------------------------
[INFO] Total time: 2 minutes 40 seconds
[INFO] Finished at: Mon Sep 20 14:38:37 UTC 2010
[INFO] Final Memory: 48M/115M
[INFO] ------------------------------------------------------------------------
---------------------------------------------

To subscribe to this information via syndicated feeds:
- RSS: http://vmgump.apache.org/gump/public/apacheds/apacheds-server-integ-test/rss.xml
- Atom: http://vmgump.apache.org/gump/public/apacheds/apacheds-server-integ-test/atom.xml

============================== Gump Tracking Only ===
Produced by Gump version 2.3.
Gump Run 13000620092010, vmgump.apache.org:vmgump:13000620092010
Gump E-mail Identifier (unique within run) #52.

*********************************************************** G U M P
[GUMP@vmgump]: Project activemq-jaas (in module activemq) failed
To whom it may engage...
        
This is an automated request, but not an unsolicited one. For 
more information please visit http://gump.apache.org/nagged.html, 
and/or contact the folk at general@gump.apache.org.

Project activemq-jaas has an issue affecting its community integration.
This issue affects 5 projects,
 and has been outstanding for 11 runs.
The current state of this project is 'Failed', with reason 'Build Failed'.
For reference only, the following projects are affected by this:
    - activemq-core :  ActiveMQ :: Core
    - activemq-jaas :  ActiveMQ :: JAAS
    - activemq-jaas-test :  ActiveMQ message broker and enterprise integration patterns ...
    - activemq-pool :  ActiveMQ :: Pool
    - activemq-ra :  ActiveMQ :: RA


Full details are available at:
    http://vmgump.apache.org/gump/public/activemq/activemq-jaas/index.html

That said, some information snippets are provided here.

The following annotations (debug/informational/warning/error messages) were provided:
 -DEBUG- Sole jar output [activemq-jaas-*[0-9T].jar] identifier set to project name
 -INFO- Optional dependency castor prerequisite failed with reason build failed
 -DEBUG- (Gump generated) Maven2 Settings in: /srv/gump/public/workspace/activemq/activemq-jaas/gump_mvn_settings.xml
 -INFO- Failed with reason build failed
 -DEBUG- Maven POM in: /srv/gump/public/workspace/activemq/activemq-jaas/pom.xml
 -INFO- Failed to extract fallback artifacts from Gump Repository



The following work was performed:
http://vmgump.apache.org/gump/public/activemq/activemq-jaas/gump_work/build_activemq_activemq-jaas.html
Work Name: build_activemq_activemq-jaas (Type: Build)
Work ended in a state of : Failed
Elapsed: 32 secs
Command Line: mvn --batch-mode -DskipTests=true --settings /srv/gump/public/workspace/activemq/activemq-jaas/gump_mvn_settings.xml install 
[Working Directory: /srv/gump/public/workspace/activemq/activemq-jaas]
---------------------------------------------
[INFO] [remote-resources:process {execution: default}]
[INFO] [resources:resources {execution: default-resources}]
[INFO] Using 'UTF-8' encoding to copy filtered resources.
[INFO] skip non existing resourceDirectory /srv/gump/public/workspace/activemq/activemq-jaas/src/main/resources
[INFO] Copying 3 resources
[INFO] [compiler:compile {execution: default-compile}]
[INFO] Compiling 11 source files to /srv/gump/public/workspace/activemq/activemq-jaas/target/classes
[INFO] [resources:testResources {execution: default-testResources}]
[INFO] Using 'UTF-8' encoding to copy filtered resources.
[INFO] Copying 4 resources
[INFO] Copying 3 resources
[INFO] [compiler:testCompile {execution: default-testCompile}]
[INFO] Compiling 7 source files to /srv/gump/public/workspace/activemq/activemq-jaas/target/test-classes
[INFO] ------------------------------------------------------------------------
[ERROR] BUILD FAILURE
[INFO] ------------------------------------------------------------------------
[INFO] Compilation failure

/srv/gump/public/workspace/activemq/activemq-jaas/src/test/java/org/apache/activemq/jaas/LDAPLoginModuleTest.java:[39,45] cannot find symbol
symbol  : class Level
location: package org.apache.directory.server.core.integ

/srv/gump/public/workspace/activemq/activemq-jaas/src/test/java/org/apache/activemq/jaas/LDAPLoginModuleTest.java:[40,57] package org.apache.directory.server.core.integ.annotations does not exist

/srv/gump/public/workspace/activemq/activemq-jaas/src/test/java/org/apache/activemq/jaas/LDAPLoginModuleTest.java:[41,57] package org.apache.directory.server.core.integ.annotations does not exist

/srv/gump/public/workspace/activemq/activemq-jaas/src/test/java/org/apache/activemq/jaas/LDAPLoginModuleTest.java:[42,40] cannot find symbol
symbol  : class SiRunner
location: package org.apache.directory.server.integ

/srv/gump/public/workspace/activemq/activemq-jaas/src/test/java/org/apache/activemq/jaas/LDAPLoginModuleTest.java:[49,1] cannot find symbol
symbol: class CleanupLevel
@CleanupLevel ( Level.CLASS )

/srv/gump/public/workspace/activemq/activemq-jaas/src/test/java/org/apache/activemq/jaas/LDAPLoginModuleTest.java:[50,1] cannot find symbol
symbol: class ApplyLdifs
@ApplyLdifs( {

/srv/gump/public/workspace/activemq/activemq-jaas/src/test/java/org/apache/activemq/jaas/LDAPLoginModuleTest.java:[48,11] cannot find symbol
symbol: class SiRunner
@RunWith ( SiRunner.class ) 


[INFO] ------------------------------------------------------------------------
[INFO] For more information, run Maven with the -e switch
[INFO] ------------------------------------------------------------------------
[INFO] Total time: 31 seconds
[INFO] Finished at: Mon Sep 20 14:39:18 UTC 2010
[INFO] Final Memory: 56M/135M
[INFO] ------------------------------------------------------------------------
---------------------------------------------

To subscribe to this information via syndicated feeds:
- RSS: http://vmgump.apache.org/gump/public/activemq/activemq-jaas/rss.xml
- Atom: http://vmgump.apache.org/gump/public/activemq/activemq-jaas/atom.xml

============================== Gump Tracking Only ===
Produced by Gump version 2.3.
Gump Run 13000620092010, vmgump.apache.org:vmgump:13000620092010
Gump E-mail Identifier (unique within run) #53.

*********************************************************** G U M P
[GUMP@vmgump]: Project james-imap (in module james-imap) failed
To whom it may engage...
        
This is an automated request, but not an unsolicited one. For 
more information please visit http://gump.apache.org/nagged.html, 
and/or contact the folk at general@gump.apache.org.

Project james-imap has an issue affecting its community integration.
This issue affects 2 projects,
 and has been outstanding for 22 runs.
The current state of this project is 'Failed', with reason 'Missing Build Outputs'.
For reference only, the following projects are affected by this:
    - james-imap :  A library providing a flexible codec for IMAP, command proce...
    - james-imap-test :  A library providing a flexible codec for IMAP, command proce...


Full details are available at:
    http://vmgump.apache.org/gump/public/james-imap/james-imap/index.html

That said, some information snippets are provided here.

The following annotations (debug/informational/warning/error messages) were provided:
 -INFO- Optional dependency jmock2 prerequisite failed with reason build failed
 -INFO- Optional dependency apache-mime4j-reactor failed with reason build failed
 -INFO- Optional dependency openjpa prerequisite failed with reason build failed
 -DEBUG- (Gump generated) Maven2 Settings in: /srv/gump/public/workspace/james-imap/gump_mvn_settings.xml
 -DEBUG- Maven POM in: /srv/gump/public/workspace/james-imap/pom.xml
 -INFO- Failed with reason missing build outputs
 -ERROR- Missing Output: /srv/gump/public/workspace/james-imap/seda/target/apache-james-imap-seda-*[0-9T].jar
 -ERROR- Missing Output: /srv/gump/public/workspace/james-imap/torque/target/apache-james-imap-torque-*[0-9T].jar
 -ERROR- No such directory (where output is expected) : /srv/gump/public/workspace/james-imap/seda/target
 -ERROR- See Directory Listing Work for Missing Outputs
 -INFO- Failed to extract fallback artifacts from Gump Repository



The following work was performed:
http://vmgump.apache.org/gump/public/james-imap/james-imap/gump_work/build_james-imap_james-imap.html
Work Name: build_james-imap_james-imap (Type: Build)
Work ended in a state of : Success
Elapsed: 2 mins 42 secs
Command Line: mvn --batch-mode -DskipTests=true --settings /srv/gump/public/workspace/james-imap/gump_mvn_settings.xml install 
[Working Directory: /srv/gump/public/workspace/james-imap]
---------------------------------------------
[INFO] Adding existing MANIFEST to archive. Found under: /srv/gump/public/workspace/james-imap/maildir/target/classes/META-INF/MANIFEST.MF
[INFO] [jar:test-jar {execution: default}]
[INFO] Adding existing MANIFEST to archive. Found under: /srv/gump/public/workspace/james-imap/maildir/target/classes/META-INF/MANIFEST.MF
[INFO] Building jar: /srv/gump/public/workspace/james-imap/maildir/target/apache-james-mailbox-maildir-0.2-SNAPSHOT-tests.jar
[INFO] [install:install {execution: default-install}]
[INFO] Installing /srv/gump/public/workspace/james-imap/maildir/target/apache-james-mailbox-maildir-0.2-SNAPSHOT.jar to /srv/gump/public/workspace/mvnlocalrepo/shared/org/apache/james/apache-james-mailbox-maildir/0.2-SNAPSHOT/apache-james-mailbox-maildir-0.2-SNAPSHOT.jar
[INFO] Installing /srv/gump/public/workspace/james-imap/maildir/target/apache-james-mailbox-maildir-0.2-SNAPSHOT-tests.jar to /srv/gump/public/workspace/mvnlocalrepo/shared/org/apache/james/apache-james-mailbox-maildir/0.2-SNAPSHOT/apache-james-mailbox-maildir-0.2-SNAPSHOT-tests.jar
[INFO] ------------------------------------------------------------------------
[INFO] Building Apache JAMES Imap
[INFO]    task-segment: [install]
[INFO] ------------------------------------------------------------------------
[INFO] [remote-resources:process {execution: default}]
[INFO] [bundle:manifest {execution: bundle-manifest}]
[WARNING] Ignoring project type pom - supportedProjectTypes = [jar, bundle]
[INFO] [site:attach-descriptor {execution: default-attach-descriptor}]
[INFO] [jar:jar {execution: default}]
[WARNING] JAR will be empty - no content was marked for inclusion!
[INFO] Building jar: /srv/gump/public/workspace/james-imap/target/apache-james-imap-0.2-SNAPSHOT.jar
[INFO] [jar:test-jar {execution: default}]
[WARNING] JAR will be empty - no content was marked for inclusion!
[INFO] Building jar: /srv/gump/public/workspace/james-imap/target/apache-james-imap-0.2-SNAPSHOT-tests.jar
[INFO] [install:install {execution: default-install}]
[INFO] Installing /srv/gump/public/workspace/james-imap/pom.xml to /srv/gump/public/workspace/mvnlocalrepo/shared/org/apache/james/apache-james-imap/0.2-SNAPSHOT/apache-james-imap-0.2-SNAPSHOT.pom
[INFO] Installing /srv/gump/public/workspace/james-imap/target/apache-james-imap-0.2-SNAPSHOT-tests.jar to /srv/gump/public/workspace/mvnlocalrepo/shared/org/apache/james/apache-james-imap/0.2-SNAPSHOT/apache-james-imap-0.2-SNAPSHOT-tests.jar
[INFO] 
[INFO] 
[INFO] ------------------------------------------------------------------------
[INFO] Reactor Summary:
[INFO] ------------------------------------------------------------------------
[INFO] Apache JAMES Imap Parent pom .......................... SUCCESS [4.607s]
[INFO] Apache JAMES Mailbox Manager Library .................. SUCCESS [20.763s]
[INFO] Apache JAMES IMAP Api ................................. SUCCESS [5.328s]
[INFO] Apache JAMES IMAP Message Library ..................... SUCCESS [9.358s]
[INFO] Apache James Mailbox Store Framework .................. SUCCESS [6.228s]
[INFO] Apache JAMES IMAP Mailbox Processor function .......... SUCCESS [6.598s]
[INFO] Apache JAMES Protocol Tester .......................... SUCCESS [11.886s]
[INFO] Apache James JPA Mailbox Manager ...................... SUCCESS [31.516s]
[INFO] Apache James JCR Mailbox Manager ...................... SUCCESS [36.510s]
[INFO] Apache James In Memory Mailbox Manager ................ SUCCESS [4.157s]
[INFO] Apache JAMES Torque Mailbox Manager ................... SUCCESS [11.352s]
[INFO] Apache James Maildir Mailbox Manager .................. SUCCESS [9.013s]
[INFO] Apache JAMES Imap ..................................... SUCCESS [0.651s]
[INFO] ------------------------------------------------------------------------
[INFO] ------------------------------------------------------------------------
[INFO] BUILD SUCCESSFUL
[INFO] ------------------------------------------------------------------------
[INFO] Total time: 2 minutes 41 seconds
[INFO] Finished at: Mon Sep 20 14:42:02 UTC 2010
[INFO] Final Memory: 151M/362M
[INFO] ------------------------------------------------------------------------
---------------------------------------------

To subscribe to this information via syndicated feeds:
- RSS: http://vmgump.apache.org/gump/public/james-imap/james-imap/rss.xml
- Atom: http://vmgump.apache.org/gump/public/james-imap/james-imap/atom.xml

============================== Gump Tracking Only ===
Produced by Gump version 2.3.
Gump Run 13000620092010, vmgump.apache.org:vmgump:13000620092010
Gump E-mail Identifier (unique within run) #54.

*********************************************************** G U M P
[GUMP@vmgump]: Project james-server (in module james-server) failed
To whom it may engage...
        
This is an automated request, but not an unsolicited one. For 
more information please visit http://gump.apache.org/nagged.html, 
and/or contact the folk at general@gump.apache.org.

Project james-server has an issue affecting its community integration.
This issue affects 2 projects,
 and has been outstanding for 26 runs.
The current state of this project is 'Failed', with reason 'Build Failed'.
For reference only, the following projects are affected by this:
    - james-server :  James Server
    - james-server-test :  James Server


Full details are available at:
    http://vmgump.apache.org/gump/public/james-server/james-server/index.html

That said, some information snippets are provided here.

The following annotations (debug/informational/warning/error messages) were provided:
 -INFO- Optional dependency james-jsieve failed with reason build failed
 -INFO- Optional dependency openjpa prerequisite failed with reason build failed
 -INFO- Optional dependency activemq-pool prerequisite failed with reason build failed
 -INFO- Optional dependency activemq-core prerequisite failed with reason build failed
 -INFO- Optional dependency james-imap failed with reason missing build outputs
 -DEBUG- (Gump generated) Maven2 Settings in: /srv/gump/public/workspace/james-server/gump_mvn_settings.xml
 -INFO- Failed with reason build failed
 -DEBUG- Maven POM in: /srv/gump/public/workspace/james-server/pom.xml
 -DEBUG- Extracted fallback artifacts from Gump Repository



The following work was performed:
http://vmgump.apache.org/gump/public/james-server/james-server/gump_work/build_james-server_james-server.html
Work Name: build_james-server_james-server (Type: Build)
Work ended in a state of : Failed
Elapsed: 2 mins 28 secs
Command Line: mvn --batch-mode -DskipTests=true --settings /srv/gump/public/workspace/james-server/gump_mvn_settings.xml install 
[Working Directory: /srv/gump/public/workspace/james-server]
---------------------------------------------
----------
1) org.apache.james:apache-james-imap-api:jar:0.1-M2-SNAPSHOT

  Try downloading the file manually from the project website.

  Then, install it using the command: 
      mvn install:install-file -DgroupId=org.apache.james -DartifactId=apache-james-imap-api -Dversion=0.1-M2-SNAPSHOT -Dpackaging=jar -Dfile=/path/to/file

  Alternatively, if you host your own repository you can deploy the file there: 
      mvn deploy:deploy-file -DgroupId=org.apache.james -DartifactId=apache-james-imap-api -Dversion=0.1-M2-SNAPSHOT -Dpackaging=jar -Dfile=/path/to/file -Durl=[url] -DrepositoryId=[id]

  Path to dependency: 
  	1) org.apache.james:james-server-imapserver:jar:3.0-SNAPSHOT
  	2) org.apache.james:apache-james-imap-api:jar:0.1-M2-SNAPSHOT

2) org.apache.james:apache-james-imap-message:jar:0.1-M2-SNAPSHOT

  Try downloading the file manually from the project website.

  Then, install it using the command: 
      mvn install:install-file -DgroupId=org.apache.james -DartifactId=apache-james-imap-message -Dversion=0.1-M2-SNAPSHOT -Dpackaging=jar -Dfile=/path/to/file

  Alternatively, if you host your own repository you can deploy the file there: 
      mvn deploy:deploy-file -DgroupId=org.apache.james -DartifactId=apache-james-imap-message -Dversion=0.1-M2-SNAPSHOT -Dpackaging=jar -Dfile=/path/to/file -Durl=[url] -DrepositoryId=[id]

  Path to dependency: 
  	1) org.apache.james:james-server-imapserver:jar:3.0-SNAPSHOT
  	2) org.apache.james:apache-james-imap-message:jar:0.1-M2-SNAPSHOT

----------
2 required artifacts are missing.

for artifact: 
  org.apache.james:james-server-imapserver:jar:3.0-SNAPSHOT

from the specified remote repositories:
  gump-maven2-repository.dev.java.net (http://localhost:8192/maven/2),
  gump-central (http://localhost:8192/maven2),
  repository.jboss.org (http://repository.jboss.org/nexus/content/groups/public/),
  gump-apache.snapshots (http://localhost:8192/repo/m2-snapshot-repository)



[INFO] ------------------------------------------------------------------------
[INFO] For more information, run Maven with the -e switch
[INFO] ------------------------------------------------------------------------
[INFO] Total time: 2 minutes 26 seconds
[INFO] Finished at: Mon Sep 20 14:45:56 UTC 2010
[INFO] Final Memory: 169M/404M
[INFO] ------------------------------------------------------------------------
---------------------------------------------

To subscribe to this information via syndicated feeds:
- RSS: http://vmgump.apache.org/gump/public/james-server/james-server/rss.xml
- Atom: http://vmgump.apache.org/gump/public/james-server/james-server/atom.xml

============================== Gump Tracking Only ===
Produced by Gump version 2.3.
Gump Run 13000620092010, vmgump.apache.org:vmgump:13000620092010
Gump E-mail Identifier (unique within run) #55.


--
Apache Gump
http://gump.apache.org/ [Instance: vmgump]

---------------------------------------------------------------------
To unsubscribe, e-mail: general-unsubscribe@gump.apache.org
For additional commands, e-mail: general-help@gump.apache.org


Mime
View raw message