gump-general mailing list archives

Site index · List index
Message view « Date » · « Thread »
Top « Date » · « Thread »
From g...@vmgump.apache.org
Subject BATCH: All dressed up, with nowhere to go...
Date Tue, 17 Aug 2010 15:53:04 GMT
Dear Gumpmeisters,
            
The following 5 notifys should have been sent

*********************************************************** G U M P
[GUMP@vmgump]: Project ooxml-schemas (in module poi) failed
[GUMP@vmgump]: Project commons-lang-2.x-test (in module commons-lang-2.x) failed
[GUMP@vmgump]: Project ws-commons-xmlschema (in module ws-axis2-commons) failed
[GUMP@vmgump]: Project httpcomponents-client (in module httpcomponents) failed
[GUMP@vmgump]: Project james-protocols (in module james-protocols) failed
*********************************************************** G U M P
[GUMP@vmgump]: Project ooxml-schemas (in module poi) failed
To whom it may engage...
        
This is an automated request, but not an unsolicited one. For 
more information please visit http://gump.apache.org/nagged.html, 
and/or contact the folk at general@gump.apache.org.

Project ooxml-schemas has an issue affecting its community integration.
This issue affects 4 projects.
The current state of this project is 'Failed', with reason 'Build Failed'.
For reference only, the following projects are affected by this:
    - ooxml-schemas :  POI
    - org.apache.poi :  POI
    - poi :  POI
    - poi-ooxml-schemas :  POI


Full details are available at:
    http://vmgump.apache.org/gump/public/poi/ooxml-schemas/index.html

That said, some information snippets are provided here.

The following annotations (debug/informational/warning/error messages) were provided:
 -DEBUG- Sole jar output [ooxml-schemas-[0-9]*[0-9T].jar] identifier set to project name
 -INFO- Failed with reason build failed
 -INFO- Failed to extract fallback artifacts from Gump Repository



The following work was performed:
http://vmgump.apache.org/gump/public/poi/ooxml-schemas/gump_work/build_poi_ooxml-schemas.html
Work Name: build_poi_ooxml-schemas (Type: Build)
Work ended in a state of : Failed
Elapsed: 3 mins 48 secs
Command Line: /usr/lib/jvm/java-6-openjdk/bin/java -Djava.awt.headless=true -Dant.build.clonevm=true
org.apache.tools.ant.Main -Dgump.merge=/srv/gump/public/gump/work/merge.xml -Dbuild.sysclasspath=only
compile-ooxml-xsds 
[Working Directory: /srv/gump/public/workspace/poi]
CLASSPATH: /usr/lib/jvm/java-6-openjdk/lib/tools.jar:/srv/gump/public/workspace/ant/dist/lib/ant.jar:/srv/gump/public/workspace/ant/dist/lib/ant-launcher.jar:/srv/gump/public/workspace/ant/dist/lib/ant-jmf.jar:/srv/gump/public/workspace/ant/dist/lib/ant-junit.jar:/srv/gump/public/workspace/ant/dist/lib/ant-swing.jar:/srv/gump/public/workspace/ant/dist/lib/ant-apache-resolver.jar:/srv/gump/public/workspace/ant/dist/lib/ant-apache-xalan2.jar:/srv/gump/packages/junit3.8.1/junit.jar:/srv/gump/public/workspace/xml-commons/java/build/resolver.jar:/srv/gump/public/workspace/poi/ooxml-lib/geronimo-stax-api_1.0_spec-1.0.jar:/srv/gump/public/workspace/poi/ooxml-lib/xmlbeans-2.3.0.jar
---------------------------------------------
Buildfile: /srv/gump/public/workspace/poi/build.xml

check-jars:

fetch-jars:

testexist:

downloadfile:
      [get] Getting: http://repo1.maven.org/maven2/commons-logging/commons-logging/1.1/commons-logging-1.1.jar
      [get] To: /srv/gump/public/workspace/poi/lib/commons-logging-1.1.jar

testexist:

downloadfile:
      [get] Getting: http://repo1.maven.org/maven2/log4j/log4j/1.2.13/log4j-1.2.13.jar
      [get] To: /srv/gump/public/workspace/poi/lib/log4j-1.2.13.jar

testexist:

downloadfile:
      [get] Getting: http://repo1.maven.org/maven2/junit/junit/3.8.1/junit-3.8.1.jar
      [get] To: /srv/gump/public/workspace/poi/lib/junit-3.8.1.jar

check-ooxml-xsds:

fetch-ooxml-xsds:
      [get] Getting: http://www.ecma-international.org/publications/files/ECMA-ST/Office%20Open%20XML%201st%20edition%20Part%204%20(PDF).zip
      [get] To: /srv/gump/public/workspace/poi/ooxml-lib/OfficeOpenXML-Part4.zip
    [unzip] Expanding: /srv/gump/public/workspace/poi/ooxml-lib/OfficeOpenXML-Part4.zip into
/srv/gump/public/workspace/poi/ooxml-lib

check-compiled-ooxml-xsds:

compile-ooxml-xsds:
    [mkdir] Created dir: /srv/gump/public/workspace/poi/build/ooxml-xsds
    [unzip] Expanding: /srv/gump/public/workspace/poi/ooxml-lib/OfficeOpenXML-XMLSchema.zip
into /srv/gump/public/workspace/poi/build/ooxml-xsds
  [xmlbean] Time to build schema type system: 11.61 seconds
  [xmlbean] Time to generate code: 28.44 seconds
  [xmlbean] Compiling 4382 source files to /tmp/xbean7694812490825905143.d/classes
Killed
---------------------------------------------

To subscribe to this information via syndicated feeds:
- RSS: http://vmgump.apache.org/gump/public/poi/ooxml-schemas/rss.xml
- Atom: http://vmgump.apache.org/gump/public/poi/ooxml-schemas/atom.xml

============================== Gump Tracking Only ===
Produced by Gump version 2.3.
Gump Run 13001217082010, vmgump.apache.org:vmgump:13001217082010
Gump E-mail Identifier (unique within run) #1.

*********************************************************** G U M P
[GUMP@vmgump]: Project commons-lang-2.x-test (in module commons-lang-2.x) failed
To whom it may engage...
        
This is an automated request, but not an unsolicited one. For 
more information please visit http://gump.apache.org/nagged.html, 
and/or contact the folk at general@gump.apache.org.

Project commons-lang-2.x-test has an issue affecting its community integration.
This issue affects 1 projects.
The current state of this project is 'Failed', with reason 'Build Failed'.
For reference only, the following projects are affected by this:
    - commons-lang-2.x-test :  Apache Commons Lang 2.x


Full details are available at:
    http://vmgump.apache.org/gump/public/commons-lang-2.x/commons-lang-2.x-test/index.html

That said, some information snippets are provided here.

The following annotations (debug/informational/warning/error messages) were provided:
 -INFO- Optional dependency velocity-engine prerequisite failed with reason build failed
 -INFO- Optional dependency commons-collections failed with reason build failed
 -WARNING- Overriding Maven2 settings: [/srv/gump/public/workspace/commons-lang-2.x/gump_mvn_settings.xml]
 -DEBUG- (Gump generated) Maven2 Settings in: /srv/gump/public/workspace/commons-lang-2.x/gump_mvn_settings.xml
 -INFO- Failed with reason build failed
 -DEBUG- Maven POM in: /srv/gump/public/workspace/commons-lang-2.x/pom.xml



The following work was performed:
http://vmgump.apache.org/gump/public/commons-lang-2.x/commons-lang-2.x-test/gump_work/build_commons-lang-2.x_commons-lang-2.x-test.html
Work Name: build_commons-lang-2.x_commons-lang-2.x-test (Type: Build)
Work ended in a state of : Failed
Elapsed: 1 sec
Command Line: mvn --batch-mode --settings /srv/gump/public/workspace/commons-lang-2.x/gump_mvn_settings.xml
package 
[Working Directory: /srv/gump/public/workspace/commons-lang-2.x]
---------------------------------------------
	at org.apache.maven.cli.compat.CompatibleMain.main(CompatibleMain.java:60)
	at sun.reflect.NativeMethodAccessorImpl.invoke0(Native Method)
	at sun.reflect.NativeMethodAccessorImpl.invoke(NativeMethodAccessorImpl.java:57)
	at sun.reflect.DelegatingMethodAccessorImpl.invoke(DelegatingMethodAccessorImpl.java:43)
	at java.lang.reflect.Method.invoke(Method.java:616)
	at org.codehaus.classworlds.Launcher.launchEnhanced(Launcher.java:315)
	at org.codehaus.classworlds.Launcher.launch(Launcher.java:255)
	at org.codehaus.classworlds.Launcher.mainWithExitCode(Launcher.java:430)
	at org.codehaus.classworlds.Launcher.main(Launcher.java:375)
Caused by: org.apache.maven.project.ProjectBuildingException: Cannot find parent: org.apache.commons:commons-parent
for project: commons-lang:commons-lang:jar:2.6-SNAPSHOT for project commons-lang:commons-lang:jar:2.6-SNAPSHOT
	at org.apache.maven.project.DefaultMavenProjectBuilder.assembleLineage(DefaultMavenProjectBuilder.java:1396)
	at org.apache.maven.project.DefaultMavenProjectBuilder.buildInternal(DefaultMavenProjectBuilder.java:823)
	at org.apache.maven.project.DefaultMavenProjectBuilder.buildFromSourceFileInternal(DefaultMavenProjectBuilder.java:508)
	at org.apache.maven.project.DefaultMavenProjectBuilder.build(DefaultMavenProjectBuilder.java:200)
	at org.apache.maven.DefaultMaven.getProject(DefaultMaven.java:604)
	at org.apache.maven.DefaultMaven.collectProjects(DefaultMaven.java:487)
	at org.apache.maven.DefaultMaven.getProjects(DefaultMaven.java:391)
	... 12 more
Caused by: org.apache.maven.project.ProjectBuildingException: POM 'org.apache.commons:commons-parent'
not found in repository: Unable to download the artifact from any repository

  org.apache.commons:commons-parent:pom:15

from the specified remote repositories:
  gump-central (http://localhost:8192/maven2)

 for project org.apache.commons:commons-parent
	at org.apache.maven.project.DefaultMavenProjectBuilder.findModelFromRepository(DefaultMavenProjectBuilder.java:605)
	at org.apache.maven.project.DefaultMavenProjectBuilder.assembleLineage(DefaultMavenProjectBuilder.java:1392)
	... 18 more
Caused by: org.apache.maven.artifact.resolver.ArtifactNotFoundException: Unable to download
the artifact from any repository

  org.apache.commons:commons-parent:pom:15

from the specified remote repositories:
  gump-central (http://localhost:8192/maven2)


	at org.apache.maven.artifact.resolver.DefaultArtifactResolver.resolve(DefaultArtifactResolver.java:228)
	at org.apache.maven.artifact.resolver.DefaultArtifactResolver.resolve(DefaultArtifactResolver.java:90)
	at org.apache.maven.project.DefaultMavenProjectBuilder.findModelFromRepository(DefaultMavenProjectBuilder.java:558)
	... 19 more
Caused by: org.apache.maven.wagon.ResourceDoesNotExistException: Unable to download the artifact
from any repository
	at org.apache.maven.artifact.manager.DefaultWagonManager.getArtifact(DefaultWagonManager.java:404)
	at org.apache.maven.artifact.resolver.DefaultArtifactResolver.resolve(DefaultArtifactResolver.java:216)
	... 21 more
[INFO] ------------------------------------------------------------------------
[INFO] Total time: < 1 second
[INFO] Finished at: Tue Aug 17 14:13:42 UTC 2010
[INFO] Final Memory: 2M/15M
[INFO] ------------------------------------------------------------------------
---------------------------------------------

To subscribe to this information via syndicated feeds:
- RSS: http://vmgump.apache.org/gump/public/commons-lang-2.x/commons-lang-2.x-test/rss.xml
- Atom: http://vmgump.apache.org/gump/public/commons-lang-2.x/commons-lang-2.x-test/atom.xml

============================== Gump Tracking Only ===
Produced by Gump version 2.3.
Gump Run 13001217082010, vmgump.apache.org:vmgump:13001217082010
Gump E-mail Identifier (unique within run) #3.

*********************************************************** G U M P
[GUMP@vmgump]: Project ws-commons-xmlschema (in module ws-axis2-commons) failed
To whom it may engage...
        
This is an automated request, but not an unsolicited one. For 
more information please visit http://gump.apache.org/nagged.html, 
and/or contact the folk at general@gump.apache.org.

Project ws-commons-xmlschema has an issue affecting its community integration.
This issue affects 1 projects.
The current state of this project is 'Failed', with reason 'Build Failed'.
For reference only, the following projects are affected by this:
    - ws-commons-xmlschema :  Common stuff for the WS projects.


Full details are available at:
    http://vmgump.apache.org/gump/public/ws-axis2-commons/ws-commons-xmlschema/index.html

That said, some information snippets are provided here.

The following annotations (debug/informational/warning/error messages) were provided:
 -INFO- Optional dependency xmlunit prerequisite failed with reason build failed
 -INFO- Optional dependency xmlunit prerequisite failed with reason build failed
 -INFO- Optional dependency checkstyle prerequisite failed with reason build failed
 -INFO- Optional dependency velocity-engine prerequisite failed with reason build failed
 -INFO- Optional dependency commons-validator prerequisite failed with reason build failed
 -INFO- Optional dependency commons-beanutils prerequisite failed with reason build failed
 -INFO- Optional dependency commons-collections failed with reason build failed
 -INFO- Optional dependency commons-logging prerequisite failed with reason build failed
 -INFO- Optional dependency doxia-site-renderer failed with reason build failed
 -DEBUG- (Gump generated) Maven2 Settings in: /srv/gump/public/workspace/ws-axis2-commons/XmlSchema/gump_mvn_settings.xml
 -INFO- Failed with reason build failed
 -DEBUG- Maven POM in: /srv/gump/public/workspace/ws-axis2-commons/XmlSchema/pom.xml
 -DEBUG- Extracted fallback artifacts from Gump Repository



The following work was performed:
http://vmgump.apache.org/gump/public/ws-axis2-commons/ws-commons-xmlschema/gump_work/build_ws-axis2-commons_ws-commons-xmlschema.html
Work Name: build_ws-axis2-commons_ws-commons-xmlschema (Type: Build)
Work ended in a state of : Failed
Elapsed: 1 sec
Command Line: mvn --batch-mode --settings /srv/gump/public/workspace/ws-axis2-commons/XmlSchema/gump_mvn_settings.xml
install 
[Working Directory: /srv/gump/public/workspace/ws-axis2-commons/XmlSchema]
---------------------------------------------
[INFO] Scanning for projects...
Downloading: http://localhost:8192/maven2/org/apache/felix/maven-bundle-plugin/2.0.0/maven-bundle-plugin-2.0.0.pom
[WARNING] Unable to get resource 'org.apache.felix:maven-bundle-plugin:pom:2.0.0' from repository
central (http://repo1.maven.org/maven2): Error transferring file: Connection refused
Downloading: http://localhost:8192/maven2/org/apache/felix/maven-bundle-plugin/2.0.0/maven-bundle-plugin-2.0.0.pom
[WARNING] Unable to get resource 'org.apache.felix:maven-bundle-plugin:pom:2.0.0' from repository
central (http://repo1.maven.org/maven2): Error transferring file: Connection refused
[INFO] ------------------------------------------------------------------------
[ERROR] BUILD ERROR
[INFO] ------------------------------------------------------------------------
[INFO] Error building POM (may not be this project's POM).


Project ID: org.apache.felix:maven-bundle-plugin

Reason: POM 'org.apache.felix:maven-bundle-plugin' not found in repository: Unable to download
the artifact from any repository

  org.apache.felix:maven-bundle-plugin:pom:2.0.0

from the specified remote repositories:
  snapshot-apache (http://people.apache.org/repo/m2-snapshot-repository),
  snapshot (http://snapshots.maven.codehaus.org/maven2/),
  gump-central (http://localhost:8192/maven2)

 for project org.apache.felix:maven-bundle-plugin


[INFO] ------------------------------------------------------------------------
[INFO] For more information, run Maven with the -e switch
[INFO] ------------------------------------------------------------------------
[INFO] Total time: < 1 second
[INFO] Finished at: Tue Aug 17 14:41:01 UTC 2010
[INFO] Final Memory: 2M/15M
[INFO] ------------------------------------------------------------------------
---------------------------------------------

To subscribe to this information via syndicated feeds:
- RSS: http://vmgump.apache.org/gump/public/ws-axis2-commons/ws-commons-xmlschema/rss.xml
- Atom: http://vmgump.apache.org/gump/public/ws-axis2-commons/ws-commons-xmlschema/atom.xml

============================== Gump Tracking Only ===
Produced by Gump version 2.3.
Gump Run 13001217082010, vmgump.apache.org:vmgump:13001217082010
Gump E-mail Identifier (unique within run) #6.

*********************************************************** G U M P
[GUMP@vmgump]: Project httpcomponents-client (in module httpcomponents) failed
To whom it may engage...
        
This is an automated request, but not an unsolicited one. For 
more information please visit http://gump.apache.org/nagged.html, 
and/or contact the folk at general@gump.apache.org.

Project httpcomponents-client has an issue affecting its community integration.
This issue affects 1 projects.
The current state of this project is 'Failed', with reason 'Build Failed'.
For reference only, the following projects are affected by this:
    - httpcomponents-client :  HttpComponents Client


Full details are available at:
    http://vmgump.apache.org/gump/public/httpcomponents/httpcomponents-client/index.html

That said, some information snippets are provided here.

The following annotations (debug/informational/warning/error messages) were provided:
 -INFO- Optional dependency commons-logging prerequisite failed with reason build failed
 -INFO- Optional dependency httpcomponents-core failed with reason build failed
 -DEBUG- (Gump generated) Maven2 Settings in: /srv/gump/public/workspace/httpcomponents/httpclient/gump_mvn_settings.xml
 -INFO- Failed with reason build failed
 -DEBUG- Maven POM in: /srv/gump/public/workspace/httpcomponents/httpclient/pom.xml
 -INFO- Project Reports in: /srv/gump/public/workspace/httpcomponents/httpclient/target/surefire-reports
 -WARNING- No directory [/srv/gump/public/workspace/httpcomponents/httpclient/target/surefire-reports]
 -DEBUG- Extracted fallback artifacts from Gump Repository



The following work was performed:
http://vmgump.apache.org/gump/public/httpcomponents/httpcomponents-client/gump_work/build_httpcomponents_httpcomponents-client.html
Work Name: build_httpcomponents_httpcomponents-client (Type: Build)
Work ended in a state of : Failed
Elapsed: 1 sec
Command Line: mvn --batch-mode -Dmaven.test.skip.exec=true --settings /srv/gump/public/workspace/httpcomponents/httpclient/gump_mvn_settings.xml
package 
[Working Directory: /srv/gump/public/workspace/httpcomponents/httpclient]
---------------------------------------------
	at org.apache.maven.cli.compat.CompatibleMain.main(CompatibleMain.java:60)
	at sun.reflect.NativeMethodAccessorImpl.invoke0(Native Method)
	at sun.reflect.NativeMethodAccessorImpl.invoke(NativeMethodAccessorImpl.java:57)
	at sun.reflect.DelegatingMethodAccessorImpl.invoke(DelegatingMethodAccessorImpl.java:43)
	at java.lang.reflect.Method.invoke(Method.java:616)
	at org.codehaus.classworlds.Launcher.launchEnhanced(Launcher.java:315)
	at org.codehaus.classworlds.Launcher.launch(Launcher.java:255)
	at org.codehaus.classworlds.Launcher.mainWithExitCode(Launcher.java:430)
	at org.codehaus.classworlds.Launcher.main(Launcher.java:375)
Caused by: org.apache.maven.project.ProjectBuildingException: Cannot find parent: org.apache.httpcomponents:project
for project: org.apache.httpcomponents:httpcomponents-client:pom:4.1-alpha3-SNAPSHOT for project
org.apache.httpcomponents:httpcomponents-client:pom:4.1-alpha3-SNAPSHOT
	at org.apache.maven.project.DefaultMavenProjectBuilder.assembleLineage(DefaultMavenProjectBuilder.java:1396)
	at org.apache.maven.project.DefaultMavenProjectBuilder.buildInternal(DefaultMavenProjectBuilder.java:823)
	at org.apache.maven.project.DefaultMavenProjectBuilder.buildFromSourceFileInternal(DefaultMavenProjectBuilder.java:508)
	at org.apache.maven.project.DefaultMavenProjectBuilder.build(DefaultMavenProjectBuilder.java:200)
	at org.apache.maven.DefaultMaven.getProject(DefaultMaven.java:604)
	at org.apache.maven.DefaultMaven.collectProjects(DefaultMaven.java:487)
	at org.apache.maven.DefaultMaven.getProjects(DefaultMaven.java:391)
	... 12 more
Caused by: org.apache.maven.project.ProjectBuildingException: POM 'org.apache.httpcomponents:project'
not found in repository: Unable to download the artifact from any repository

  org.apache.httpcomponents:project:pom:4.1

from the specified remote repositories:
  gump-central (http://localhost:8192/maven2)

 for project org.apache.httpcomponents:project
	at org.apache.maven.project.DefaultMavenProjectBuilder.findModelFromRepository(DefaultMavenProjectBuilder.java:605)
	at org.apache.maven.project.DefaultMavenProjectBuilder.assembleLineage(DefaultMavenProjectBuilder.java:1392)
	... 18 more
Caused by: org.apache.maven.artifact.resolver.ArtifactNotFoundException: Unable to download
the artifact from any repository

  org.apache.httpcomponents:project:pom:4.1

from the specified remote repositories:
  gump-central (http://localhost:8192/maven2)


	at org.apache.maven.artifact.resolver.DefaultArtifactResolver.resolve(DefaultArtifactResolver.java:228)
	at org.apache.maven.artifact.resolver.DefaultArtifactResolver.resolve(DefaultArtifactResolver.java:90)
	at org.apache.maven.project.DefaultMavenProjectBuilder.findModelFromRepository(DefaultMavenProjectBuilder.java:558)
	... 19 more
Caused by: org.apache.maven.wagon.ResourceDoesNotExistException: Unable to download the artifact
from any repository
	at org.apache.maven.artifact.manager.DefaultWagonManager.getArtifact(DefaultWagonManager.java:404)
	at org.apache.maven.artifact.resolver.DefaultArtifactResolver.resolve(DefaultArtifactResolver.java:216)
	... 21 more
[INFO] ------------------------------------------------------------------------
[INFO] Total time: < 1 second
[INFO] Finished at: Tue Aug 17 14:42:38 UTC 2010
[INFO] Final Memory: 2M/15M
[INFO] ------------------------------------------------------------------------
---------------------------------------------

To subscribe to this information via syndicated feeds:
- RSS: http://vmgump.apache.org/gump/public/httpcomponents/httpcomponents-client/rss.xml
- Atom: http://vmgump.apache.org/gump/public/httpcomponents/httpcomponents-client/atom.xml

============================== Gump Tracking Only ===
Produced by Gump version 2.3.
Gump Run 13001217082010, vmgump.apache.org:vmgump:13001217082010
Gump E-mail Identifier (unique within run) #7.

*********************************************************** G U M P
[GUMP@vmgump]: Project james-protocols (in module james-protocols) failed
To whom it may engage...
        
This is an automated request, but not an unsolicited one. For 
more information please visit http://gump.apache.org/nagged.html, 
and/or contact the folk at general@gump.apache.org.

Project james-protocols has an issue affecting its community integration.
This issue affects 1 projects.
The current state of this project is 'Failed', with reason 'Build Failed'.
For reference only, the following projects are affected by this:
    - james-protocols :  Apache James Protocols


Full details are available at:
    http://vmgump.apache.org/gump/public/james-protocols/james-protocols/index.html

That said, some information snippets are provided here.

The following annotations (debug/informational/warning/error messages) were provided:
 -INFO- Optional dependency velocity-engine prerequisite failed with reason build failed
 -INFO- Optional dependency commons-collections failed with reason build failed
 -INFO- Optional dependency commons-logging prerequisite failed with reason build failed
 -INFO- Optional dependency apache-mailet failed with reason build failed
 -INFO- Optional dependency apache-mailet-base failed with reason build failed
 -INFO- Optional dependency commons-configuration prerequisite failed with reason build failed
 -DEBUG- (Gump generated) Maven2 Settings in: /srv/gump/public/workspace/james-protocols/gump_mvn_settings.xml
 -INFO- Failed with reason build failed
 -DEBUG- Maven POM in: /srv/gump/public/workspace/james-protocols/pom.xml
 -DEBUG- Extracted fallback artifacts from Gump Repository



The following work was performed:
http://vmgump.apache.org/gump/public/james-protocols/james-protocols/gump_work/build_james-protocols_james-protocols.html
Work Name: build_james-protocols_james-protocols (Type: Build)
Work ended in a state of : Failed
Elapsed: 12 secs
Command Line: mvn --batch-mode --settings /srv/gump/public/workspace/james-protocols/gump_mvn_settings.xml
package 
[Working Directory: /srv/gump/public/workspace/james-protocols]
---------------------------------------------
	at java.lang.reflect.Method.invoke(Method.java:616)
	at org.codehaus.classworlds.Launcher.launchEnhanced(Launcher.java:315)
	at org.codehaus.classworlds.Launcher.launch(Launcher.java:255)
	at org.codehaus.classworlds.Launcher.mainWithExitCode(Launcher.java:430)
	at org.codehaus.classworlds.Launcher.main(Launcher.java:375)
Caused by: org.apache.maven.project.ProjectBuildingException: Cannot find parent: org.apache.james:james-server-root
for project: org.apache.james:protocols:pom:1.2-SNAPSHOT for project org.apache.james:protocols:pom:1.2-SNAPSHOT
	at org.apache.maven.project.DefaultMavenProjectBuilder.assembleLineage(DefaultMavenProjectBuilder.java:1396)
	at org.apache.maven.project.DefaultMavenProjectBuilder.buildInternal(DefaultMavenProjectBuilder.java:823)
	at org.apache.maven.project.DefaultMavenProjectBuilder.buildFromSourceFileInternal(DefaultMavenProjectBuilder.java:508)
	at org.apache.maven.project.DefaultMavenProjectBuilder.build(DefaultMavenProjectBuilder.java:200)
	at org.apache.maven.DefaultMaven.getProject(DefaultMaven.java:604)
	at org.apache.maven.DefaultMaven.collectProjects(DefaultMaven.java:487)
	at org.apache.maven.DefaultMaven.getProjects(DefaultMaven.java:391)
	... 12 more
Caused by: org.apache.maven.project.ProjectBuildingException: POM 'org.apache.james:james-server-root'
not found in repository: Unable to download the artifact from any repository

  org.apache.james:james-server-root:pom:1.5

from the specified remote repositories:
  gump-maven2-repository.dev.java.net (http://localhost:8192/maven/2),
  gump-central (http://localhost:8192/maven2),
  repository.jboss.org (http://repository.jboss.org/nexus/content/groups/public/)

 for project org.apache.james:james-server-root
	at org.apache.maven.project.DefaultMavenProjectBuilder.findModelFromRepository(DefaultMavenProjectBuilder.java:605)
	at org.apache.maven.project.DefaultMavenProjectBuilder.assembleLineage(DefaultMavenProjectBuilder.java:1392)
	... 18 more
Caused by: org.apache.maven.artifact.resolver.ArtifactNotFoundException: Unable to download
the artifact from any repository

  org.apache.james:james-server-root:pom:1.5

from the specified remote repositories:
  gump-maven2-repository.dev.java.net (http://localhost:8192/maven/2),
  gump-central (http://localhost:8192/maven2),
  repository.jboss.org (http://repository.jboss.org/nexus/content/groups/public/)


	at org.apache.maven.artifact.resolver.DefaultArtifactResolver.resolve(DefaultArtifactResolver.java:228)
	at org.apache.maven.artifact.resolver.DefaultArtifactResolver.resolve(DefaultArtifactResolver.java:90)
	at org.apache.maven.project.DefaultMavenProjectBuilder.findModelFromRepository(DefaultMavenProjectBuilder.java:558)
	... 19 more
Caused by: org.apache.maven.wagon.ResourceDoesNotExistException: Unable to download the artifact
from any repository
	at org.apache.maven.artifact.manager.DefaultWagonManager.getArtifact(DefaultWagonManager.java:404)
	at org.apache.maven.artifact.resolver.DefaultArtifactResolver.resolve(DefaultArtifactResolver.java:216)
	... 21 more
[INFO] ------------------------------------------------------------------------
[INFO] Total time: 11 seconds
[INFO] Finished at: Tue Aug 17 14:45:50 UTC 2010
[INFO] Final Memory: 2M/15M
[INFO] ------------------------------------------------------------------------
---------------------------------------------

To subscribe to this information via syndicated feeds:
- RSS: http://vmgump.apache.org/gump/public/james-protocols/james-protocols/rss.xml
- Atom: http://vmgump.apache.org/gump/public/james-protocols/james-protocols/atom.xml

============================== Gump Tracking Only ===
Produced by Gump version 2.3.
Gump Run 13001217082010, vmgump.apache.org:vmgump:13001217082010
Gump E-mail Identifier (unique within run) #8.


--
Apache Gump
http://gump.apache.org/ [Instance: vmgump]

---------------------------------------------------------------------
To unsubscribe, e-mail: general-unsubscribe@gump.apache.org
For additional commands, e-mail: general-help@gump.apache.org


Mime
View raw message