gump-general mailing list archives

Site index · List index
Message view « Date » · « Thread »
Top « Date » · « Thread »
From g...@vmgump.apache.org
Subject BATCH: All dressed up, with nowhere to go...
Date Tue, 17 Aug 2010 10:58:56 GMT
Dear Gumpmeisters,
            
The following 32 notifys should have been sent

*********************************************************** G U M P
[GUMP@vmgump]: Project commons-lang (in module commons-lang-2.x) failed
[GUMP@vmgump]: Project expat-configure (in module expat) failed
[GUMP@vmgump]: Project gsbase (in module gsbase) failed
[GUMP@vmgump]: Project gsbase-test (in module gsbase) failed
[GUMP@vmgump]: Project emma (in module emma) failed
[GUMP@vmgump]: Project ooxml-schemas (in module poi) failed
[GUMP@vmgump]: Project jmock2 (in module jmock2) failed
[GUMP@vmgump]: Project derby (in module db-derby) failed
[GUMP@vmgump]: Project lucene-java-contrib (in module lucene-java) failed
[GUMP@vmgump]: Project xml-security-tests (in module xml-security) failed
[GUMP@vmgump]: Project apache-jsieve (in module james-jsieve) failed
[GUMP@vmgump]: Project commons-jci (in module apache-commons) success, but with warnings.
[GUMP@vmgump]: Project apache-mime4j-reactor (in module james-mime4j) failed
[GUMP@vmgump]: Project commons-jci-reactor (in module apache-commons) failed
[GUMP@vmgump]: Project castor-xml-test (in module castor) failed
[GUMP@vmgump]: Project james-jsieve (in module james-jsieve) failed
[GUMP@vmgump]: Project castor-test (in module castor) failed
[GUMP@vmgump]: Project camel-spring-test (in module camel) failed
[GUMP@vmgump]: Project htmlunit (in module htmlunit) failed
[GUMP@vmgump]: Project james-imap-test (in module james-imap) failed
[GUMP@vmgump]: Project tapestry (in module tapestry) failed
[GUMP@vmgump]: Project uddi4j (in module uddi4j) failed
[GUMP@vmgump]: Project cocoon22-reactor (in module cocoon) failed
[GUMP@vmgump]: Project ws-commons-axiom (in module ws-axis2-commons) failed
[GUMP@vmgump]: Project lenya (in module lenya) failed
[GUMP@vmgump]: Project ws-axis2 (in module ws-axis2) failed
[GUMP@vmgump]: Project portals-pluto-trunk-test (in module portals-pluto-trunk) failed
[GUMP@vmgump]: Project portals-bridges-script-test (in module portals-bridges) failed
[GUMP@vmgump]: Project apacheds-core-integ-test (in module apacheds) failed
[GUMP@vmgump]: Project apacheds-server-integ-test (in module apacheds) failed
[GUMP@vmgump]: Project activemq-jaas (in module activemq) failed
[GUMP@vmgump]: Project james-server (in module james-server) failed
*********************************************************** G U M P
[GUMP@vmgump]: Project commons-lang (in module commons-lang-2.x) failed
To whom it may engage...
        
This is an automated request, but not an unsolicited one. For 
more information please visit http://gump.apache.org/nagged.html, 
and/or contact the folk at general@gump.apache.org.

Project commons-lang has an issue affecting its community integration.
This issue affects 172 projects,
 and has been outstanding for 19 runs.
The current state of this project is 'Failed', with reason 'Build Failed'.
For reference only, the following projects are affected by this:
    - anakia :  Essentially an XML transformation tool, Anakia uses JDOM and...
    - ant-embed-optional :  Historical Embed Proposal for Ant
    - avalon-framework_avalon-framework-impl :  Repository of reusable components.
    - bootstrap-excalibur-pool-impl :  Repository of reusable components.
    - checkstyle :  Java style checker
    - commons-dbcp :  Database Connection Pool
    - commons-id :  Commons Identifier Package
    - commons-jelly :  Commons Jelly
    - commons-jelly-tags-ant :  Commons Jelly
    - commons-jelly-tags-ant-test :  Commons Jelly
    - commons-jelly-tags-antlr :  Commons Jelly
    - commons-jelly-tags-avalon :  Commons Jelly
    - commons-jelly-tags-bean :  Commons Jelly
    - commons-jelly-tags-beanshell :  Commons Jelly
    - commons-jelly-tags-betwixt :  Commons Jelly
    - commons-jelly-tags-bsf :  Commons Jelly
    - commons-jelly-tags-define :  Commons Jelly
    - commons-jelly-tags-define-test :  Commons Jelly
    - commons-jelly-tags-dynabean :  Commons Jelly
    - commons-jelly-tags-email :  Commons Jelly
    - commons-jelly-tags-fmt :  Commons Jelly
    - commons-jelly-tags-fmt-test :  Commons Jelly
    - commons-jelly-tags-html :  Commons Jelly
    - commons-jelly-tags-http :  Commons Jelly
    - commons-jelly-tags-interaction :  Commons Jelly
    - commons-jelly-tags-jaxme :  Commons Jelly
    - commons-jelly-tags-jface :  Commons Jelly
    - commons-jelly-tags-jms :  Commons Jelly
    - commons-jelly-tags-jmx :  Commons Jelly
    - commons-jelly-tags-jsl :  Commons Jelly
    - commons-jelly-tags-jsl-test :  Commons Jelly
    - commons-jelly-tags-junit :  Commons Jelly
    - commons-jelly-tags-log :  Commons Jelly
    - commons-jelly-tags-memory :  Commons Jelly
    - commons-jelly-tags-quartz :  Commons Jelly
    - commons-jelly-tags-regexp :  Commons Jelly
    - commons-jelly-tags-soap :  Commons Jelly
    - commons-jelly-tags-sql :  Commons Jelly
    - commons-jelly-tags-swing :  Commons Jelly
    - commons-jelly-tags-swt :  Commons Jelly
    - commons-jelly-tags-threads :  Commons Jelly
    - commons-jelly-tags-util :  Commons Jelly
    - commons-jelly-tags-validate :  Commons Jelly
    - commons-jelly-tags-velocity :  Commons Jelly
    - commons-jelly-tags-xml :  Commons Jelly
    - commons-jelly-tags-xml-test :  Commons Jelly
    - commons-jelly-tags-xmlunit :  Commons Jelly
    - commons-jelly-test :  Commons Jelly
    - commons-jxpath :  XPath traversal of JavaBeans
    - commons-lang :  utilities for the classes that are in java.lang's hierarchy
    - commons-lang-2.x-test :  Apache Commons Lang 2.x
    - db-ddlutils :  Easy-to-use component for working with Database Definition (...
    - db-torque-generator :  Persistence Layer
    - db-torque-templates :  Persistence Layer
    - excalibur-component :  Repository of reusable components.
    - excalibur-cornerstone-connection-api :  Repository of reusable components.
    - excalibur-cornerstone-connection-impl :  Repository of reusable components.
    - excalibur-cornerstone-datasources-impl :  Repository of reusable components.
    - excalibur-cornerstone-scheduler-impl :  Repository of reusable components.
    - excalibur-cornerstone-sockets-impl :  Repository of reusable components.
    - excalibur-cornerstone-store-impl :  Repository of reusable components.
    - excalibur-cornerstone-threads-api :  Repository of reusable components.
    - excalibur-cornerstone-threads-impl :  Repository of reusable components.
    - excalibur-datasource :  Repository of reusable components.
    - excalibur-event :  Repository of reusable components.
    - excalibur-event-api :  Repository of reusable components.
    - excalibur-event-impl :  Repository of reusable components.
    - excalibur-fortress-bean :  Repository of reusable components.
    - excalibur-fortress-container-api :  Repository of reusable components.
    - excalibur-fortress-container-impl :  Repository of reusable components.
    - excalibur-fortress-container-test :  Repository of reusable components.
    - excalibur-fortress-examples :  Repository of reusable components.
    - excalibur-fortress-meta :  Repository of reusable components.
    - excalibur-fortress-migration :  Repository of reusable components.
    - excalibur-fortress-platform :  Repository of reusable components.
    - excalibur-fortress-testcase :  Repository of reusable components.
    - excalibur-framework-impl :  Repository of reusable components.
    - excalibur-instrument-api :  Repository of reusable components.
    - excalibur-instrument-client :  Repository of reusable components.
    - excalibur-instrument-mgr-api :  Repository of reusable components.
    - excalibur-instrument-mgr-http :  Repository of reusable components.
    - excalibur-instrument-mgr-impl :  Repository of reusable components.
    - excalibur-lifecycle-api :  Repository of reusable components.
    - excalibur-lifecycle-impl :  Repository of reusable components.
    - excalibur-logger :  Repository of reusable components.
    - excalibur-monitor :  Repository of reusable components.
    - excalibur-pool :  Repository of reusable components.
    - excalibur-pool-api :  Repository of reusable components.
    - excalibur-pool-impl :  Repository of reusable components.
    - excalibur-pool-impl-test :  Repository of reusable components.
    - excalibur-pool-instrumented :  Repository of reusable components.
    - excalibur-sourceresolve :  Repository of reusable components.
    - excalibur-store :  Repository of reusable components.
    - excalibur-store-test :  Repository of reusable components.
    - excalibur-testcase :  Repository of reusable components.
    - excalibur-thread :  Repository of reusable components.
    - excalibur-thread-api :  Repository of reusable components.
    - excalibur-thread-impl :  Repository of reusable components.
    - excalibur-thread-impl-test :  Repository of reusable components.
    - excalibur-thread-instrumented :  Repository of reusable components.
    - excalibur-xmlutil :  Repository of reusable components.
    - excalibur-xmlutil-test :  Repository of reusable components.
    - excalibur_avalon-framework-impl :  Repository of reusable components.
    - forrest-core :  Apache Forrest software is a publishing framework that trans...
    - forrest-rat :  Apache Forrest software is a publishing framework that trans...
    - forrest-test :  Apache Forrest software is a publishing framework that trans...
    - forrest-test-basic :  Apache Forrest software is a publishing framework that trans...
    - fulcrum-bsf :  Services Framework
    - fulcrum-cache :  Services Framework
    - fulcrum-cache-test :  Services Framework
    - fulcrum-configuration-impl :  Services Framework
    - fulcrum-crypto :  Services Framework
    - fulcrum-dvsl :  Services Framework
    - fulcrum-factory :  Services Framework
    - fulcrum-hsqldb :  Services Framework
    - fulcrum-intake :  Services Framework
    - fulcrum-localization :  Services Framework
    - fulcrum-mimetype :  Services Framework
    - fulcrum-naming :  Services Framework
    - fulcrum-osworkflow :  Services Framework
    - fulcrum-parser :  Services Framework
    - fulcrum-pool :  Services Framework
    - fulcrum-quartz :  Services Framework
    - fulcrum-quartz-test :  Services Framework
    - fulcrum-security-api :  Services Framework
    - fulcrum-security-memory :  Services Framework
    - fulcrum-security-nt :  Services Framework
    - fulcrum-template :  Services Framework
    - fulcrum-testcontainer :  Services Framework
    - fulcrum-upload :  Services Framework
    - fulcrum-xmlrpc :  Services Framework
    - fulcrum-xslt :  Services Framework
    - fulcrum-yaafi :  Services Framework
    - fulcrum_fulcrum-testcontainer :  Services Framework
    - fulcrum_fulcrum-yaafi :  Services Framework
    - invicta :  Open-source build management tool.
    - ivy-tests :  Ivy is a tool for managing (recording, tracking, resolving a...
    - jakarta-jmeter-svn :  Pure Java load testing and performance measurement tool.
   ...
    - jakarta-jmeter-test :  Pure Java load testing and performance measurement tool.
   ...
    - jakarta-tomcat-4.0 :  Servlet 2.3 and JSP 1.2 Reference Implementation
    - jakarta-tomcat-catalina :  Servlet 2.4 Reference Implementation
    - jakarta-tomcat-dbcp :  Servlet 2.4 and JSP 2.0 Reference Implementation
    - jakarta-tomcat-jk :  Connectors to various web servers
    - jakarta-turbine-jcs :  Cache
    - javax.el :  Java Servlet 2.5 & Server Pages JSP 2.1 implementation (for ...
    - javax.servlet :  Java Servlet 2.5 & Server Pages JSP 2.1 implementation (for ...
    - javax.servlet.jsp :  Java Servlet 2.5 & Server Pages JSP 2.1 implementation (for ...
    - jcs :  Cache
    - maven-fortress-plugin :  Repository of reusable components.
    - org.apache.poi :  POI
    - org.apache.velocity.velocity-engine :  Velocity Templating engine
    - org.apache.xmlgraphics.fop :  XSL-FO (Formatting Objects) processor
    - poi :  POI
    - portals-jetspeed-1 :  Enterprise Information Portal
    - rat-tasks-antunit-tests :  Release Audit Tool
    - smartfrog-components :  Smartfrog: Application Deployment from HP Laboratories
    - tomcat-tc6 :  Java Servlet 2.5 & Server Pages JSP 2.1 implementation (for ...
    - tomcat-trunk :  Java Servlet 3.0, Java Server Pages 2.2 & Expression Languag...
    - tomcat-trunk-dbcp :  Java Servlet 3.0, Java Server Pages 2.2 & Expression Languag...
    - tomcat-trunk-test :  Java Servlet 3.0, Java Server Pages 2.2 & Expression Languag...
    - tomcat-trunk-validate :  Java Servlet 3.0, Java Server Pages 2.2 & Expression Languag...
    - turbine-core :  A servlet based framework.
    - turbine-core-test :  A servlet based framework.
    - velocity-anakia :  Anakia uses Apache Velocity to generate documents based on X...
    - velocity-anakia-test :  Anakia uses Apache Velocity to generate documents based on X...
    - velocity-dvsl :  Template engine
    - velocity-engine :  Velocity Templating engine
    - velocity-engine-test :  Velocity Templating engine
    - velocity-texen :  Texen is a general purpose text generating utility based on ...
    - velocity-texen-test :  Texen is a general purpose text generating utility based on ...
    - velocity-tools :  VelocityTools project
    - xml-fop :  XSL-FO (Formatting Objects) processor


Full details are available at:
    http://vmgump.apache.org/gump/public/commons-lang-2.x/commons-lang/index.html

That said, some information snippets are provided here.

The following annotations (debug/informational/warning/error messages) were provided:
 -DEBUG- (Gump generated) Maven2 Settings in: /srv/gump/public/workspace/commons-lang-2.x/gump_mvn_settings.xml
 -INFO- Failed with reason build failed
 -DEBUG- Maven POM in: /srv/gump/public/workspace/commons-lang-2.x/pom.xml
 -DEBUG- Extracted fallback artifacts from Gump Repository



The following work was performed:
http://vmgump.apache.org/gump/public/commons-lang-2.x/commons-lang/gump_work/build_commons-lang-2.x_commons-lang.html
Work Name: build_commons-lang-2.x_commons-lang (Type: Build)
Work ended in a state of : Failed
Elapsed: 2 mins 34 secs
Command Line: mvn --batch-mode -Dmaven.test.skip.exec=true --settings /srv/gump/public/workspace/commons-lang-2.x/gump_mvn_settings.xml package 
[Working Directory: /srv/gump/public/workspace/commons-lang-2.x]
---------------------------------------------
[WARNING] *** CHECKSUM FAILED - Checksum failed on download: local = '7407cf06385c8bc046b133abce041b9d396176be'; remote = '<html>
<head>
' - IGNORING
[INFO] ------------------------------------------------------------------------
[ERROR] FATAL ERROR
[INFO] ------------------------------------------------------------------------
[INFO] Error building POM (may not be this project's POM).


Project ID: commons-lang:commons-lang:jar:2.6-SNAPSHOT

Reason: Cannot find parent: org.apache.commons:commons-parent for project: commons-lang:commons-lang:jar:2.6-SNAPSHOT for project commons-lang:commons-lang:jar:2.6-SNAPSHOT


[INFO] ------------------------------------------------------------------------
[INFO] Trace
org.apache.maven.reactor.MavenExecutionException: Cannot find parent: org.apache.commons:commons-parent for project: commons-lang:commons-lang:jar:2.6-SNAPSHOT for project commons-lang:commons-lang:jar:2.6-SNAPSHOT
	at org.apache.maven.DefaultMaven.getProjects(DefaultMaven.java:404)
	at org.apache.maven.DefaultMaven.doExecute(DefaultMaven.java:272)
	at org.apache.maven.DefaultMaven.execute(DefaultMaven.java:138)
	at org.apache.maven.cli.MavenCli.main(MavenCli.java:362)
	at org.apache.maven.cli.compat.CompatibleMain.main(CompatibleMain.java:60)
	at sun.reflect.NativeMethodAccessorImpl.invoke0(Native Method)
	at sun.reflect.NativeMethodAccessorImpl.invoke(NativeMethodAccessorImpl.java:57)
	at sun.reflect.DelegatingMethodAccessorImpl.invoke(DelegatingMethodAccessorImpl.java:43)
	at java.lang.reflect.Method.invoke(Method.java:616)
	at org.codehaus.classworlds.Launcher.launchEnhanced(Launcher.java:315)
	at org.codehaus.classworlds.Launcher.launch(Launcher.java:255)
	at org.codehaus.classworlds.Launcher.mainWithExitCode(Launcher.java:430)
	at org.codehaus.classworlds.Launcher.main(Launcher.java:375)
Caused by: org.apache.maven.project.ProjectBuildingException: Cannot find parent: org.apache.commons:commons-parent for project: commons-lang:commons-lang:jar:2.6-SNAPSHOT for project commons-lang:commons-lang:jar:2.6-SNAPSHOT
	at org.apache.maven.project.DefaultMavenProjectBuilder.assembleLineage(DefaultMavenProjectBuilder.java:1396)
	at org.apache.maven.project.DefaultMavenProjectBuilder.buildInternal(DefaultMavenProjectBuilder.java:823)
	at org.apache.maven.project.DefaultMavenProjectBuilder.buildFromSourceFileInternal(DefaultMavenProjectBuilder.java:508)
	at org.apache.maven.project.DefaultMavenProjectBuilder.build(DefaultMavenProjectBuilder.java:200)
	at org.apache.maven.DefaultMaven.getProject(DefaultMaven.java:604)
	at org.apache.maven.DefaultMaven.collectProjects(DefaultMaven.java:487)
	at org.apache.maven.DefaultMaven.getProjects(DefaultMaven.java:391)
	... 12 more
Caused by: org.apache.maven.project.InvalidProjectModelException: Not a v4.0.0 POM. for project org.apache.commons:commons-parent at /srv/gump/public/workspace/mvnlocalrepo/too-early-for-mvn/org/apache/commons/commons-parent/15/commons-parent-15.pom
	at org.apache.maven.project.DefaultMavenProjectBuilder.readModel(DefaultMavenProjectBuilder.java:1599)
	at org.apache.maven.project.DefaultMavenProjectBuilder.readModel(DefaultMavenProjectBuilder.java:1571)
	at org.apache.maven.project.DefaultMavenProjectBuilder.findModelFromRepository(DefaultMavenProjectBuilder.java:562)
	at org.apache.maven.project.DefaultMavenProjectBuilder.assembleLineage(DefaultMavenProjectBuilder.java:1392)
	... 18 more
[INFO] ------------------------------------------------------------------------
[INFO] Total time: 2 minutes 10 seconds
[INFO] Finished at: Tue Aug 17 00:07:38 UTC 2010
[INFO] Final Memory: 2M/15M
[INFO] ------------------------------------------------------------------------
---------------------------------------------

To subscribe to this information via syndicated feeds:
- RSS: http://vmgump.apache.org/gump/public/commons-lang-2.x/commons-lang/rss.xml
- Atom: http://vmgump.apache.org/gump/public/commons-lang-2.x/commons-lang/atom.xml

============================== Gump Tracking Only ===
Produced by Gump version 2.3.
Gump Run 29000017082010, vmgump.apache.org:vmgump:29000017082010
Gump E-mail Identifier (unique within run) #1.

*********************************************************** G U M P
[GUMP@vmgump]: Project expat-configure (in module expat) failed
To whom it may engage...
        
This is an automated request, but not an unsolicited one. For 
more information please visit http://gump.apache.org/nagged.html, 
and/or contact the folk at general@gump.apache.org.

Project expat-configure has an issue affecting its community integration.
This issue affects 22 projects,
 and has been outstanding for 17 runs.
The current state of this project is 'Failed', with reason 'Build Failed'.
For reference only, the following projects are affected by this:
    - apache-httpd-buildconf :  Apache HTTP Server
    - apache-httpd-configure :  Apache HTTP Server
    - apache-httpd-make :  Apache HTTP Server
    - apache-httpd-make-install :  Apache HTTP Server
    - apr-configure :  Apache Portable Runtime
    - apr-iconv-buildconf :  Apache Portable Runtime
    - apr-iconv-configure :  Apache Portable Runtime
    - apr-iconv-make :  Apache Portable Runtime
    - apr-make :  Apache Portable Runtime
    - apr-make-install :  Apache Portable Runtime
    - expat :  The Expat XML Parser
    - expat-configure :  The Expat XML Parser
    - expat-make :  The Expat XML Parser
    - jakarta-tomcat-jk-native :  Connectors to various web servers
    - jakarta-tomcat-jk-native-buildconf :  Connectors to various web servers
    - jakarta-tomcat-jk-native-configure :  Connectors to various web servers
    - logging-log4cxx-ant :  Apache log4cxx
    - logging-log4cxx-ant-no_wchar_t :  Apache log4cxx
    - logging-log4cxx-ant-static :  Apache log4cxx
    - logging-log4cxx-configure :  Apache log4cxx
    - logging-log4cxx-make :  Apache log4cxx
    - logging-log4cxx-make-install :  Apache log4cxx


Full details are available at:
    http://vmgump.apache.org/gump/public/expat/expat-configure/index.html

That said, some information snippets are provided here.

The following annotations (debug/informational/warning/error messages) were provided:
 -INFO- Failed with reason build failed



The following work was performed:
http://vmgump.apache.org/gump/public/expat/expat-configure/gump_work/buildscript_expat_expat-configure.html
Work Name: buildscript_expat_expat-configure (Type: Build)
Work ended in a state of : Failed
Elapsed: 3 secs
Command Line: /srv/gump/public/workspace/expat/configure --prefix=/srv/gump/public/workspace/expat/dest-17082010 
[Working Directory: /srv/gump/public/workspace/expat]
---------------------------------------------
/srv/gump/public/workspace/expat/configure: line 3336: AC_LIBTOOL_WIN32_DLL: command not found
/srv/gump/public/workspace/expat/configure: line 3343: LTOPTIONS_VERSION: command not found
/srv/gump/public/workspace/expat/configure: line 3344: LTSUGAR_VERSION: command not found
/srv/gump/public/workspace/expat/configure: line 3345: LTVERSION_VERSION: command not found
/srv/gump/public/workspace/expat/configure: line 3346: LTOBSOLETE_VERSION: command not found
checking build system type... x86_64-unknown-linux-gnu
checking host system type... x86_64-unknown-linux-gnu
checking for gcc... gcc
checking whether the C compiler works... yes
checking for C compiler default output file name... a.out
checking for suffix of executables... 
checking whether we are cross compiling... no
checking for suffix of object files... o
checking whether we are using the GNU C compiler... yes
checking whether gcc accepts -g... yes
checking for gcc option to accept ISO C89... none needed
checking for a sed that does not truncate output... /bin/sed
/srv/gump/public/workspace/expat/configure: line 4283: syntax error near unexpected token `lt_decl_varnames,'
/srv/gump/public/workspace/expat/configure: line 4283: `lt_if_append_uniq(lt_decl_varnames, SED, , ,'
---------------------------------------------

To subscribe to this information via syndicated feeds:
- RSS: http://vmgump.apache.org/gump/public/expat/expat-configure/rss.xml
- Atom: http://vmgump.apache.org/gump/public/expat/expat-configure/atom.xml

============================== Gump Tracking Only ===
Produced by Gump version 2.3.
Gump Run 29000017082010, vmgump.apache.org:vmgump:29000017082010
Gump E-mail Identifier (unique within run) #2.

*********************************************************** G U M P
[GUMP@vmgump]: Project gsbase (in module gsbase) failed
To whom it may engage...
        
This is an automated request, but not an unsolicited one. For 
more information please visit http://gump.apache.org/nagged.html, 
and/or contact the folk at general@gump.apache.org.

Project gsbase has an issue affecting its community integration.
This issue affects 1 projects,
 and has been outstanding for 112 runs.
The current state of this project is 'Failed', with reason 'Build Failed'.
For reference only, the following projects are affected by this:
    - gsbase :  A collection of java utility classes


Full details are available at:
    http://vmgump.apache.org/gump/public/gsbase/gsbase/index.html

That said, some information snippets are provided here.

The following annotations (debug/informational/warning/error messages) were provided:
 -DEBUG- Sole jar output [gsbase-17082010.jar] identifier set to project name
 -DEBUG- (Gump generated) Maven Properties in: /srv/gump/public/workspace/gsbase/build.properties
 -INFO- Failed with reason build failed
 -DEBUG- Maven POM in: /srv/gump/public/workspace/gsbase/project.xml
 -DEBUG- Maven project properties in: /srv/gump/public/workspace/gsbase/project.properties
 -INFO- Failed to extract fallback artifacts from Gump Repository



The following work was performed:
http://vmgump.apache.org/gump/public/gsbase/gsbase/gump_work/build_gsbase_gsbase.html
Work Name: build_gsbase_gsbase (Type: Build)
Work ended in a state of : Failed
Elapsed: 18 secs
Command Line: maven --offline jar 
[Working Directory: /srv/gump/public/workspace/gsbase]
---------------------------------------------
| |\/| / _` \ V / -_) ' \  ~ intelligent projects ~
|_|  |_\__,_|\_/\___|_||_|  v. 1.0.2

build:start:

java:prepare-filesystem:
    [mkdir] Created dir: /srv/gump/public/workspace/gsbase/target/classes

java:compile:
    [echo] Compiling to /srv/gump/public/workspace/gsbase/target/classes
    [echo] 
==========================================================

  NOTE: Targetting JVM 1.6, classes
  will not run on earlier JVMs

==========================================================
          
    [javac] Compiling 66 source files to /srv/gump/public/workspace/gsbase/target/classes
/srv/gump/public/workspace/gsbase/src/java/com/gargoylesoftware/base/resource/jdbc/StatementWrapper.java:65: com.gargoylesoftware.base.resource.jdbc.StatementWrapper is not abstract and does not override abstract method isPoolable() in java.sql.Statement
public class StatementWrapper implements Statement {
       ^
/srv/gump/public/workspace/gsbase/src/java/com/gargoylesoftware/base/resource/jdbc/PreparedStatementWrapper.java:64: com.gargoylesoftware.base.resource.jdbc.PreparedStatementWrapper is not abstract and does not override abstract method setNClob(int,java.io.Reader) in java.sql.PreparedStatement
public class PreparedStatementWrapper
       ^
/srv/gump/public/workspace/gsbase/src/java/com/gargoylesoftware/base/resource/jdbc/ResultSetWrapper.java:150: com.gargoylesoftware.base.resource.jdbc.ResultSetWrapper is not abstract and does not override abstract method updateNClob(java.lang.String,java.io.Reader) in java.sql.ResultSet
public final class ResultSetWrapper implements ResultSet {
             ^
/srv/gump/public/workspace/gsbase/src/java/com/gargoylesoftware/base/resource/jdbc/ConnectionWrapper.java:77: com.gargoylesoftware.base.resource.jdbc.ConnectionWrapper is not abstract and does not override abstract method createStruct(java.lang.String,java.lang.Object[]) in java.sql.Connection
public final class ConnectionWrapper implements Connection, ManagedResource {
             ^
/srv/gump/public/workspace/gsbase/src/java/com/gargoylesoftware/base/resource/jdbc/DatabaseMetaDataWrapper.java:54: com.gargoylesoftware.base.resource.jdbc.DatabaseMetaDataWrapper is not abstract and does not override abstract method getFunctionColumns(java.lang.String,java.lang.String,java.lang.String,java.lang.String) in java.sql.DatabaseMetaData
public final class DatabaseMetaDataWrapper implements DatabaseMetaData {
             ^
/srv/gump/public/workspace/gsbase/src/java/com/gargoylesoftware/base/resource/jdbc/CallableStatementWrapper.java:81: com.gargoylesoftware.base.resource.jdbc.CallableStatementWrapper is not abstract and does not override abstract method setNClob(java.lang.String,java.io.Reader) in java.sql.CallableStatement
public final class CallableStatementWrapper
             ^
Note: Some input files use unchecked or unsafe operations.
Note: Recompile with -Xlint:unchecked for details.
6 errors

BUILD FAILED
File...... /home/gump/.maven/cache/maven-java-plugin-1.5/plugin.jelly
Element... ant:javac
Line...... 63
Column.... 48
Compile failed; see the compiler error output for details.
Total time: 17 seconds
Finished at: Tue Aug 17 00:34:23 UTC 2010

---------------------------------------------

To subscribe to this information via syndicated feeds:
- RSS: http://vmgump.apache.org/gump/public/gsbase/gsbase/rss.xml
- Atom: http://vmgump.apache.org/gump/public/gsbase/gsbase/atom.xml

============================== Gump Tracking Only ===
Produced by Gump version 2.3.
Gump Run 29000017082010, vmgump.apache.org:vmgump:29000017082010
Gump E-mail Identifier (unique within run) #3.

*********************************************************** G U M P
[GUMP@vmgump]: Project gsbase-test (in module gsbase) failed
To whom it may engage...
        
This is an automated request, but not an unsolicited one. For 
more information please visit http://gump.apache.org/nagged.html, 
and/or contact the folk at general@gump.apache.org.

Project gsbase-test has an issue affecting its community integration.
This issue affects 1 projects,
 and has been outstanding for 112 runs.
The current state of this project is 'Failed', with reason 'Build Failed'.
For reference only, the following projects are affected by this:
    - gsbase-test :  A collection of java utility classes


Full details are available at:
    http://vmgump.apache.org/gump/public/gsbase/gsbase-test/index.html

That said, some information snippets are provided here.

The following annotations (debug/informational/warning/error messages) were provided:
 -WARNING- Overriding Maven properties: [/srv/gump/public/workspace/gsbase/build.properties]
 -DEBUG- (Gump generated) Maven Properties in: /srv/gump/public/workspace/gsbase/build.properties
 -INFO- Failed with reason build failed
 -DEBUG- Maven POM in: /srv/gump/public/workspace/gsbase/project.xml
 -DEBUG- Maven project properties in: /srv/gump/public/workspace/gsbase/project.properties



The following work was performed:
http://vmgump.apache.org/gump/public/gsbase/gsbase-test/gump_work/build_gsbase_gsbase-test.html
Work Name: build_gsbase_gsbase-test (Type: Build)
Work ended in a state of : Failed
Elapsed: 5 secs
Command Line: maven --offline jar 
[Working Directory: /srv/gump/public/workspace/gsbase]
---------------------------------------------
|  \/  |__ _Apache__ ___
| |\/| / _` \ V / -_) ' \  ~ intelligent projects ~
|_|  |_\__,_|\_/\___|_||_|  v. 1.0.2

build:start:

java:prepare-filesystem:

java:compile:
    [echo] Compiling to /srv/gump/public/workspace/gsbase/target/classes
    [echo] 
==========================================================

  NOTE: Targetting JVM 1.6, classes
  will not run on earlier JVMs

==========================================================
          
    [javac] Compiling 8 source files to /srv/gump/public/workspace/gsbase/target/classes
/srv/gump/public/workspace/gsbase/src/java/com/gargoylesoftware/base/resource/jdbc/StatementWrapper.java:65: com.gargoylesoftware.base.resource.jdbc.StatementWrapper is not abstract and does not override abstract method isPoolable() in java.sql.Statement
public class StatementWrapper implements Statement {
       ^
/srv/gump/public/workspace/gsbase/src/java/com/gargoylesoftware/base/resource/jdbc/PreparedStatementWrapper.java:64: com.gargoylesoftware.base.resource.jdbc.PreparedStatementWrapper is not abstract and does not override abstract method setNClob(int,java.io.Reader) in java.sql.PreparedStatement
public class PreparedStatementWrapper
       ^
/srv/gump/public/workspace/gsbase/src/java/com/gargoylesoftware/base/resource/jdbc/ResultSetWrapper.java:150: com.gargoylesoftware.base.resource.jdbc.ResultSetWrapper is not abstract and does not override abstract method updateNClob(java.lang.String,java.io.Reader) in java.sql.ResultSet
public final class ResultSetWrapper implements ResultSet {
             ^
/srv/gump/public/workspace/gsbase/src/java/com/gargoylesoftware/base/resource/jdbc/ConnectionWrapper.java:77: com.gargoylesoftware.base.resource.jdbc.ConnectionWrapper is not abstract and does not override abstract method createStruct(java.lang.String,java.lang.Object[]) in java.sql.Connection
public final class ConnectionWrapper implements Connection, ManagedResource {
             ^
/srv/gump/public/workspace/gsbase/src/java/com/gargoylesoftware/base/resource/jdbc/DatabaseMetaDataWrapper.java:54: com.gargoylesoftware.base.resource.jdbc.DatabaseMetaDataWrapper is not abstract and does not override abstract method getFunctionColumns(java.lang.String,java.lang.String,java.lang.String,java.lang.String) in java.sql.DatabaseMetaData
public final class DatabaseMetaDataWrapper implements DatabaseMetaData {
             ^
/srv/gump/public/workspace/gsbase/src/java/com/gargoylesoftware/base/resource/jdbc/CallableStatementWrapper.java:81: com.gargoylesoftware.base.resource.jdbc.CallableStatementWrapper is not abstract and does not override abstract method setNClob(java.lang.String,java.io.Reader) in java.sql.CallableStatement
public final class CallableStatementWrapper
             ^
Note: Some input files use unchecked or unsafe operations.
Note: Recompile with -Xlint:unchecked for details.
6 errors

BUILD FAILED
File...... /home/gump/.maven/cache/maven-java-plugin-1.5/plugin.jelly
Element... ant:javac
Line...... 63
Column.... 48
Compile failed; see the compiler error output for details.
Total time: 5 seconds
Finished at: Tue Aug 17 00:40:12 UTC 2010

---------------------------------------------

To subscribe to this information via syndicated feeds:
- RSS: http://vmgump.apache.org/gump/public/gsbase/gsbase-test/rss.xml
- Atom: http://vmgump.apache.org/gump/public/gsbase/gsbase-test/atom.xml

============================== Gump Tracking Only ===
Produced by Gump version 2.3.
Gump Run 29000017082010, vmgump.apache.org:vmgump:29000017082010
Gump E-mail Identifier (unique within run) #4.

*********************************************************** G U M P
[GUMP@vmgump]: Project emma (in module emma) failed
To whom it may engage...
        
This is an automated request, but not an unsolicited one. For 
more information please visit http://gump.apache.org/nagged.html, 
and/or contact the folk at general@gump.apache.org.

Project emma has an issue affecting its community integration.
This issue affects 1 projects,
 and has been outstanding for 111 runs.
The current state of this project is 'Failed', with reason 'Build Failed'.
For reference only, the following projects are affected by this:
    - emma :  code coverage tool


Full details are available at:
    http://vmgump.apache.org/gump/public/emma/emma/index.html

That said, some information snippets are provided here.

The following annotations (debug/informational/warning/error messages) were provided:
 -INFO- Failed with reason build failed
 -INFO- Failed to extract fallback artifacts from Gump Repository



The following work was performed:
http://vmgump.apache.org/gump/public/emma/emma/gump_work/build_emma_emma.html
Work Name: build_emma_emma (Type: Build)
Work ended in a state of : Failed
Elapsed: 12 secs
Command Line: /usr/lib/jvm/java-6-openjdk/bin/java -Djava.awt.headless=true -Xbootclasspath/p:/srv/gump/public/workspace/xml-commons/java/external/build/xml-apis.jar:/srv/gump/public/workspace/xml-xerces2/build/xercesImpl.jar org.apache.tools.ant.Main -Dgump.merge=/srv/gump/public/gump/work/merge.xml -Dbuild.sysclasspath=only -Dapp.short.name=emma-17082010 
[Working Directory: /srv/gump/public/workspace/emma]
CLASSPATH: /usr/lib/jvm/java-6-openjdk/lib/tools.jar:/srv/gump/public/workspace/emma/out/core/classes:/srv/gump/public/workspace/emma/out/ant/classes:/srv/gump/public/workspace/emma/lib/internal/stamptool.jar:/srv/gump/public/workspace/ant/dist/lib/ant.jar:/srv/gump/public/workspace/ant/dist/lib/ant-launcher.jar:/srv/gump/public/workspace/ant/dist/lib/ant-jmf.jar:/srv/gump/public/workspace/ant/dist/lib/ant-junit.jar:/srv/gump/public/workspace/ant/dist/lib/ant-swing.jar:/srv/gump/public/workspace/ant/dist/lib/ant-apache-resolver.jar:/srv/gump/public/workspace/ant/dist/lib/ant-apache-xalan2.jar:/srv/gump/public/workspace/xml-commons/java/external/build/xml-apis-ext.jar
---------------------------------------------
timestamp:

-pre-compile:

core.bootstrap.compile:
    [javac] Compiling 2 source files to /srv/gump/public/workspace/emma/out/core/classes
    [javac] 
    [javac]           WARNING
    [javac] 
    [javac] The -source switch defaults to 1.5 in JDK 1.5 and 1.6.
    [javac] If you specify -target 1.2 you now must also specify -source 1.2.
    [javac] Ant will implicitly add -source 1.2 for you.  Please change your build file.

core.java14.compile:
    [javac] Compiling 1 source file to /srv/gump/public/workspace/emma/out/core/classes
    [javac] 
    [javac]           WARNING
    [javac] 
    [javac] The -source switch defaults to 1.5 in JDK 1.5 and 1.6.
    [javac] If you specify -target 1.2 you now must also specify -source 1.2.
    [javac] Ant will implicitly add -source 1.2 for you.  Please change your build file.

core.java13.compile:
    [javac] Compiling 1 source file to /srv/gump/public/workspace/emma/out/core/classes
    [javac] 
    [javac]           WARNING
    [javac] 
    [javac] The -source switch defaults to 1.5 in JDK 1.5 and 1.6.
    [javac] If you specify -target 1.2 you now must also specify -source 1.2.
    [javac] Ant will implicitly add -source 1.2 for you.  Please change your build file.

core.compile:
    [javac] Compiling 175 source files to /srv/gump/public/workspace/emma/out/core/classes
    [javac] 
    [javac]           WARNING
    [javac] 
    [javac] The -source switch defaults to 1.5 in JDK 1.5 and 1.6.
    [javac] If you specify -target 1.2 you now must also specify -source 1.2.
    [javac] Ant will implicitly add -source 1.2 for you.  Please change your build file.
    [javac] /srv/gump/public/workspace/emma/core/java12/com/vladium/emma/run/InstrClassLoader.java:346: reference to CodeSource is ambiguous, both method CodeSource(java.net.URL,java.security.cert.Certificate[]) in java.security.CodeSource and method CodeSource(java.net.URL,java.security.CodeSigner[]) in java.security.CodeSource match
    [javac]         final CodeSource csrc = new CodeSource (srcURL, null);
    [javac]                                 ^
    [javac] Note: Some input files use or override a deprecated API.
    [javac] Note: Recompile with -Xlint:deprecation for details.
    [javac] 1 error

BUILD FAILED
/srv/gump/public/workspace/emma/build.xml:297: Compile failed; see the compiler error output for details.

Total time: 12 seconds
---------------------------------------------

To subscribe to this information via syndicated feeds:
- RSS: http://vmgump.apache.org/gump/public/emma/emma/rss.xml
- Atom: http://vmgump.apache.org/gump/public/emma/emma/atom.xml

============================== Gump Tracking Only ===
Produced by Gump version 2.3.
Gump Run 29000017082010, vmgump.apache.org:vmgump:29000017082010
Gump E-mail Identifier (unique within run) #6.

*********************************************************** G U M P
[GUMP@vmgump]: Project ooxml-schemas (in module poi) failed
To whom it may engage...
        
This is an automated request, but not an unsolicited one. For 
more information please visit http://gump.apache.org/nagged.html, 
and/or contact the folk at general@gump.apache.org.

Project ooxml-schemas has an issue affecting its community integration.
This issue affects 2 projects,
 and has been outstanding for 9 runs.
The current state of this project is 'Failed', with reason 'Build Failed'.
For reference only, the following projects are affected by this:
    - ooxml-schemas :  POI
    - poi-ooxml-schemas :  POI


Full details are available at:
    http://vmgump.apache.org/gump/public/poi/ooxml-schemas/index.html

That said, some information snippets are provided here.

The following annotations (debug/informational/warning/error messages) were provided:
 -DEBUG- Sole jar output [ooxml-schemas-[0-9]*[0-9T].jar] identifier set to project name
 -INFO- Failed with reason build failed
 -INFO- Failed to extract fallback artifacts from Gump Repository



The following work was performed:
http://vmgump.apache.org/gump/public/poi/ooxml-schemas/gump_work/build_poi_ooxml-schemas.html
Work Name: build_poi_ooxml-schemas (Type: Build)
Work ended in a state of : Failed
Elapsed: 4 mins 57 secs
Command Line: /usr/lib/jvm/java-6-openjdk/bin/java -Djava.awt.headless=true -Dant.build.clonevm=true org.apache.tools.ant.Main -Dgump.merge=/srv/gump/public/gump/work/merge.xml -Dbuild.sysclasspath=only compile-ooxml-xsds 
[Working Directory: /srv/gump/public/workspace/poi]
CLASSPATH: /usr/lib/jvm/java-6-openjdk/lib/tools.jar:/srv/gump/public/workspace/ant/dist/lib/ant.jar:/srv/gump/public/workspace/ant/dist/lib/ant-launcher.jar:/srv/gump/public/workspace/ant/dist/lib/ant-jmf.jar:/srv/gump/public/workspace/ant/dist/lib/ant-junit.jar:/srv/gump/public/workspace/ant/dist/lib/ant-swing.jar:/srv/gump/public/workspace/ant/dist/lib/ant-apache-resolver.jar:/srv/gump/public/workspace/ant/dist/lib/ant-apache-xalan2.jar:/srv/gump/packages/junit3.8.1/junit.jar:/srv/gump/public/workspace/xml-commons/java/build/resolver.jar:/srv/gump/public/workspace/poi/ooxml-lib/geronimo-stax-api_1.0_spec-1.0.jar:/srv/gump/public/workspace/poi/ooxml-lib/xmlbeans-2.3.0.jar
---------------------------------------------
Buildfile: /srv/gump/public/workspace/poi/build.xml

check-jars:

fetch-jars:

testexist:

downloadfile:
      [get] Getting: http://repo1.maven.org/maven2/commons-logging/commons-logging/1.1/commons-logging-1.1.jar
      [get] To: /srv/gump/public/workspace/poi/lib/commons-logging-1.1.jar

testexist:

downloadfile:
      [get] Getting: http://repo1.maven.org/maven2/log4j/log4j/1.2.13/log4j-1.2.13.jar
      [get] To: /srv/gump/public/workspace/poi/lib/log4j-1.2.13.jar

testexist:

downloadfile:
      [get] Getting: http://repo1.maven.org/maven2/junit/junit/3.8.1/junit-3.8.1.jar
      [get] To: /srv/gump/public/workspace/poi/lib/junit-3.8.1.jar

check-ooxml-xsds:

fetch-ooxml-xsds:
      [get] Getting: http://www.ecma-international.org/publications/files/ECMA-ST/Office%20Open%20XML%201st%20edition%20Part%204%20(PDF).zip
      [get] To: /srv/gump/public/workspace/poi/ooxml-lib/OfficeOpenXML-Part4.zip
    [unzip] Expanding: /srv/gump/public/workspace/poi/ooxml-lib/OfficeOpenXML-Part4.zip into /srv/gump/public/workspace/poi/ooxml-lib

check-compiled-ooxml-xsds:

compile-ooxml-xsds:
    [mkdir] Created dir: /srv/gump/public/workspace/poi/build/ooxml-xsds
    [unzip] Expanding: /srv/gump/public/workspace/poi/ooxml-lib/OfficeOpenXML-XMLSchema.zip into /srv/gump/public/workspace/poi/build/ooxml-xsds
  [xmlbean] Time to build schema type system: 9.495 seconds
  [xmlbean] Time to generate code: 13.335 seconds
  [xmlbean] Compiling 4382 source files to /tmp/xbean3094600002483201965.d/classes
Killed
---------------------------------------------

To subscribe to this information via syndicated feeds:
- RSS: http://vmgump.apache.org/gump/public/poi/ooxml-schemas/rss.xml
- Atom: http://vmgump.apache.org/gump/public/poi/ooxml-schemas/atom.xml

============================== Gump Tracking Only ===
Produced by Gump version 2.3.
Gump Run 29000017082010, vmgump.apache.org:vmgump:29000017082010
Gump E-mail Identifier (unique within run) #7.

*********************************************************** G U M P
[GUMP@vmgump]: Project jmock2 (in module jmock2) failed
To whom it may engage...
        
This is an automated request, but not an unsolicited one. For 
more information please visit http://gump.apache.org/nagged.html, 
and/or contact the folk at general@gump.apache.org.

Project jmock2 has an issue affecting its community integration.
This issue affects 1 projects,
 and has been outstanding for 111 runs.
The current state of this project is 'Failed', with reason 'Build Failed'.
For reference only, the following projects are affected by this:
    - jmock2 :  jMock is a library for testing Java code using mock objects.


Full details are available at:
    http://vmgump.apache.org/gump/public/jmock2/jmock2/index.html

That said, some information snippets are provided here.

The following annotations (debug/informational/warning/error messages) were provided:
 -INFO- Failed with reason build failed
 -INFO- Failed to extract fallback artifacts from Gump Repository



The following work was performed:
http://vmgump.apache.org/gump/public/jmock2/jmock2/gump_work/build_jmock2_jmock2.html
Work Name: build_jmock2_jmock2 (Type: Build)
Work ended in a state of : Failed
Elapsed: 9 secs
Command Line: /usr/lib/jvm/java-6-openjdk/bin/java -Djava.awt.headless=true -Xbootclasspath/p:/srv/gump/public/workspace/xml-xerces2/build/xercesImpl.jar:/srv/gump/public/workspace/xml-commons/java/external/build/xml-apis.jar org.apache.tools.ant.Main -Dgump.merge=/srv/gump/public/gump/work/merge.xml -Dbuild.sysclasspath=only -Dversion=17082010 
[Working Directory: /srv/gump/public/workspace/jmock2]
CLASSPATH: /usr/lib/jvm/java-6-openjdk/lib/tools.jar:/srv/gump/public/workspace/jmock2/build/classes:/srv/gump/public/workspace/jmock2/lib/objenesis-1.0.jar:/srv/gump/public/workspace/ant/dist/lib/ant.jar:/srv/gump/public/workspace/ant/dist/lib/ant-launcher.jar:/srv/gump/public/workspace/ant/dist/lib/ant-jmf.jar:/srv/gump/public/workspace/ant/dist/lib/ant-junit.jar:/srv/gump/public/workspace/ant/dist/lib/ant-swing.jar:/srv/gump/public/workspace/ant/dist/lib/ant-apache-resolver.jar:/srv/gump/public/workspace/ant/dist/lib/ant-apache-xalan2.jar:/srv/gump/packages/bsh-2.0b4/bsh-2.0b4.jar:/srv/gump/packages/bsh-2.0b4/bsh-bsf-2.0b4.jar:/srv/gump/packages/bsh-2.0b4/bsh-classpath-2.0b4.jar:/srv/gump/packages/bsh-2.0b4/bsh-commands-2.0b4.jar:/srv/gump/packages/bsh-2.0b4/bsh-core-2.0b4.jar:/srv/gump/packages/bsh-2.0b4/bsh-reflect-2.0b4.jar:/srv/gump/packages/bsh-2.0b4/bsh-util-2.0b4.jar:/srv/gump/packages/cglib/cglib-nodep-2.1_3.jar:/srv/gump/public/workspace/hamcrest/hamcrest-java/bui
 ld/hamcrest-core-17082010.jar:/srv/gump/public/workspace/hamcrest/hamcrest-java/build/hamcrest-generator-17082010.jar:/srv/gump/public/workspace/hamcrest/hamcrest-java/build/hamcrest-library-17082010.jar:/srv/gump/public/workspace/junit/dist/junit-17082010.jar:/srv/gump/public/workspace/junit/dist/junit-dep-17082010.jar:/srv/gump/packages/junit3.8.1/junit.jar:/srv/gump/public/workspace/xml-commons/java/external/build/xml-apis-ext.jar
---------------------------------------------
    [javac] location: class org.jmock.test.unit.lib.CurrentStateMatcherTests
    [javac]         assertTrue("should match", isNotCurrently("S").matches(stateMachine));
    [javac]         ^
    [javac] /srv/gump/public/workspace/jmock2/test/org/jmock/test/unit/lib/CurrentStateMatcherTests.java:38: cannot find symbol
    [javac] symbol  : method assertTrue(java.lang.String,boolean)
    [javac] location: class org.jmock.test.unit.lib.CurrentStateMatcherTests
    [javac]         assertTrue("should not match", !isCurrentlyS.matches(null));
    [javac]         ^
    [javac] /srv/gump/public/workspace/jmock2/test/org/jmock/test/unit/lib/CurrentStateMatcherTests.java:42: cannot find symbol
    [javac] symbol  : method assertTrue(java.lang.String,boolean)
    [javac] location: class org.jmock.test.unit.lib.CurrentStateMatcherTests
    [javac]         assertTrue("should not match", !isCurrentlyS.matches("something else"));
    [javac]         ^
    [javac] /srv/gump/public/workspace/jmock2/test/org/jmock/test/unit/lib/CurrentStateMatcherTests.java:46: cannot find symbol
    [javac] symbol  : method assertEquals(java.lang.String,java.lang.String)
    [javac] location: class org.jmock.test.unit.lib.CurrentStateMatcherTests
    [javac]         assertEquals("a state machine that is S", asString(isCurrently("S")));
    [javac]         ^
    [javac] /srv/gump/public/workspace/jmock2/test/org/jmock/test/unit/lib/CurrentStateMatcherTests.java:47: cannot find symbol
    [javac] symbol  : method assertEquals(java.lang.String,java.lang.String)
    [javac] location: class org.jmock.test.unit.lib.CurrentStateMatcherTests
    [javac]         assertEquals("a state machine that is not S", asString(isNotCurrently("S")));
    [javac]         ^
    [javac] /srv/gump/public/workspace/jmock2/test/org/jmock/test/unit/lib/CurrentStateMatcherTests.java:53: cannot find symbol
    [javac] symbol  : method assertMismatchDescription(java.lang.String,org.hamcrest.Matcher<org.jmock.States>,org.jmock.States)
    [javac] location: class org.jmock.test.unit.lib.CurrentStateMatcherTests
    [javac]         assertMismatchDescription("was not S", isCurrently("S"), stateMachine);
    [javac]         ^
    [javac] /srv/gump/public/workspace/jmock2/test/org/jmock/test/unit/lib/CurrentStateMatcherTests.java:56: method does not override or implement a method from a supertype
    [javac]     @Override
    [javac]     ^
    [javac] /srv/gump/public/workspace/jmock2/test/org/jmock/test/unit/support/SyntheticEmptyInterfaceClassLoader.java:35: cannot find symbol
    [javac] symbol  : variable COMPUTE_MAXS
    [javac] location: class net.sf.cglib.asm.ClassWriter
    [javac]         ClassWriter writer = new ClassWriter(ClassWriter.COMPUTE_MAXS);
    [javac]                                                         ^
    [javac] /srv/gump/public/workspace/jmock2/test/org/jmock/test/unit/support/SyntheticEmptyInterfaceClassLoader.java:35: internal error; cannot instantiate ClassWriter(boolean) at net.sf.cglib.asm.ClassWriter to ()
    [javac]         ClassWriter writer = new ClassWriter(ClassWriter.COMPUTE_MAXS);
    [javac]                              ^
    [javac] /srv/gump/public/workspace/jmock2/test/org/jmock/test/unit/support/SyntheticEmptyInterfaceClassLoader.java:36: visit(int,int,java.lang.String,java.lang.String,java.lang.String[],java.lang.String) in net.sf.cglib.asm.ClassWriter cannot be applied to (int,int,java.lang.String,<nulltype>,java.lang.String,<nulltype>)
    [javac]                 writer.visit(CLASS_FORMAT_VERSION,
    [javac]                       ^
    [javac] Note: /srv/gump/public/workspace/jmock2/src/org/jmock/integration/junit4/JMock.java uses or overrides a deprecated API.
    [javac] Note: Recompile with -Xlint:deprecation for details.
    [javac] 21 errors

BUILD FAILED
/srv/gump/public/workspace/jmock2/build.xml:61: Compile failed; see the compiler error output for details.

Total time: 8 seconds
---------------------------------------------

To subscribe to this information via syndicated feeds:
- RSS: http://vmgump.apache.org/gump/public/jmock2/jmock2/rss.xml
- Atom: http://vmgump.apache.org/gump/public/jmock2/jmock2/atom.xml

============================== Gump Tracking Only ===
Produced by Gump version 2.3.
Gump Run 29000017082010, vmgump.apache.org:vmgump:29000017082010
Gump E-mail Identifier (unique within run) #8.

*********************************************************** G U M P
[GUMP@vmgump]: Project derby (in module db-derby) failed
To whom it may engage...
        
This is an automated request, but not an unsolicited one. For 
more information please visit http://gump.apache.org/nagged.html, 
and/or contact the folk at general@gump.apache.org.

Project derby has an issue affecting its community integration.
This issue affects 1 projects,
 and has been outstanding for 33 runs.
The current state of this project is 'Failed', with reason 'Build Failed'.
For reference only, the following projects are affected by this:
    - derby :  Apache Derby, 100% Java relational database.


Full details are available at:
    http://vmgump.apache.org/gump/public/db-derby/derby/index.html

That said, some information snippets are provided here.

The following annotations (debug/informational/warning/error messages) were provided:
 -INFO- Failed with reason build failed
 -INFO- Failed to extract fallback artifacts from Gump Repository



The following work was performed:
http://vmgump.apache.org/gump/public/db-derby/derby/gump_work/build_db-derby_derby.html
Work Name: build_db-derby_derby (Type: Build)
Work ended in a state of : Failed
Elapsed: 1 min 3 secs
Command Line: /usr/lib/jvm/java-6-openjdk/bin/java -Djava.awt.headless=true -Xbootclasspath/p:/srv/gump/public/workspace/xml-commons/java/external/build/xml-apis.jar:/srv/gump/public/workspace/xml-xerces2/build/xercesImpl.jar:/srv/gump/public/workspace/xml-xalan/build/xalan-unbundled.jar:/srv/gump/public/workspace/xml-xalan/build/serializer.jar org.apache.tools.ant.Main -Dgump.merge=/srv/gump/public/gump/work/merge.xml -Dbuild.sysclasspath=only -Dsane=false gump_all 
[Working Directory: /srv/gump/public/workspace/db-derby]
CLASSPATH: /usr/lib/jvm/java-6-openjdk/lib/tools.jar:/srv/gump/public/workspace/db-derby/classes:/srv/gump/public/workspace/ant/dist/lib/ant.jar:/srv/gump/public/workspace/ant/dist/lib/ant-launcher.jar:/srv/gump/public/workspace/ant/dist/lib/ant-jmf.jar:/srv/gump/public/workspace/ant/dist/lib/ant-junit.jar:/srv/gump/public/workspace/ant/dist/lib/ant-swing.jar:/srv/gump/public/workspace/ant/dist/lib/ant-apache-resolver.jar:/srv/gump/public/workspace/ant/dist/lib/ant-apache-xalan2.jar:/srv/gump/public/workspace/xml-commons/java/external/build/xml-apis-ext.jar:/srv/gump/public/workspace/jakarta-servletapi-5/jsr154/dist/lib/servlet-api.jar:/srv/gump/public/workspace/jakarta-oro/jakarta-oro-17082010.jar:/srv/gump/packages/javacc-3.1/bin/lib/javacc.jar:/srv/gump/public/workspace/junit/dist/junit-17082010.jar:/srv/gump/public/workspace/junit/dist/junit-dep-17082010.jar
---------------------------------------------
engine_169:

compile_reference:
    [javac] Compiling 11 source files to /srv/gump/public/workspace/db-derby/classes
    [javac] Compiling 1 source file to /srv/gump/public/workspace/db-derby/classes

compile_authentication:
    [javac] Compiling 2 source files to /srv/gump/public/workspace/db-derby/classes

authentication:

compile_security:
    [javac] Compiling 2 source files to /srv/gump/public/workspace/db-derby/classes

security:

compile_mbeans:
    [javac] Compiling 4 source files to /srv/gump/public/workspace/db-derby/classes

compile_io:

storage:

compile_iapi_error_jsr169:

compile_reference:
    [javac] Compiling 2 source files to /srv/gump/public/workspace/db-derby/classes

compile_util:

compile_types:
    [javac] Compiling 1 source file to /srv/gump/public/workspace/db-derby/classes
    [javac] /srv/gump/public/workspace/db-derby/java/engine/org/apache/derby/impl/jdbc/EmbedStatement.java:60: org.apache.derby.impl.jdbc.EmbedStatement is not abstract and does not override abstract method isWrapperFor(java.lang.Class) in java.sql.Wrapper
    [javac] public class EmbedStatement extends ConnectionChild
    [javac]        ^
    [javac] /srv/gump/public/workspace/db-derby/java/engine/org/apache/derby/impl/jdbc/EmbedResultSetMetaData.java:59: org.apache.derby.impl.jdbc.EmbedResultSetMetaData is not abstract and does not override abstract method isWrapperFor(java.lang.Class) in java.sql.Wrapper
    [javac] public class EmbedResultSetMetaData
    [javac]        ^
    [javac] /srv/gump/public/workspace/db-derby/java/engine/org/apache/derby/impl/jdbc/EmbedDatabaseMetaData.java:88: org.apache.derby.impl.jdbc.EmbedDatabaseMetaData is not abstract and does not override abstract method autoCommitFailureClosesAllResultSets() in java.sql.DatabaseMetaData
    [javac] public class EmbedDatabaseMetaData extends ConnectionChild 
    [javac]        ^
    [javac] 3 errors

BUILD FAILED
/srv/gump/public/workspace/db-derby/build.xml:453: The following error occurred while executing this line:
/srv/gump/public/workspace/db-derby/java/engine/build.xml:79: The following error occurred while executing this line:
/srv/gump/public/workspace/db-derby/java/engine/org/apache/derby/iapi/build.xml:65: The following error occurred while executing this line:
/srv/gump/public/workspace/db-derby/java/engine/org/apache/derby/iapi/types/build.xml:53: Compile failed; see the compiler error output for details.

Total time: 1 minute 3 seconds
---------------------------------------------

To subscribe to this information via syndicated feeds:
- RSS: http://vmgump.apache.org/gump/public/db-derby/derby/rss.xml
- Atom: http://vmgump.apache.org/gump/public/db-derby/derby/atom.xml

============================== Gump Tracking Only ===
Produced by Gump version 2.3.
Gump Run 29000017082010, vmgump.apache.org:vmgump:29000017082010
Gump E-mail Identifier (unique within run) #9.

*********************************************************** G U M P
[GUMP@vmgump]: Project lucene-java-contrib (in module lucene-java) failed
To whom it may engage...
        
This is an automated request, but not an unsolicited one. For 
more information please visit http://gump.apache.org/nagged.html, 
and/or contact the folk at general@gump.apache.org.

Project lucene-java-contrib has an issue affecting its community integration.
This issue affects 1 projects,
 and has been outstanding for 11 runs.
The current state of this project is 'Failed', with reason 'Build Failed'.
For reference only, the following projects are affected by this:
    - lucene-java-contrib :  Java Based Search Engine


Full details are available at:
    http://vmgump.apache.org/gump/public/lucene-java/lucene-java-contrib/index.html

That said, some information snippets are provided here.

The following annotations (debug/informational/warning/error messages) were provided:
 -DEBUG- Dependency on javacc exists, no need to add for property javacc.home.
 -INFO- Failed with reason build failed



The following work was performed:
http://vmgump.apache.org/gump/public/lucene-java/lucene-java-contrib/gump_work/build_lucene-java_lucene-java-contrib.html
Work Name: build_lucene-java_lucene-java-contrib (Type: Build)
Work ended in a state of : Failed
Elapsed: 17 secs
Command Line: /usr/lib/jvm/java-6-openjdk/bin/java -Djava.awt.headless=true -Xbootclasspath/p:/srv/gump/public/workspace/xml-commons/java/external/build/xml-apis.jar:/srv/gump/public/workspace/xml-xerces2/build/xercesImpl.jar org.apache.tools.ant.Main -Dgump.merge=/srv/gump/public/gump/work/merge.xml -Dbuild.sysclasspath=only -Dversion=17082010 -Djavacc.home=/srv/gump/packages/javacc-3.1 package 
[Working Directory: /srv/gump/public/workspace/lucene-java]
CLASSPATH: /usr/lib/jvm/java-6-openjdk/lib/tools.jar:/srv/gump/public/workspace/lucene-java/build/classes/demo:/srv/gump/public/workspace/lucene-java/build/classes/test:/srv/gump/public/workspace/lucene-java/contrib/db/bdb/lib/db-4.7.25.jar:/srv/gump/public/workspace/lucene-java/contrib/gdata-server/lib/gdata-client-1.0.jar:/srv/gump/public/workspace/lucene-java/build/contrib/analyzers/common/classes/java:/srv/gump/public/workspace/lucene-java/build/contrib/analyzers/smartcn/classes/java:/srv/gump/public/workspace/lucene-java/build/contrib/analyzers/stempel/classes/java:/srv/gump/public/workspace/lucene-java/build/contrib/ant/classes/java:/srv/gump/public/workspace/lucene-java/build/contrib/benchmark/classes/java:/srv/gump/public/workspace/lucene-java/build/contrib/collation/classes/java:/srv/gump/public/workspace/lucene-java/build/contrib/db/bdb-je/classes/java:/srv/gump/public/workspace/lucene-java/build/contrib/db/bdb/classes/java:/srv/gump/public/workspace/lucene-java/bui
 ld/contrib/fast-vector-highlighter/classes/java:/srv/gump/public/workspace/lucene-java/build/contrib/gdata-server/classes/java:/srv/gump/public/workspace/lucene-java/build/contrib/highlighter/classes/java:/srv/gump/public/workspace/lucene-java/build/contrib/icu/classes/java:/srv/gump/public/workspace/lucene-java/build/contrib/instantiated/classes/java:/srv/gump/public/workspace/lucene-java/build/contrib/javascript/classes/java:/srv/gump/public/workspace/lucene-java/build/contrib/lucli/classes/java:/srv/gump/public/workspace/lucene-java/build/contrib/memory/classes/java:/srv/gump/public/workspace/lucene-java/build/contrib/misc/classes/java:/srv/gump/public/workspace/lucene-java/build/contrib/queries/classes/java:/srv/gump/public/workspace/lucene-java/build/contrib/queryparser/classes/java:/srv/gump/public/workspace/lucene-java/build/contrib/regex/classes/java:/srv/gump/public/workspace/lucene-java/build/contrib/remote/classes/java:/srv/gump/public/workspace/lucene-java/build/
 contrib/similarity/classes/java:/srv/gump/public/workspace/lucene-java/build/contrib/snowball/classes/java:/srv/gump/public/workspace/lucene-java/build/contrib/spatial/classes/java:/srv/gump/public/workspace/lucene-java/build/contrib/spellchecker/classes/java:/srv/gump/public/workspace/lucene-java/build/contrib/surround/classes/java:/srv/gump/public/workspace/lucene-java/build/contrib/swing/classes/java:/srv/gump/public/workspace/lucene-java/build/contrib/wikipedia/classes/java:/srv/gump/public/workspace/lucene-java/build/contrib/wordnet/classes/java:/srv/gump/public/workspace/lucene-java/build/contrib/xml-query-parser/classes/java:/srv/gump/public/workspace/ant/dist/lib/ant.jar:/srv/gump/public/workspace/ant/dist/lib/ant-launcher.jar:/srv/gump/public/workspace/ant/dist/lib/ant-jmf.jar:/srv/gump/public/workspace/ant/dist/lib/ant-junit.jar:/srv/gump/public/workspace/ant/dist/lib/ant-swing.jar:/srv/gump/public/workspace/ant/dist/lib/ant-apache-resolver.jar:/srv/gump/public/wor
 kspace/ant/dist/lib/ant-apache-xalan2.jar:/srv/gump/packages/junit3.8.1/junit.jar:/srv/gump/public/workspace/xml-commons/java/build/resolver.jar:/srv/gump/packages/je-1.7.1/lib/je.jar:/srv/gump/public/workspace/apache-commons/digester/dist/commons-digester.jar:/srv/gump/packages/caucho-libs/hessian-3.0.8.jar:/srv/gump/public/workspace/icu4j/main/classes/core/out/lib/icu4j-core.jar:/srv/gump/public/workspace/icu4j/main/classes/collate/out/lib/icu4j-collate.jar:/srv/gump/public/workspace/icu4j/main/classes/currdata/out/lib/icu4j-currdata.jar:/srv/gump/public/workspace/icu4j/main/classes/langdata/out/lib/icu4j-langdata.jar:/srv/gump/public/workspace/icu4j/main/classes/regiondata/out/lib/icu4j-regiondata.jar:/srv/gump/public/workspace/icu4j/main/classes/translit/out/lib/icu4j-translit.jar:/srv/gump/public/workspace/icu4j/main/classes/charset/out/lib/icu4j-charset.jar:/srv/gump/public/workspace/icu4j/main/classes/localespi/out/lib/icu4j-localespi.jar:/srv/gump/public/workspace/ja
 karta-regexp/build/jakarta-regexp-17082010.jar:/srv/gump/packages/javacc-3.1/bin/lib/javacc.jar:/srv/gump/public/workspace/jline/target/jline-0.9.95-SNAPSHOT.jar:/srv/gump/packages/jtidy/jtidy-r938.jar:/srv/gump/public/workspace/junit/dist/junit-17082010.jar:/srv/gump/public/workspace/junit/dist/junit-dep-17082010.jar:/srv/gump/public/workspace/lucene-java/build/lucene-core-17082010.jar:/srv/gump/public/workspace/xml-commons/java/external/build/xml-apis-ext.jar:/srv/gump/public/workspace/apache-commons/compress/target/commons-compress-1.2-SNAPSHOT.jar:/srv/gump/public/workspace/apache-commons/logging/target/commons-logging-17082010.jar:/srv/gump/public/workspace/apache-commons/logging/target/commons-logging-api-17082010.jar:/srv/gump/public/workspace/jakarta-servletapi-5/jsr154/dist/lib/servlet-api.jar:/srv/gump/packages/nekohtml-0.9.5/nekohtml.jar
---------------------------------------------
Buildfile: /srv/gump/public/workspace/lucene-java/build.xml

jflex-uptodate-check:

jflex-notice:

javacc-uptodate-check:

javacc-notice:

init:

clover.setup:

clover.info:
     [echo] 
     [echo]       Clover not found. Code coverage reports disabled.
     [echo]   	

clover:

common.compile-core:

compile-core:

jar-core:
      [jar] Building jar: /srv/gump/public/workspace/lucene-java/build/lucene-core-17082010.jar

compile-test:
    [javac] Compiling 1 source file to /srv/gump/public/workspace/lucene-java/build/classes/test

build-contrib:
     [echo] Building ant...

compile-analyzers-common:

BUILD FAILED
/srv/gump/public/workspace/lucene-java/build.xml:546: The following error occurred while executing this line:
/srv/gump/public/workspace/lucene-java/build.xml:535: The following error occurred while executing this line:
/srv/gump/public/workspace/lucene-java/contrib/ant/build.xml:49: /srv/gump/public/workspace/modules/analysis/common does not exist.

Total time: 14 seconds
---------------------------------------------

To subscribe to this information via syndicated feeds:
- RSS: http://vmgump.apache.org/gump/public/lucene-java/lucene-java-contrib/rss.xml
- Atom: http://vmgump.apache.org/gump/public/lucene-java/lucene-java-contrib/atom.xml

============================== Gump Tracking Only ===
Produced by Gump version 2.3.
Gump Run 29000017082010, vmgump.apache.org:vmgump:29000017082010
Gump E-mail Identifier (unique within run) #12.

*********************************************************** G U M P
[GUMP@vmgump]: Project xml-security-tests (in module xml-security) failed
To whom it may engage...
        
This is an automated request, but not an unsolicited one. For 
more information please visit http://gump.apache.org/nagged.html, 
and/or contact the folk at general@gump.apache.org.

Project xml-security-tests has an issue affecting its community integration.
This issue affects 1 projects,
 and has been outstanding for 33 runs.
The current state of this project is 'Failed', with reason 'Build Failed'.
For reference only, the following projects are affected by this:
    - xml-security-tests :  XML-Signature Syntax and Processing


Full details are available at:
    http://vmgump.apache.org/gump/public/xml-security/xml-security-tests/index.html

That said, some information snippets are provided here.

The following annotations (debug/informational/warning/error messages) were provided:
 -DEBUG- Dependency on jce exists, no need to add for property lib.jce.
 -INFO- Failed with reason build failed



The following work was performed:
http://vmgump.apache.org/gump/public/xml-security/xml-security-tests/gump_work/build_xml-security_xml-security-tests.html
Work Name: build_xml-security_xml-security-tests (Type: Build)
Work ended in a state of : Failed
Elapsed: 5 secs
Command Line: /usr/lib/jvm/java-6-openjdk/bin/java -Djava.awt.headless=true -Dant.build.clonevm=true -Xbootclasspath/p:/srv/gump/public/workspace/xml-commons/java/external/build/xml-apis.jar:/srv/gump/public/workspace/xml-xerces2/build/xercesImpl.jar:/srv/gump/public/workspace/xml-xalan/build/xalan-unbundled.jar:/srv/gump/public/workspace/xml-xalan/build/serializer.jar org.apache.tools.ant.Main -Dgump.merge=/srv/gump/public/gump/work/merge.xml -Dbuild.sysclasspath=only -Djce.download.sha1=c1f0e975e8c8e0a0105787b249a50615b485d109 -Dlib.jce=/srv/gump/packages/jce/jce-jdk13-116.jar -Djce.download.md5=85c64cd754719a4bc8da7e9aa0e113fd test 
[Working Directory: /srv/gump/public/workspace/xml-security]
CLASSPATH: /usr/lib/jvm/java-6-openjdk/lib/tools.jar:/srv/gump/public/workspace/xml-security/build/test:/srv/gump/public/workspace/xml-security:/srv/gump/public/workspace/xml-security/build/xmlsec-17082010.jar:/srv/gump/public/workspace/ant/dist/lib/ant.jar:/srv/gump/public/workspace/ant/dist/lib/ant-launcher.jar:/srv/gump/public/workspace/ant/dist/lib/ant-jmf.jar:/srv/gump/public/workspace/ant/dist/lib/ant-junit.jar:/srv/gump/public/workspace/ant/dist/lib/ant-swing.jar:/srv/gump/public/workspace/ant/dist/lib/ant-apache-resolver.jar:/srv/gump/public/workspace/ant/dist/lib/ant-apache-xalan2.jar:/srv/gump/packages/junit3.8.1/junit.jar:/srv/gump/public/workspace/xml-commons/java/build/resolver.jar:/srv/gump/public/workspace/xml-commons/java/external/build/xml-apis-ext.jar:/srv/gump/packages/jce/jce-jdk13-116.jar:/srv/gump/public/workspace/apache-commons/logging/target/commons-logging-17082010.jar:/srv/gump/public/workspace/apache-commons/logging/target/commons-logging-api-170820
 10.jar:/srv/gump/public/workspace/junit/dist/junit-17082010.jar:/srv/gump/public/workspace/junit/dist/junit-dep-17082010.jar
---------------------------------------------
Buildfile: /srv/gump/public/workspace/xml-security/build.xml
  [taskdef] Could not load definitions from resource clovertasks. It could not be found.

manifest:

do.build.src:

init:
     [echo] 
     [echo] -------------------------------------------------------------------
     [echo] --------- Apache-XML-Security-J v1.4.4-SNAPSHOT [2000-2010] -----------
     [echo] -------------------------------------------------------------------
     [echo] Building with Apache Ant version 1.8.2alpha compiled on August 17 2010
     [echo] Java 1.6.0_18 located at /usr/lib/jvm/java-6-openjdk/jre 
     [echo] -------------------------------------------------------------------
     [echo] 

env.mk.dirs:

do.check.bindist:

build.src:

build.test:

build.samples:

build.jar:
      [jar] Building jar: /srv/gump/public/workspace/xml-security/build/xmlsec-1.4.4-SNAPSHOT.jar
      [jar] Building jar: /srv/gump/public/workspace/xml-security/build/xmlsecSamples-1.4.4-SNAPSHOT.jar
      [jar] Building jar: /srv/gump/public/workspace/xml-security/build/xmlsecTests-1.4.4-SNAPSHOT.jar

test:
    [mkdir] Created dir: /srv/gump/public/workspace/xml-security/build/docs/xml/junit
    [mkdir] Created dir: /srv/gump/public/workspace/xml-security/build/docs/html/junit
     [copy] Copying 1 file to /srv/gump/public/workspace/xml-security/build/libs/endorsed
     [copy] Copying 1 file to /srv/gump/public/workspace/xml-security/build/libs/endorsed
     [copy] Copying 1 file to /srv/gump/public/workspace/xml-security/build/libs/endorsed

BUILD FAILED
/srv/gump/public/workspace/xml-security/build.xml:350: Warning: Could not find file /srv/gump/public/workspace/xml-security/libs/junit-4.8.1.jar to copy.

Total time: 4 seconds
---------------------------------------------

To subscribe to this information via syndicated feeds:
- RSS: http://vmgump.apache.org/gump/public/xml-security/xml-security-tests/rss.xml
- Atom: http://vmgump.apache.org/gump/public/xml-security/xml-security-tests/atom.xml

============================== Gump Tracking Only ===
Produced by Gump version 2.3.
Gump Run 29000017082010, vmgump.apache.org:vmgump:29000017082010
Gump E-mail Identifier (unique within run) #13.

*********************************************************** G U M P
[GUMP@vmgump]: Project apache-jsieve (in module james-jsieve) failed
To whom it may engage...
        
This is an automated request, but not an unsolicited one. For 
more information please visit http://gump.apache.org/nagged.html, 
and/or contact the folk at general@gump.apache.org.

Project apache-jsieve has an issue affecting its community integration.
This issue affects 2 projects,
 and has been outstanding for 14 runs.
The current state of this project is 'Failed', with reason 'Build Failed'.
For reference only, the following projects are affected by this:
    - apache-jsieve :  Implements JSIEVE Mail Filtering Language
    - apache-jsieve-mailet :  Implements JSIEVE Mail Filtering Language


Full details are available at:
    http://vmgump.apache.org/gump/public/james-jsieve/apache-jsieve/index.html

That said, some information snippets are provided here.

The following annotations (debug/informational/warning/error messages) were provided:
 -DEBUG- Sole jar output [apache-jsieve-*[0-9T].jar] identifier set to project name
 -DEBUG- (Gump generated) Maven2 Settings in: /srv/gump/public/workspace/james-jsieve/main/gump_mvn_settings.xml
 -INFO- Failed with reason build failed
 -DEBUG- Maven POM in: /srv/gump/public/workspace/james-jsieve/main/pom.xml
 -INFO- Failed to extract fallback artifacts from Gump Repository



The following work was performed:
http://vmgump.apache.org/gump/public/james-jsieve/apache-jsieve/gump_work/build_james-jsieve_apache-jsieve.html
Work Name: build_james-jsieve_apache-jsieve (Type: Build)
Work ended in a state of : Failed
Elapsed: 28 secs
Command Line: mvn --batch-mode --settings /srv/gump/public/workspace/james-jsieve/main/gump_mvn_settings.xml package 
[Working Directory: /srv/gump/public/workspace/james-jsieve/main]
---------------------------------------------
File "ASTlocal_part.java" does not exist.  Will create one.
File "ASTdomain.java" does not exist.  Will create one.
File "AddressListParserTreeConstants.java" does not exist.  Will create one.
File "AddressListParserVisitor.java" does not exist.  Will create one.
File "JJTAddressListParserState.java" does not exist.  Will create one.
Annotated grammar generated successfully in /srv/gump/public/workspace/james-jsieve/main/target/javacc-1282017295732/node/AddressListParser.jj
Java Compiler Compiler Version 4.1 (Parser Generator)
(type "javacc" with no arguments for help)
Reading from file /srv/gump/public/workspace/james-jsieve/main/target/javacc-1282017295732/node/AddressListParser.jj . . .
Warning: Line 35, Column 5: Command line setting of "OUTPUT_DIRECTORY" modifies option value in file.
File "TokenMgrError.java" does not exist.  Will create one.
File "ParseException.java" does not exist.  Will create one.
File "Token.java" does not exist.  Will create one.
File "SimpleCharStream.java" does not exist.  Will create one.
Parser generated with 0 errors and 1 warnings.
[INFO] Processed 2 grammars
[INFO] Setting property: classpath.resource.loader.class => 'org.codehaus.plexus.velocity.ContextClassLoaderResourceLoader'.
[INFO] Setting property: velocimacro.messages.on => 'false'.
[INFO] Setting property: resource.loader => 'classpath'.
[INFO] Setting property: resource.manager.logwhenfound => 'false'.
[INFO] [remote-resources:process {execution: default}]
Downloading: http://localhost:8192/maven2/javax/mail/mail/1.4/mail-1.4.jar
348K downloaded  (mail-1.4.jar)
[INFO] [resources:resources {execution: default-resources}]
[INFO] Using 'UTF-8' encoding to copy filtered resources.
[INFO] Copying 3 resources
[INFO] Copying 3 resources
[INFO] [compiler:compile {execution: default-compile}]
[INFO] Compiling 142 source files to /srv/gump/public/workspace/james-jsieve/main/target/classes
[INFO] [bundle:manifest {execution: bundle-manifest}]
[INFO] [resources:testResources {execution: default-testResources}]
[INFO] Using 'UTF-8' encoding to copy filtered resources.
[INFO] Copying 2 resources
[INFO] Copying 3 resources
[INFO] [compiler:testCompile {execution: default-testCompile}]
[INFO] Compiling 50 source files to /srv/gump/public/workspace/james-jsieve/main/target/test-classes
[INFO] ------------------------------------------------------------------------
[ERROR] BUILD FAILURE
[INFO] ------------------------------------------------------------------------
[INFO] Compilation failure
/srv/gump/public/workspace/james-jsieve/main/src/test/java/org/apache/jsieve/AllTests.java:[31,21] package junit.swingui does not exist


[INFO] ------------------------------------------------------------------------
[INFO] For more information, run Maven with the -e switch
[INFO] ------------------------------------------------------------------------
[INFO] Total time: 27 seconds
[INFO] Finished at: Tue Aug 17 03:55:08 UTC 2010
[INFO] Final Memory: 42M/101M
[INFO] ------------------------------------------------------------------------
---------------------------------------------

To subscribe to this information via syndicated feeds:
- RSS: http://vmgump.apache.org/gump/public/james-jsieve/apache-jsieve/rss.xml
- Atom: http://vmgump.apache.org/gump/public/james-jsieve/apache-jsieve/atom.xml

============================== Gump Tracking Only ===
Produced by Gump version 2.3.
Gump Run 29000017082010, vmgump.apache.org:vmgump:29000017082010
Gump E-mail Identifier (unique within run) #17.

*********************************************************** G U M P
[GUMP@vmgump]: Project commons-jci (in module apache-commons) success, but with warnings.
To whom it may engage...
        
This is an automated request, but not an unsolicited one. For 
more information please visit http://gump.apache.org/nagged.html, 
and/or contact the folk at general@gump.apache.org.

Project commons-jci contains errors.
The current state of this project is 'Success'.

Full details are available at:
    http://vmgump.apache.org/gump/public/apache-commons/commons-jci/index.html

That said, some information snippets are provided here.

The following annotations (debug/informational/warning/error messages) were provided:
 -ERROR- Missing 'name' on <pom
 -INFO- Optional dependency velocity-engine prerequisite failed with reason build failed
 -DEBUG- (Gump generated) Maven2 Settings in: /srv/gump/public/workspace/apache-commons/jci/gump_mvn_settings.xml
 -DEBUG- Maven POM in: /srv/gump/public/workspace/apache-commons/jci/pom.xml



The following work was performed:
http://vmgump.apache.org/gump/public/apache-commons/commons-jci/gump_work/build_apache-commons_commons-jci.html
Work Name: build_apache-commons_commons-jci (Type: Build)
Work ended in a state of : Success
Elapsed: 8 secs
Command Line: mvn --batch-mode -Dpackaging=pom -DgroupId=org.apache.commons -Dfile=pom.xml -DartifactId=commons-jci -Dversion=1.1-SNAPSHOT --settings /srv/gump/public/workspace/apache-commons/jci/gump_mvn_settings.xml install:install-file 
[Working Directory: /srv/gump/public/workspace/apache-commons/jci]
---------------------------------------------
[INFO] Scanning for projects...
[INFO] Reactor build order: 
[INFO]   Commons JCI
[INFO]   fam
[INFO]   core
[INFO]   compiler-eclipse
[INFO]   compiler-janino
[INFO]   compiler-groovy
[INFO]   compiler-javac
[INFO]   compiler-rhino
[INFO]   examples
Downloading: http://localhost:8192/maven2/org/codehaus/mojo/cobertura-maven-plugin/2.2/cobertura-maven-plugin-2.2.pom

Downloading: http://localhost:8192/maven2/org/codehaus/mojo/cobertura-maven-plugin/2.2/cobertura-maven-plugin-2.2.jar

[INFO] Searching repository for plugin with prefix: 'install'.
Downloading: http://localhost:8192/maven2/org/apache/maven/wagon/wagon-ssh-external/1.0-beta-2/wagon-ssh-external-1.0-beta-2.jar

Downloading: http://localhost:8192/maven2/org/apache/maven/wagon/wagon-ssh-common/1.0-beta-2/wagon-ssh-common-1.0-beta-2.jar

[INFO] ------------------------------------------------------------------------
[INFO] Building Commons JCI
[INFO]    task-segment: [install:install-file] (aggregator-style)
[INFO] ------------------------------------------------------------------------
[INFO] [install:install-file {execution: default-cli}]
[INFO] Installing /srv/gump/public/workspace/apache-commons/jci/pom.xml to /srv/gump/public/workspace/mvnlocalrepo/shared/org/apache/commons/commons-jci/1.1-SNAPSHOT/commons-jci-1.1-SNAPSHOT.pom
[INFO] ------------------------------------------------------------------------
[INFO] BUILD SUCCESSFUL
[INFO] ------------------------------------------------------------------------
[INFO] Total time: 7 seconds
[INFO] Finished at: Tue Aug 17 04:23:04 UTC 2010
[INFO] Final Memory: 20M/49M
[INFO] ------------------------------------------------------------------------
---------------------------------------------

To subscribe to this information via syndicated feeds:
- RSS: http://vmgump.apache.org/gump/public/apache-commons/commons-jci/rss.xml
- Atom: http://vmgump.apache.org/gump/public/apache-commons/commons-jci/atom.xml

============================== Gump Tracking Only ===
Produced by Gump version 2.3.
Gump Run 29000017082010, vmgump.apache.org:vmgump:29000017082010
Gump E-mail Identifier (unique within run) #19.

*********************************************************** G U M P
[GUMP@vmgump]: Project apache-mime4j-reactor (in module james-mime4j) failed
To whom it may engage...
        
This is an automated request, but not an unsolicited one. For 
more information please visit http://gump.apache.org/nagged.html, 
and/or contact the folk at general@gump.apache.org.

Project apache-mime4j-reactor has an issue affecting its community integration.
This issue affects 1 projects,
 and has been outstanding for 7 runs.
The current state of this project is 'Failed', with reason 'Build Failed'.
For reference only, the following projects are affected by this:
    - apache-mime4j-reactor :  Java stream based MIME message parser


Full details are available at:
    http://vmgump.apache.org/gump/public/james-mime4j/apache-mime4j-reactor/index.html

That said, some information snippets are provided here.

The following annotations (debug/informational/warning/error messages) were provided:
 -INFO- Optional dependency velocity-engine prerequisite failed with reason build failed
 -INFO- Optional dependency commons-io failed with reason build failed
 -WARNING- Overriding Maven2 settings: [/srv/gump/public/workspace/james-mime4j/gump_mvn_settings.xml]
 -DEBUG- (Gump generated) Maven2 Settings in: /srv/gump/public/workspace/james-mime4j/gump_mvn_settings.xml
 -INFO- Failed with reason build failed
 -DEBUG- Maven POM in: /srv/gump/public/workspace/james-mime4j/pom.xml



The following work was performed:
http://vmgump.apache.org/gump/public/james-mime4j/apache-mime4j-reactor/gump_work/build_james-mime4j_apache-mime4j-reactor.html
Work Name: build_james-mime4j_apache-mime4j-reactor (Type: Build)
Work ended in a state of : Failed
Elapsed: 1 min 6 secs
Command Line: mvn --batch-mode --settings /srv/gump/public/workspace/james-mime4j/gump_mvn_settings.xml package 
[Working Directory: /srv/gump/public/workspace/james-mime4j]
---------------------------------------------
Tests run: 1, Failures: 0, Errors: 0, Skipped: 0, Time elapsed: 0.014 sec
Running org.apache.james.mime4j.TestUtil
Tests run: 0, Failures: 0, Errors: 0, Skipped: 0, Time elapsed: 0.001 sec
Running org.apache.james.mime4j.io.PositionInputStreamTest
Tests run: 1, Failures: 0, Errors: 0, Skipped: 0, Time elapsed: 0.002 sec
Running org.apache.james.mime4j.stream.MimeTokenNoRecurseTest
Tests run: 4, Failures: 0, Errors: 0, Skipped: 0, Time elapsed: 0.007 sec
Running org.apache.james.mime4j.parser.MimeStreamParserTest
Tests run: 11, Failures: 0, Errors: 0, Skipped: 0, Time elapsed: 0.032 sec
Running org.apache.james.mime4j.codec.DecoderUtilTest
Tests run: 13, Failures: 0, Errors: 0, Skipped: 0, Time elapsed: 0.061 sec
Running org.apache.james.mime4j.MimeExceptionTest
Tests run: 3, Failures: 0, Errors: 0, Skipped: 0, Time elapsed: 0.002 sec
Running org.apache.james.mime4j.codec.QuotedPrintableEncodeTest
Tests run: 5, Failures: 0, Errors: 0, Skipped: 0, Time elapsed: 0.01 sec
Running org.apache.james.mime4j.MimeIOExceptionTest
Tests run: 1, Failures: 0, Errors: 0, Skipped: 0, Time elapsed: 0.006 sec
Running org.apache.james.mime4j.codec.QuotedPrintableInputStreamTest
Tests run: 19, Failures: 0, Errors: 0, Skipped: 0, Time elapsed: 0.009 sec
Running org.apache.james.mime4j.stream.MimeTokenStreamBodyDescriptorTest
Tests run: 2, Failures: 0, Errors: 0, Skipped: 0, Time elapsed: 0.008 sec
Running org.apache.james.mime4j.codec.CodecUtilTest
Tests run: 5, Failures: 0, Errors: 0, Skipped: 0, Time elapsed: 0.045 sec
Running org.apache.james.mime4j.stream.MultipartStreamTest
Tests run: 2, Failures: 0, Errors: 0, Skipped: 0, Time elapsed: 0.004 sec

Results :

Tests run: 225, Failures: 0, Errors: 0, Skipped: 0

[INFO] [jar:jar {execution: default-jar}]
[INFO] Building jar: /srv/gump/public/workspace/james-mime4j/core/target/apache-mime4j-core-0.7-SNAPSHOT.jar
[INFO] [jar:test-jar {execution: default}]
[INFO] Building jar: /srv/gump/public/workspace/james-mime4j/core/target/apache-mime4j-core-0.7-SNAPSHOT-tests.jar
[INFO] [javadoc:jar {execution: javadoc-jar}]
[ERROR] Error fetching link: http://java.sun.com/j2se/1.5.0/docs/api/package-list. Ignored it.
[INFO] The goal 'org.apache.maven.plugins:maven-javadoc-plugin:2.6.1:javadoc' has not be previously called for the project: 'org.apache.james:apache-mime4j-benchmark:jar:0.7-SNAPSHOT'. Trying to invoke it...
[ERROR] MavenInvocationException: Error when invoking Maven, consult the invoker log file: /srv/gump/public/workspace/james-mime4j/core/target/invoker/maven-javadoc-plugin266258597.txt
[INFO] ------------------------------------------------------------------------
[ERROR] BUILD ERROR
[INFO] ------------------------------------------------------------------------
[INFO] MavenReportException: Error while creating archive:Error when invoking Maven, consult the invoker log file: /srv/gump/public/workspace/james-mime4j/core/target/invoker/maven-javadoc-plugin266258597.txt

[INFO] ------------------------------------------------------------------------
[INFO] For more information, run Maven with the -e switch
[INFO] ------------------------------------------------------------------------
[INFO] Total time: 1 minute 4 seconds
[INFO] Finished at: Tue Aug 17 05:02:00 UTC 2010
[INFO] Final Memory: 61M/146M
[INFO] ------------------------------------------------------------------------
---------------------------------------------

To subscribe to this information via syndicated feeds:
- RSS: http://vmgump.apache.org/gump/public/james-mime4j/apache-mime4j-reactor/rss.xml
- Atom: http://vmgump.apache.org/gump/public/james-mime4j/apache-mime4j-reactor/atom.xml

============================== Gump Tracking Only ===
Produced by Gump version 2.3.
Gump Run 29000017082010, vmgump.apache.org:vmgump:29000017082010
Gump E-mail Identifier (unique within run) #21.

*********************************************************** G U M P
[GUMP@vmgump]: Project commons-jci-reactor (in module apache-commons) failed
To whom it may engage...
        
This is an automated request, but not an unsolicited one. For 
more information please visit http://gump.apache.org/nagged.html, 
and/or contact the folk at general@gump.apache.org.

Project commons-jci-reactor has an issue affecting its community integration.
This issue affects 1 projects,
 and has been outstanding for 15 runs.
The current state of this project is 'Failed', with reason 'Build Failed'.
For reference only, the following projects are affected by this:
    - commons-jci-reactor :  Apache Commons


Full details are available at:
    http://vmgump.apache.org/gump/public/apache-commons/commons-jci-reactor/index.html

That said, some information snippets are provided here.

The following annotations (debug/informational/warning/error messages) were provided:
 -INFO- Optional dependency commons-lang failed with reason build failed
 -INFO- Optional dependency commons-io failed with reason build failed
 -WARNING- Overriding Maven2 settings: [/srv/gump/public/workspace/apache-commons/jci/gump_mvn_settings.xml]
 -DEBUG- (Gump generated) Maven2 Settings in: /srv/gump/public/workspace/apache-commons/jci/gump_mvn_settings.xml
 -INFO- Failed with reason build failed
 -DEBUG- Maven POM in: /srv/gump/public/workspace/apache-commons/jci/pom.xml
 -INFO- Project Reports in: /srv/gump/public/workspace/apache-commons/jci/compilers/groovy/target/surefire-reports



The following work was performed:
http://vmgump.apache.org/gump/public/apache-commons/commons-jci-reactor/gump_work/build_apache-commons_commons-jci-reactor.html
Work Name: build_apache-commons_commons-jci-reactor (Type: Build)
Work ended in a state of : Failed
Elapsed: 3 mins 44 secs
Command Line: mvn --batch-mode --settings /srv/gump/public/workspace/apache-commons/jci/gump_mvn_settings.xml package 
[Working Directory: /srv/gump/public/workspace/apache-commons/jci]
---------------------------------------------
Downloading: http://localhost:8192/maven2/asm/asm-analysis/2.2.1/asm-analysis-2.2.1.jar
17K downloaded  (asm-analysis-2.2.1.jar)
Downloading: http://localhost:8192/maven2/asm/asm-tree/2.2.1/asm-tree-2.2.1.jar
21K downloaded  (asm-tree-2.2.1.jar)
Downloading: http://localhost:8192/maven2/asm/asm-attrs/2.2.1/asm-attrs-2.2.1.jar


[INFO] [antrun:run {execution: javadoc.resources}]
[INFO] Executing tasks
[INFO] Executed tasks
[INFO] [remote-resources:process {execution: default}]
[INFO] [resources:resources {execution: default-resources}]
[INFO] Using 'iso-8859-1' encoding to copy filtered resources.
[INFO] Copying 0 resource to META-INF
[INFO] [compiler:compile {execution: default-compile}]
[INFO] Compiling 6 source files to /srv/gump/public/workspace/apache-commons/jci/compilers/javac/target/classes
[INFO] -------------------------------------------------------------
[ERROR] COMPILATION ERROR : 
[INFO] -------------------------------------------------------------
[ERROR] /srv/gump/public/workspace/apache-commons/jci/compilers/javac/src/main/java/org/apache/commons/jci/compilers/JavacClassLoader.java:[108,46] cannot find symbol
symbol  : constructor ClassWriter(boolean,boolean)
location: class org.objectweb.asm.ClassWriter

[ERROR] /srv/gump/public/workspace/apache-commons/jci/compilers/javac/src/main/java/org/apache/commons/jci/compilers/JavacClassLoader.java:[109,44] cannot find symbol
symbol  : method accept(org.vafer.dependency.asm.RenamingVisitor,boolean)
location: class org.objectweb.asm.ClassReader

[INFO] 2 errors 
[INFO] -------------------------------------------------------------
[INFO] ------------------------------------------------------------------------
[ERROR] BUILD FAILURE
[INFO] ------------------------------------------------------------------------
[INFO] Compilation failure

/srv/gump/public/workspace/apache-commons/jci/compilers/javac/src/main/java/org/apache/commons/jci/compilers/JavacClassLoader.java:[108,46] cannot find symbol
symbol  : constructor ClassWriter(boolean,boolean)
location: class org.objectweb.asm.ClassWriter

/srv/gump/public/workspace/apache-commons/jci/compilers/javac/src/main/java/org/apache/commons/jci/compilers/JavacClassLoader.java:[109,44] cannot find symbol
symbol  : method accept(org.vafer.dependency.asm.RenamingVisitor,boolean)
location: class org.objectweb.asm.ClassReader


[INFO] ------------------------------------------------------------------------
[INFO] For more information, run Maven with the -e switch
[INFO] ------------------------------------------------------------------------
[INFO] Total time: 3 minutes 41 seconds
[INFO] Finished at: Tue Aug 17 05:18:05 UTC 2010
[INFO] Final Memory: 77M/186M
[INFO] ------------------------------------------------------------------------
---------------------------------------------

To subscribe to this information via syndicated feeds:
- RSS: http://vmgump.apache.org/gump/public/apache-commons/commons-jci-reactor/rss.xml
- Atom: http://vmgump.apache.org/gump/public/apache-commons/commons-jci-reactor/atom.xml

============================== Gump Tracking Only ===
Produced by Gump version 2.3.
Gump Run 29000017082010, vmgump.apache.org:vmgump:29000017082010
Gump E-mail Identifier (unique within run) #23.

*********************************************************** G U M P
[GUMP@vmgump]: Project castor-xml-test (in module castor) failed
To whom it may engage...
        
This is an automated request, but not an unsolicited one. For 
more information please visit http://gump.apache.org/nagged.html, 
and/or contact the folk at general@gump.apache.org.

Project castor-xml-test has an issue affecting its community integration.
This issue affects 1 projects,
 and has been outstanding for 19 runs.
The current state of this project is 'Failed', with reason 'Build Failed'.
For reference only, the following projects are affected by this:
    - castor-xml-test :  Java to XML, SQL, LDAP bindings


Full details are available at:
    http://vmgump.apache.org/gump/public/castor/castor-xml-test/index.html

That said, some information snippets are provided here.

The following annotations (debug/informational/warning/error messages) were provided:
 -WARNING- Overriding Maven2 settings: [/srv/gump/public/workspace/castor/xml/gump_mvn_settings.xml]
 -DEBUG- (Gump generated) Maven2 Settings in: /srv/gump/public/workspace/castor/xml/gump_mvn_settings.xml
 -INFO- Failed with reason build failed
 -DEBUG- Maven POM in: /srv/gump/public/workspace/castor/xml/pom.xml



The following work was performed:
http://vmgump.apache.org/gump/public/castor/castor-xml-test/gump_work/build_castor_castor-xml-test.html
Work Name: build_castor_castor-xml-test (Type: Build)
Work ended in a state of : Failed
Elapsed: 20 secs
Command Line: mvn --batch-mode --settings /srv/gump/public/workspace/castor/xml/gump_mvn_settings.xml package 
[Working Directory: /srv/gump/public/workspace/castor/xml]
---------------------------------------------
Tests run: 4, Failures: 0, Errors: 0, Skipped: 0, Time elapsed: 0.031 sec
Running org.castor.util.TestBase64Decoder
Tests run: 2, Failures: 0, Errors: 0, Skipped: 0, Time elapsed: 0.005 sec
Running org.castor.xml.JavaNamingTest
[main] - Package name: . is not valid
[main] - Package name: .org is not valid
[main] - Package name: org. is not valid
[main] - Package name: . is not valid
[main] - Package name: .org is not valid
[main] - Package name: org. is not valid
Tests run: 10, Failures: 0, Errors: 0, Skipped: 0, Time elapsed: 0.014 sec
Running org.exolab.castor.xml.PrimitiveObjectTest
Tests run: 22, Failures: 0, Errors: 0, Skipped: 0, Time elapsed: 0.03 sec
Running org.exolab.castor.xml.Sax2EventFromStaxProducerIntegrationTest
Tests run: 4, Failures: 1, Errors: 0, Skipped: 0, Time elapsed: 0.058 sec <<< FAILURE!
Running org.exolab.castor.xml.validators.IntegerValidatorTest
Tests run: 10, Failures: 0, Errors: 0, Skipped: 0, Time elapsed: 0.037 sec
Running org.castor.util.TestHex
Tests run: 1, Failures: 0, Errors: 0, Skipped: 0, Time elapsed: 0.003 sec
Running org.castor.xml.XMLPropertiesTest
Tests run: 4, Failures: 0, Errors: 0, Skipped: 0, Time elapsed: 0.007 sec
Running org.exolab.castor.xml.XMLContextTest
Tests run: 2, Failures: 0, Errors: 0, Skipped: 0, Time elapsed: 0.145 sec
Running org.exolab.castor.xml.TestUnmarshaller
[main] - InternalContext must not be null
[main] - InternalContext must not be null
[main] - InternalContext must not be null
[main] - InternalContext must not be null
Tests run: 19, Failures: 0, Errors: 0, Skipped: 0, Time elapsed: 0.089 sec

Results :

Failed tests: 
  testPrefixUnbound(org.exolab.castor.xml.Sax2EventFromStaxProducerIntegrationTest)

Tests run: 134, Failures: 1, Errors: 0, Skipped: 0

[INFO] ------------------------------------------------------------------------
[ERROR] BUILD FAILURE
[INFO] ------------------------------------------------------------------------
[INFO] There are test failures.

Please refer to /srv/gump/public/workspace/castor/xml/target/surefire-reports for the individual test results.
[INFO] ------------------------------------------------------------------------
[INFO] For more information, run Maven with the -e switch
[INFO] ------------------------------------------------------------------------
[INFO] Total time: 19 seconds
[INFO] Finished at: Tue Aug 17 05:28:10 UTC 2010
[INFO] Final Memory: 20M/49M
[INFO] ------------------------------------------------------------------------
---------------------------------------------

To subscribe to this information via syndicated feeds:
- RSS: http://vmgump.apache.org/gump/public/castor/castor-xml-test/rss.xml
- Atom: http://vmgump.apache.org/gump/public/castor/castor-xml-test/atom.xml

============================== Gump Tracking Only ===
Produced by Gump version 2.3.
Gump Run 29000017082010, vmgump.apache.org:vmgump:29000017082010
Gump E-mail Identifier (unique within run) #24.

*********************************************************** G U M P
[GUMP@vmgump]: Project james-jsieve (in module james-jsieve) failed
To whom it may engage...
        
This is an automated request, but not an unsolicited one. For 
more information please visit http://gump.apache.org/nagged.html, 
and/or contact the folk at general@gump.apache.org.

Project james-jsieve has an issue affecting its community integration.
This issue affects 1 projects,
 and has been outstanding for 84 runs.
The current state of this project is 'Failed', with reason 'Build Failed'.
For reference only, the following projects are affected by this:
    - james-jsieve :  Implements JSIEVE Mail Filtering Language


Full details are available at:
    http://vmgump.apache.org/gump/public/james-jsieve/james-jsieve/index.html

That said, some information snippets are provided here.

The following annotations (debug/informational/warning/error messages) were provided:
 -INFO- Optional dependency apache-jsieve-mailet prerequisite failed with reason build failed
 -INFO- Optional dependency apache-jsieve failed with reason build failed
 -WARNING- Overriding Maven2 settings: [/srv/gump/public/workspace/james-jsieve/gump_mvn_settings.xml]
 -DEBUG- (Gump generated) Maven2 Settings in: /srv/gump/public/workspace/james-jsieve/gump_mvn_settings.xml
 -INFO- Failed with reason build failed
 -DEBUG- Maven POM in: /srv/gump/public/workspace/james-jsieve/pom.xml



The following work was performed:
http://vmgump.apache.org/gump/public/james-jsieve/james-jsieve/gump_work/build_james-jsieve_james-jsieve.html
Work Name: build_james-jsieve_james-jsieve (Type: Build)
Work ended in a state of : Failed
Elapsed: 22 secs
Command Line: mvn --batch-mode --settings /srv/gump/public/workspace/james-jsieve/gump_mvn_settings.xml install 
[Working Directory: /srv/gump/public/workspace/james-jsieve]
---------------------------------------------
[INFO]   Apache JAMES jSieve Utilities
[INFO]   Apache JAMES jSieve Assembly
[INFO] ------------------------------------------------------------------------
[INFO] Building Apache JAMES JSieve Project
[INFO]    task-segment: [install]
[INFO] ------------------------------------------------------------------------
[INFO] Setting property: classpath.resource.loader.class => 'org.codehaus.plexus.velocity.ContextClassLoaderResourceLoader'.
[INFO] Setting property: velocimacro.messages.on => 'false'.
[INFO] Setting property: resource.loader => 'classpath'.
[INFO] Setting property: resource.manager.logwhenfound => 'false'.
[INFO] [remote-resources:process {execution: default}]
[INFO] [site:attach-descriptor {execution: default-attach-descriptor}]
[INFO] Unable to load parent project from a relative path: Could not find the model file '/srv/gump/public/workspace/pom.xml'. for project unknown
[INFO] Parent project loaded from repository.
[INFO] [install:install {execution: default-install}]
[INFO] Installing /srv/gump/public/workspace/james-jsieve/pom.xml to /srv/gump/public/workspace/mvnlocalrepo/shared/org/apache/james/jsieve-project/0.5-SNAPSHOT/jsieve-project-0.5-SNAPSHOT.pom
[INFO] ------------------------------------------------------------------------
[INFO] Building Apache JAMES jSieve
[INFO]    task-segment: [install]
[INFO] ------------------------------------------------------------------------
[INFO] [javacc:jjtree-javacc {execution: generate-jjtree}]
[INFO] Skipping - all parsers are up to date
[INFO] [remote-resources:process {execution: default}]
[INFO] [resources:resources {execution: default-resources}]
[INFO] Using 'UTF-8' encoding to copy filtered resources.
[INFO] Copying 3 resources
[INFO] Copying 3 resources
[INFO] [compiler:compile {execution: default-compile}]
[INFO] Nothing to compile - all classes are up to date
[INFO] [bundle:manifest {execution: bundle-manifest}]
[INFO] [resources:testResources {execution: default-testResources}]
[INFO] Using 'UTF-8' encoding to copy filtered resources.
[INFO] Copying 2 resources
[INFO] Copying 3 resources
[INFO] [compiler:testCompile {execution: default-testCompile}]
[INFO] Compiling 36 source files to /srv/gump/public/workspace/james-jsieve/main/target/test-classes
[INFO] ------------------------------------------------------------------------
[ERROR] BUILD FAILURE
[INFO] ------------------------------------------------------------------------
[INFO] Compilation failure
/srv/gump/public/workspace/james-jsieve/main/src/test/java/org/apache/jsieve/AllTests.java:[31,21] package junit.swingui does not exist


[INFO] ------------------------------------------------------------------------
[INFO] For more information, run Maven with the -e switch
[INFO] ------------------------------------------------------------------------
[INFO] Total time: 21 seconds
[INFO] Finished at: Tue Aug 17 05:30:18 UTC 2010
[INFO] Final Memory: 45M/109M
[INFO] ------------------------------------------------------------------------
---------------------------------------------

To subscribe to this information via syndicated feeds:
- RSS: http://vmgump.apache.org/gump/public/james-jsieve/james-jsieve/rss.xml
- Atom: http://vmgump.apache.org/gump/public/james-jsieve/james-jsieve/atom.xml

============================== Gump Tracking Only ===
Produced by Gump version 2.3.
Gump Run 29000017082010, vmgump.apache.org:vmgump:29000017082010
Gump E-mail Identifier (unique within run) #26.

*********************************************************** G U M P
[GUMP@vmgump]: Project castor-test (in module castor) failed
To whom it may engage...
        
This is an automated request, but not an unsolicited one. For 
more information please visit http://gump.apache.org/nagged.html, 
and/or contact the folk at general@gump.apache.org.

Project castor-test has an issue affecting its community integration.
This issue affects 1 projects,
 and has been outstanding for 19 runs.
The current state of this project is 'Failed', with reason 'Build Failed'.
For reference only, the following projects are affected by this:
    - castor-test :  Java to XML, SQL, LDAP bindings


Full details are available at:
    http://vmgump.apache.org/gump/public/castor/castor-test/index.html

That said, some information snippets are provided here.

The following annotations (debug/informational/warning/error messages) were provided:
 -WARNING- Overriding Maven2 settings: [/srv/gump/public/workspace/castor/gump_mvn_settings.xml]
 -DEBUG- (Gump generated) Maven2 Settings in: /srv/gump/public/workspace/castor/gump_mvn_settings.xml
 -INFO- Failed with reason build failed
 -DEBUG- Maven POM in: /srv/gump/public/workspace/castor/pom.xml



The following work was performed:
http://vmgump.apache.org/gump/public/castor/castor-test/gump_work/build_castor_castor-test.html
Work Name: build_castor_castor-test (Type: Build)
Work ended in a state of : Failed
Elapsed: 28 secs
Command Line: mvn --batch-mode --settings /srv/gump/public/workspace/castor/gump_mvn_settings.xml package 
[Working Directory: /srv/gump/public/workspace/castor]
---------------------------------------------
Tests run: 4, Failures: 0, Errors: 0, Skipped: 0, Time elapsed: 0.03 sec
Running org.castor.util.TestBase64Decoder
Tests run: 2, Failures: 0, Errors: 0, Skipped: 0, Time elapsed: 0.006 sec
Running org.castor.xml.JavaNamingTest
[main] - Package name: . is not valid
[main] - Package name: .org is not valid
[main] - Package name: org. is not valid
[main] - Package name: . is not valid
[main] - Package name: .org is not valid
[main] - Package name: org. is not valid
Tests run: 10, Failures: 0, Errors: 0, Skipped: 0, Time elapsed: 0.022 sec
Running org.exolab.castor.xml.PrimitiveObjectTest
Tests run: 22, Failures: 0, Errors: 0, Skipped: 0, Time elapsed: 0.038 sec
Running org.exolab.castor.xml.Sax2EventFromStaxProducerIntegrationTest
Tests run: 4, Failures: 1, Errors: 0, Skipped: 0, Time elapsed: 0.095 sec <<< FAILURE!
Running org.exolab.castor.xml.validators.IntegerValidatorTest
Tests run: 10, Failures: 0, Errors: 0, Skipped: 0, Time elapsed: 0.044 sec
Running org.castor.util.TestHex
Tests run: 1, Failures: 0, Errors: 0, Skipped: 0, Time elapsed: 0.023 sec
Running org.castor.xml.XMLPropertiesTest
Tests run: 4, Failures: 0, Errors: 0, Skipped: 0, Time elapsed: 0.008 sec
Running org.exolab.castor.xml.XMLContextTest
Tests run: 2, Failures: 0, Errors: 0, Skipped: 0, Time elapsed: 1.256 sec
Running org.exolab.castor.xml.TestUnmarshaller
[main] - InternalContext must not be null
[main] - InternalContext must not be null
[main] - InternalContext must not be null
[main] - InternalContext must not be null
Tests run: 19, Failures: 0, Errors: 0, Skipped: 0, Time elapsed: 0.099 sec

Results :

Failed tests: 
  testPrefixUnbound(org.exolab.castor.xml.Sax2EventFromStaxProducerIntegrationTest)

Tests run: 134, Failures: 1, Errors: 0, Skipped: 0

[INFO] ------------------------------------------------------------------------
[ERROR] BUILD FAILURE
[INFO] ------------------------------------------------------------------------
[INFO] There are test failures.

Please refer to /srv/gump/public/workspace/castor/xml/target/surefire-reports for the individual test results.
[INFO] ------------------------------------------------------------------------
[INFO] For more information, run Maven with the -e switch
[INFO] ------------------------------------------------------------------------
[INFO] Total time: 27 seconds
[INFO] Finished at: Tue Aug 17 05:46:45 UTC 2010
[INFO] Final Memory: 36M/86M
[INFO] ------------------------------------------------------------------------
---------------------------------------------

To subscribe to this information via syndicated feeds:
- RSS: http://vmgump.apache.org/gump/public/castor/castor-test/rss.xml
- Atom: http://vmgump.apache.org/gump/public/castor/castor-test/atom.xml

============================== Gump Tracking Only ===
Produced by Gump version 2.3.
Gump Run 29000017082010, vmgump.apache.org:vmgump:29000017082010
Gump E-mail Identifier (unique within run) #27.

*********************************************************** G U M P
[GUMP@vmgump]: Project camel-spring-test (in module camel) failed
To whom it may engage...
        
This is an automated request, but not an unsolicited one. For 
more information please visit http://gump.apache.org/nagged.html, 
and/or contact the folk at general@gump.apache.org.

Project camel-spring-test has an issue affecting its community integration.
This issue affects 1 projects,
 and has been outstanding for 6 runs.
The current state of this project is 'Failed', with reason 'Build Failed'.
For reference only, the following projects are affected by this:
    - camel-spring-test :  Integration framework based on known Enterprise Integration
...


Full details are available at:
    http://vmgump.apache.org/gump/public/camel/camel-spring-test/index.html

That said, some information snippets are provided here.

The following annotations (debug/informational/warning/error messages) were provided:
 -WARNING- Overriding Maven2 settings: [/srv/gump/public/workspace/camel/components/camel-spring/gump_mvn_settings.xml]
 -DEBUG- (Gump generated) Maven2 Settings in: /srv/gump/public/workspace/camel/components/camel-spring/gump_mvn_settings.xml
 -INFO- Failed with reason build failed
 -DEBUG- Maven POM in: /srv/gump/public/workspace/camel/components/camel-spring/pom.xml
 -INFO- Project Reports in: /srv/gump/public/workspace/camel/components/camel-spring/target/surefire-reports



The following work was performed:
http://vmgump.apache.org/gump/public/camel/camel-spring-test/gump_work/build_camel_camel-spring-test.html
Work Name: build_camel_camel-spring-test (Type: Build)
Work ended in a state of : Failed
Elapsed: 15 mins 10 secs
Command Line: mvn --batch-mode --settings /srv/gump/public/workspace/camel/components/camel-spring/gump_mvn_settings.xml test 
[Working Directory: /srv/gump/public/workspace/camel/components/camel-spring]
---------------------------------------------
Running org.apache.camel.spring.issues.contextscan2.SpringRouteIsComponentAnnotated2Test
Tests run: 1, Failures: 0, Errors: 0, Skipped: 0, Time elapsed: 0.933 sec
Running org.apache.camel.spring.processor.SpringTokenizerTest
Tests run: 1, Failures: 0, Errors: 0, Skipped: 0, Time elapsed: 0.85 sec
Running org.apache.camel.spring.processor.SpringSplitterNoStopOnExceptionTest
Tests run: 2, Failures: 0, Errors: 0, Skipped: 0, Time elapsed: 1.643 sec
Running org.apache.camel.spring.processor.SpringInterceptSendToEndpointTest
Tests run: 1, Failures: 0, Errors: 0, Skipped: 0, Time elapsed: 0.894 sec
Running org.apache.camel.spring.config.SpringProduceInjectedPrototypeBeanTest
Tests run: 2, Failures: 0, Errors: 0, Skipped: 0, Time elapsed: 1.73 sec
Running org.apache.camel.spring.file.SpringFileConsumerPreMoveIssueTest
Tests run: 1, Failures: 0, Errors: 0, Skipped: 0, Time elapsed: 2.981 sec
Running org.apache.camel.spring.processor.onexception.RedeliveryPolicyReTest
Tests run: 2, Failures: 0, Errors: 0, Skipped: 0, Time elapsed: 2.762 sec
Running org.apache.camel.spring.example.PojoConsumerTest
Tests run: 1, Failures: 0, Errors: 0, Skipped: 0, Time elapsed: 1.392 sec
Running org.apache.camel.spring.interceptor.SpringTransactionalClientDataWithOnExceptionAndRollbackUsingTransactedTest
Tests run: 2, Failures: 0, Errors: 0, Skipped: 0, Time elapsed: 1.622 sec
Running org.apache.camel.spring.processor.SpringInterceptSendToEndpointDynamicTest
Tests run: 2, Failures: 0, Errors: 0, Skipped: 0, Time elapsed: 1.679 sec
Running org.apache.camel.spring.processor.SpringCBRHeaderPredicateTest
Tests run: 1, Failures: 0, Errors: 0, Skipped: 0, Time elapsed: 0.838 sec
Running org.apache.camel.spring.config.RouteBuilderRef2Test
Tests run: 1, Failures: 0, Errors: 0, Skipped: 0, Time elapsed: 0.876 sec

Results :

Tests in error: 
  testXMLRouteLoading(org.apache.camel.spring.config.CamelContextFactoryBeanTest)
  testClassPathRouteLoading(org.apache.camel.spring.config.CamelContextFactoryBeanTest)
  testClassPathRouteLoadingUsingNamespaces(org.apache.camel.spring.config.CamelContextFactoryBeanTest)
  testGenericApplicationContextUsingNamespaces(org.apache.camel.spring.config.CamelContextFactoryBeanTest)
  testRouteBuilderRef(org.apache.camel.spring.config.CamelContextFactoryBeanTest)
  testAutoStartup(org.apache.camel.spring.config.CamelContextFactoryBeanTest)

Tests run: 728, Failures: 0, Errors: 6, Skipped: 0

[INFO] ------------------------------------------------------------------------
[ERROR] BUILD FAILURE
[INFO] ------------------------------------------------------------------------
[INFO] There are test failures.

Please refer to /srv/gump/public/workspace/camel/components/camel-spring/target/surefire-reports for the individual test results.
[INFO] ------------------------------------------------------------------------
[INFO] For more information, run Maven with the -e switch
[INFO] ------------------------------------------------------------------------
[INFO] Total time: 15 minutes 3 seconds
[INFO] Finished at: Tue Aug 17 06:30:57 UTC 2010
[INFO] Final Memory: 66M/159M
[INFO] ------------------------------------------------------------------------
---------------------------------------------

To subscribe to this information via syndicated feeds:
- RSS: http://vmgump.apache.org/gump/public/camel/camel-spring-test/rss.xml
- Atom: http://vmgump.apache.org/gump/public/camel/camel-spring-test/atom.xml

============================== Gump Tracking Only ===
Produced by Gump version 2.3.
Gump Run 29000017082010, vmgump.apache.org:vmgump:29000017082010
Gump E-mail Identifier (unique within run) #30.

*********************************************************** G U M P
[GUMP@vmgump]: Project htmlunit (in module htmlunit) failed
To whom it may engage...
        
This is an automated request, but not an unsolicited one. For 
more information please visit http://gump.apache.org/nagged.html, 
and/or contact the folk at general@gump.apache.org.

Project htmlunit has an issue affecting its community integration.
This issue affects 1 projects,
 and has been outstanding for 104 runs.
The current state of this project is 'Failed', with reason 'Build Failed'.
For reference only, the following projects are affected by this:
    - htmlunit :  A tool for testing web based applications


Full details are available at:
    http://vmgump.apache.org/gump/public/htmlunit/htmlunit/index.html

That said, some information snippets are provided here.

The following annotations (debug/informational/warning/error messages) were provided:
 -DEBUG- Sole jar output [htmlunit-*[0-9T].jar] identifier set to project name
 -INFO- Optional dependency commons-lang failed with reason build failed
 -INFO- Optional dependency gsbase failed with reason build failed
 -INFO- Optional dependency commons-fileupload prerequisite failed with reason build failed
 -INFO- Optional dependency commons-io failed with reason build failed
 -INFO- Optional dependency apache-mime4j-reactor failed with reason build failed
 -DEBUG- (Gump generated) Maven2 Settings in: /srv/gump/public/workspace/htmlunit/gump_mvn_settings.xml
 -INFO- Failed with reason build failed
 -DEBUG- Maven POM in: /srv/gump/public/workspace/htmlunit/pom.xml
 -INFO- Failed to extract fallback artifacts from Gump Repository



The following work was performed:
http://vmgump.apache.org/gump/public/htmlunit/htmlunit/gump_work/build_htmlunit_htmlunit.html
Work Name: build_htmlunit_htmlunit (Type: Build)
Work ended in a state of : Failed
Elapsed: 1 min 28 secs
Command Line: mvn --batch-mode --settings /srv/gump/public/workspace/htmlunit/gump_mvn_settings.xml package 
[Working Directory: /srv/gump/public/workspace/htmlunit]
---------------------------------------------

Downloading: http://localhost:8192/maven2/org/seleniumhq/selenium/selenium-firefox-driver/2.0a5/selenium-firefox-driver-2.0a5.pom

Downloading: http://localhost:8192/maven2/org/seleniumhq/selenium/selenium-remote-client/2.0a5/selenium-remote-client-2.0a5.pom

Downloading: http://localhost:8192/maven2/org/seleniumhq/selenium/selenium-remote-common/2.0a5/selenium-remote-common-2.0a5.pom

Downloading: http://localhost:8192/maven2/org/apache/james/apache-mime4j/0.6/apache-mime4j-0.6.jar
Downloading: http://localhost:8192/maven2/net/sourceforge/cssparser/cssparser/0.9.5/cssparser-0.9.5.jar
Downloading: http://localhost:8192/maven2/org/apache/httpcomponents/httpclient/4.0.1/httpclient-4.0.1.jar
Downloading: http://localhost:8192/maven2/net/sourceforge/htmlunit/htmlunit-core-js/2.8/htmlunit-core-js-2.8.jar
Downloading: http://localhost:8192/maven2/net/sourceforge/nekohtml/nekohtml/1.9.14/nekohtml-1.9.14.jar
322K downloaded  (httpclient-4.0.1.jar)
Downloading: http://localhost:8192/maven2/org/w3c/css/sac/1.3/sac-1.3.jar




Downloading: http://localhost:8192/maven2/org/apache/httpcomponents/httpcore/4.0.1/httpcore-4.0.1.jar
175K downloaded  (httpcore-4.0.1.jar)
Downloading: http://localhost:8192/maven2/org/apache/httpcomponents/httpmime/4.0.1/httpmime-4.0.1.jar
25K downloaded  (httpmime-4.0.1.jar)

[INFO] [compiler:compile {execution: default-compile}]
[INFO] Compiling 443 source files to /srv/gump/public/workspace/htmlunit/target/classes
[INFO] -------------------------------------------------------------
[ERROR] COMPILATION ERROR : 
[INFO] -------------------------------------------------------------
[ERROR] /srv/gump/public/workspace/htmlunit/src/main/java/com/gargoylesoftware/htmlunit/HttpWebConnection.java:[339,65] incompatible types
found   : org.apache.http.entity.mime.FormBodyPart
required: org.apache.james.mime4j.message.BodyPart

[INFO] 1error
[INFO] -------------------------------------------------------------
[INFO] ------------------------------------------------------------------------
[ERROR] BUILD FAILURE
[INFO] ------------------------------------------------------------------------
[INFO] Compilation failure
/srv/gump/public/workspace/htmlunit/src/main/java/com/gargoylesoftware/htmlunit/HttpWebConnection.java:[339,65] incompatible types
found   : org.apache.http.entity.mime.FormBodyPart
required: org.apache.james.mime4j.message.BodyPart


[INFO] ------------------------------------------------------------------------
[INFO] For more information, run Maven with the -e switch
[INFO] ------------------------------------------------------------------------
[INFO] Total time: 1 minute 25 seconds
[INFO] Finished at: Tue Aug 17 06:34:12 UTC 2010
[INFO] Final Memory: 38M/126M
[INFO] ------------------------------------------------------------------------
---------------------------------------------

To subscribe to this information via syndicated feeds:
- RSS: http://vmgump.apache.org/gump/public/htmlunit/htmlunit/rss.xml
- Atom: http://vmgump.apache.org/gump/public/htmlunit/htmlunit/atom.xml

============================== Gump Tracking Only ===
Produced by Gump version 2.3.
Gump Run 29000017082010, vmgump.apache.org:vmgump:29000017082010
Gump E-mail Identifier (unique within run) #31.

*********************************************************** G U M P
[GUMP@vmgump]: Project james-imap-test (in module james-imap) failed
To whom it may engage...
        
This is an automated request, but not an unsolicited one. For 
more information please visit http://gump.apache.org/nagged.html, 
and/or contact the folk at general@gump.apache.org.

Project james-imap-test has an issue affecting its community integration.
This issue affects 1 projects,
 and has been outstanding for 4 runs.
The current state of this project is 'Failed', with reason 'Build Failed'.
For reference only, the following projects are affected by this:
    - james-imap-test :  A library providing a flexible codec for IMAP, command proce...


Full details are available at:
    http://vmgump.apache.org/gump/public/james-imap/james-imap-test/index.html

That said, some information snippets are provided here.

The following annotations (debug/informational/warning/error messages) were provided:
 -WARNING- Overriding Maven2 settings: [/srv/gump/public/workspace/james-imap/gump_mvn_settings.xml]
 -DEBUG- (Gump generated) Maven2 Settings in: /srv/gump/public/workspace/james-imap/gump_mvn_settings.xml
 -INFO- Failed with reason build failed
 -DEBUG- Maven POM in: /srv/gump/public/workspace/james-imap/pom.xml



The following work was performed:
http://vmgump.apache.org/gump/public/james-imap/james-imap-test/gump_work/build_james-imap_james-imap-test.html
Work Name: build_james-imap_james-imap-test (Type: Build)
Work ended in a state of : Failed
Elapsed: 7 mins 9 secs
Command Line: mvn --batch-mode --settings /srv/gump/public/workspace/james-imap/gump_mvn_settings.xml test 
[Working Directory: /srv/gump/public/workspace/james-imap]
---------------------------------------------

Results :

Tests in error: 
  testCheckUS(org.apache.james.imap.jcr.SelectedStateTest)
  testExpungeUS(org.apache.james.imap.jcr.SelectedStateTest)
  testSearchUS(org.apache.james.imap.jcr.SelectedStateTest)
  testFetchSingleMessageUS(org.apache.james.imap.jcr.SelectedStateTest)
  testFetchMultipleMessagesUS(org.apache.james.imap.jcr.SelectedStateTest)
  testFetchPeekUS(org.apache.james.imap.jcr.SelectedStateTest)
  testStoreUS(org.apache.james.imap.jcr.SelectedStateTest)
  testCopyUS(org.apache.james.imap.jcr.SelectedStateTest)
  testUidUS(org.apache.james.imap.jcr.SelectedStateTest)
  testCheckITALY(org.apache.james.imap.jcr.SelectedStateTest)
  testExpungeITALY(org.apache.james.imap.jcr.SelectedStateTest)
  testSearchITALY(org.apache.james.imap.jcr.SelectedStateTest)
  testFetchSingleMessageITALY(org.apache.james.imap.jcr.SelectedStateTest)
  testFetchMultipleMessagesITALY(org.apache.james.imap.jcr.SelectedStateTest)
  testFetchPeekITALY(org.apache.james.imap.jcr.SelectedStateTest)
  testStoreITALY(org.apache.james.imap.jcr.SelectedStateTest)
  testCopyITALY(org.apache.james.imap.jcr.SelectedStateTest)
  testUidITALY(org.apache.james.imap.jcr.SelectedStateTest)
  testCheckKOREA(org.apache.james.imap.jcr.SelectedStateTest)
  testExpungeKOREA(org.apache.james.imap.jcr.SelectedStateTest)
  testSearchKOREA(org.apache.james.imap.jcr.SelectedStateTest)
  testFetchSingleMessageKOREA(org.apache.james.imap.jcr.SelectedStateTest)
  testFetchMultipleMessagesKOREA(org.apache.james.imap.jcr.SelectedStateTest)
  testFetchPeekKOREA(org.apache.james.imap.jcr.SelectedStateTest)
  testStoreKOREA(org.apache.james.imap.jcr.SelectedStateTest)
  testCopyKOREA(org.apache.james.imap.jcr.SelectedStateTest)
  testUidKOREA(org.apache.james.imap.jcr.SelectedStateTest)
  testNamespaceUS(org.apache.james.imap.jcr.SelectedStateTest)
  testNamespaceITALY(org.apache.james.imap.jcr.SelectedStateTest)
  testNamespaceKOREA(org.apache.james.imap.jcr.SelectedStateTest)

Tests run: 293, Failures: 0, Errors: 293, Skipped: 0

[INFO] ------------------------------------------------------------------------
[ERROR] BUILD FAILURE
[INFO] ------------------------------------------------------------------------
[INFO] There are test failures.

Please refer to /srv/gump/public/workspace/james-imap/jcr/target/surefire-reports for the individual test results.
[INFO] ------------------------------------------------------------------------
[INFO] For more information, run Maven with the -e switch
[INFO] ------------------------------------------------------------------------
[INFO] Total time: 7 minutes 7 seconds
[INFO] Finished at: Tue Aug 17 07:55:31 UTC 2010
[INFO] Final Memory: 51M/122M
[INFO] ------------------------------------------------------------------------
---------------------------------------------

To subscribe to this information via syndicated feeds:
- RSS: http://vmgump.apache.org/gump/public/james-imap/james-imap-test/rss.xml
- Atom: http://vmgump.apache.org/gump/public/james-imap/james-imap-test/atom.xml

============================== Gump Tracking Only ===
Produced by Gump version 2.3.
Gump Run 29000017082010, vmgump.apache.org:vmgump:29000017082010
Gump E-mail Identifier (unique within run) #32.

*********************************************************** G U M P
[GUMP@vmgump]: Project tapestry (in module tapestry) failed
To whom it may engage...
        
This is an automated request, but not an unsolicited one. For 
more information please visit http://gump.apache.org/nagged.html, 
and/or contact the folk at general@gump.apache.org.

Project tapestry has an issue affecting its community integration.
This issue affects 1 projects,
 and has been outstanding for 20 runs.
The current state of this project is 'Failed', with reason 'Build Failed'.
For reference only, the following projects are affected by this:
    - tapestry :  Component-based web application framework organized around i...


Full details are available at:
    http://vmgump.apache.org/gump/public/tapestry/tapestry/index.html

That said, some information snippets are provided here.

The following annotations (debug/informational/warning/error messages) were provided:
 -INFO- Optional dependency commons-lang failed with reason build failed
 -INFO- Optional dependency commons-fileupload prerequisite failed with reason build failed
 -INFO- Optional dependency commons-io failed with reason build failed
 -DEBUG- (Gump generated) Maven2 Settings in: /srv/gump/public/workspace/tapestry/gump_mvn_settings.xml
 -INFO- Failed with reason build failed
 -DEBUG- Maven POM in: /srv/gump/public/workspace/tapestry/pom.xml
 -INFO- Failed to extract fallback artifacts from Gump Repository



The following work was performed:
http://vmgump.apache.org/gump/public/tapestry/tapestry/gump_work/build_tapestry_tapestry.html
Work Name: build_tapestry_tapestry (Type: Build)
Work ended in a state of : Failed
Elapsed: 4 mins 4 secs
Command Line: mvn --batch-mode -DskipTests=true --settings /srv/gump/public/workspace/tapestry/gump_mvn_settings.xml package 
[Working Directory: /srv/gump/public/workspace/tapestry]
---------------------------------------------
Downloading: http://antlr.org/antlr-snapshot/org/antlr/antlr/3.1.1/antlr-3.1.1.pom
[INFO] Unable to find resource 'org.antlr:antlr:pom:3.1.1' in repository antlr-snapshot (http://antlr.org/antlr-snapshot)
Downloading: http://localhost:8192/maven2/org/antlr/antlr/3.1.1/antlr-3.1.1.pom

Downloading: http://antlr.org/antlr-snapshot/org/antlr/antlr/3.1.1/antlr-3.1.1.jar
[INFO] Unable to find resource 'org.antlr:antlr:jar:3.1.1' in repository antlr-snapshot (http://antlr.org/antlr-snapshot)
Downloading: http://localhost:8192/maven2/org/antlr/antlr/3.1.1/antlr-3.1.1.jar

[INFO] [antlr3:antlr {execution: default}]
org/apache/tapestry5/internal/antlr/PropertyExpressionLexer.g
org/apache/tapestry5/internal/antlr/PropertyExpressionParser.g
Downloading: http://localhost:8192/maven2/org/antlr/antlr-runtime/3.1.1/antlr-runtime-3.1.1.pom

Downloading: http://localhost:8192/maven2/org/codehaus/groovy/groovy-all/1.7.4/groovy-all-1.7.4.pom

Downloading: http://localhost:8192/maven2/org/antlr/antlr-runtime/3.1.1/antlr-runtime-3.1.1.jar
Downloading: http://localhost:8192/maven2/org/codehaus/groovy/groovy-all/1.7.4/groovy-all-1.7.4.jar


[INFO] [remote-resources:process {execution: default}]
[INFO] [resources:resources {execution: default-resources}]
[INFO] Using 'UTF-8' encoding to copy filtered resources.
[INFO] Copying 3 resources
[INFO] Copying 178 resources
[INFO] Copying 3 resources
[INFO] [compiler:compile {execution: default-compile}]
[INFO] Compiling 919 source files to /srv/gump/public/workspace/tapestry/tapestry-core/target/classes
[INFO] ------------------------------------------------------------------------
[ERROR] BUILD FAILURE
[INFO] ------------------------------------------------------------------------
[INFO] Compilation failure

/srv/gump/public/workspace/tapestry/tapestry-core/src/main/java/org/apache/tapestry5/internal/transform/ComponentWorker.java:[124,20] setPublishedParameters(java.util.List<java.lang.String>) in org.apache.tapestry5.model.MutableEmbeddedComponentModel cannot be applied to (java.util.List<java.lang.Object>)

/srv/gump/public/workspace/tapestry/tapestry-core/src/main/java/org/apache/tapestry5/internal/services/MarkupWriterImpl.java:[264,63] incompatible types
found   : java.lang.Object
required: org.apache.tapestry5.MarkupWriterListener

/srv/gump/public/workspace/tapestry/tapestry-core/src/main/java/org/apache/tapestry5/internal/services/MarkupWriterImpl.java:[279,63] incompatible types
found   : java.lang.Object
required: org.apache.tapestry5.MarkupWriterListener


[INFO] ------------------------------------------------------------------------
[INFO] For more information, run Maven with the -e switch
[INFO] ------------------------------------------------------------------------
[INFO] Total time: 4 minutes 2 seconds
[INFO] Finished at: Tue Aug 17 08:06:19 UTC 2010
[INFO] Final Memory: 126M/301M
[INFO] ------------------------------------------------------------------------
---------------------------------------------

To subscribe to this information via syndicated feeds:
- RSS: http://vmgump.apache.org/gump/public/tapestry/tapestry/rss.xml
- Atom: http://vmgump.apache.org/gump/public/tapestry/tapestry/atom.xml

============================== Gump Tracking Only ===
Produced by Gump version 2.3.
Gump Run 29000017082010, vmgump.apache.org:vmgump:29000017082010
Gump E-mail Identifier (unique within run) #33.

*********************************************************** G U M P
[GUMP@vmgump]: Project uddi4j (in module uddi4j) failed
To whom it may engage...
        
This is an automated request, but not an unsolicited one. For 
more information please visit http://gump.apache.org/nagged.html, 
and/or contact the folk at general@gump.apache.org.

Project uddi4j has an issue affecting its community integration.
This issue affects 1 projects,
 and has been outstanding for 16 runs.
The current state of this project is 'Failed', with reason 'Build Failed'.
For reference only, the following projects are affected by this:
    - uddi4j :  UDDI client


Full details are available at:
    http://vmgump.apache.org/gump/public/uddi4j/uddi4j/index.html

That said, some information snippets are provided here.

The following annotations (debug/informational/warning/error messages) were provided:
 -DEBUG- Sole jar output [uddi4j.jar] identifier set to project name
 -INFO- Failed with reason build failed
 -INFO- Failed to extract fallback artifacts from Gump Repository



The following work was performed:
http://vmgump.apache.org/gump/public/uddi4j/uddi4j/gump_work/build_uddi4j_uddi4j.html
Work Name: build_uddi4j_uddi4j (Type: Build)
Work ended in a state of : Failed
Elapsed: 1 sec
Command Line: /usr/lib/jvm/java-6-openjdk/bin/java -Djava.awt.headless=true -Xbootclasspath/p:/srv/gump/public/workspace/xml-commons/java/external/build/xml-apis.jar:/srv/gump/public/workspace/xml-xerces2/build/xercesImpl.jar org.apache.tools.ant.Main -Dgump.merge=/srv/gump/public/gump/work/merge.xml -Dbuild.sysclasspath=only -Djavac.executable=jikes -Dbuild.compiler=jikes dist 
[Working Directory: /srv/gump/public/workspace/uddi4j]
CLASSPATH: /usr/lib/jvm/java-6-openjdk/lib/tools.jar:/srv/gump/public/workspace/uddi4j/build/classes:/srv/gump/public/workspace/xml-commons/java/external/build/xml-apis-ext.jar:/srv/gump/public/workspace/ant/dist/lib/ant.jar:/srv/gump/public/workspace/ant/dist/lib/ant-launcher.jar:/srv/gump/public/workspace/ant/dist/lib/ant-jmf.jar:/srv/gump/public/workspace/ant/dist/lib/ant-junit.jar:/srv/gump/public/workspace/ant/dist/lib/ant-swing.jar:/srv/gump/public/workspace/ant/dist/lib/ant-apache-resolver.jar:/srv/gump/public/workspace/ant/dist/lib/ant-apache-xalan2.jar:/srv/gump/packages/junit3.8.1/junit.jar:/srv/gump/public/workspace/xml-commons/java/build/resolver.jar:/srv/gump/public/workspace/ws-soap/java/build/lib/soap.jar:/srv/gump/public/workspace/ws-axis/build/lib/axis.jar:/srv/gump/public/workspace/ws-axis/build/lib/axis-ant.jar:/srv/gump/public/workspace/ws-axis/build/lib/jaxrpc.jar:/srv/gump/public/workspace/ws-axis/build/lib/saaj.jar:/srv/gump/packages/jsse1.0.3/lib/jsse.
 jar:/srv/gump/packages/jsse1.0.3/lib/jnet.jar:/srv/gump/packages/jsse1.0.3/lib/jcert.jar:/srv/gump/packages/jaf-1.1ea/activation.jar
---------------------------------------------
Buildfile: /srv/gump/public/workspace/uddi4j/build.xml

init:
    [mkdir] Created dir: /srv/gump/public/workspace/uddi4j/build
     [echo] UDDI4J build classpath = /srv/gump/public/workspace/uddi4j/xerces.jar;:/srv/gump/public/workspace/uddi4j/j2ee.jar:/srv/gump/public/workspace/uddi4j/saaj.jar:/srv/gump/public/workspace/uddi4j/soap.jar:/srv/gump/public/workspace/uddi4j/axis.jar:/srv/gump/public/workspace/uddi4j/hpsoap.jar
     [echo] SOAP transport support will be built for those transports.
     [echo] found in the classpath, indicating available = true below.
     [echo] 
     [echo] Apache SOAP available = true
     [echo] Apache Axis available = true
     [echo] HP SOAP available = ${hp-soap.available}

compile:
    [mkdir] Created dir: /srv/gump/public/workspace/uddi4j/build/classes
    [javac] Since compiler setting isn't classic or modern, ignoring fork setting.
    [javac] Compiling 107 source files to /srv/gump/public/workspace/uddi4j/build/classes
    [javac] Since compiler setting isn't classic or modern, ignoring fork setting.

BUILD FAILED
/srv/gump/public/workspace/uddi4j/build.xml:157: Error running jikes compiler

Total time: 0 seconds
---------------------------------------------

To subscribe to this information via syndicated feeds:
- RSS: http://vmgump.apache.org/gump/public/uddi4j/uddi4j/rss.xml
- Atom: http://vmgump.apache.org/gump/public/uddi4j/uddi4j/atom.xml

============================== Gump Tracking Only ===
Produced by Gump version 2.3.
Gump Run 29000017082010, vmgump.apache.org:vmgump:29000017082010
Gump E-mail Identifier (unique within run) #36.

*********************************************************** G U M P
[GUMP@vmgump]: Project cocoon22-reactor (in module cocoon) failed
To whom it may engage...
        
This is an automated request, but not an unsolicited one. For 
more information please visit http://gump.apache.org/nagged.html, 
and/or contact the folk at general@gump.apache.org.

Project cocoon22-reactor has an issue affecting its community integration.
This issue affects 1 projects,
 and has been outstanding for 66 runs.
The current state of this project is 'Failed', with reason 'Build Failed'.
For reference only, the following projects are affected by this:
    - cocoon22-reactor :  Java XML Framework


Full details are available at:
    http://vmgump.apache.org/gump/public/cocoon/cocoon22-reactor/index.html

That said, some information snippets are provided here.

The following annotations (debug/informational/warning/error messages) were provided:
 -INFO- Optional dependency excalibur-datasource prerequisite failed with reason build failed
 -INFO- Optional dependency excalibur-pool-instrumented prerequisite failed with reason build failed
 -INFO- Optional dependency xml-fop prerequisite failed with reason build failed
 -INFO- Optional dependency commons-jxpath prerequisite failed with reason build failed
 -INFO- Optional dependency velocity-engine prerequisite failed with reason build failed
 -INFO- Optional dependency commons-lang failed with reason build failed
 -INFO- Optional dependency commons-io failed with reason build failed
 -INFO- Optional dependency htmlunit failed with reason build failed
 -INFO- Optional dependency xml-batik failed with reason build failed
 -DEBUG- (Gump generated) Maven2 Settings in: /srv/gump/public/workspace/cocoon/gump_mvn_settings.xml
 -INFO- Failed with reason build failed
 -DEBUG- Maven POM in: /srv/gump/public/workspace/cocoon/pom.xml



The following work was performed:
http://vmgump.apache.org/gump/public/cocoon/cocoon22-reactor/gump_work/build_cocoon_cocoon22-reactor.html
Work Name: build_cocoon_cocoon22-reactor (Type: Build)
Work ended in a state of : Failed
Elapsed: 1 min 29 secs
Command Line: mvn --batch-mode --settings /srv/gump/public/workspace/cocoon/gump_mvn_settings.xml package 
[Working Directory: /srv/gump/public/workspace/cocoon]
---------------------------------------------
8) daisy:daisy-htmlcleaner:jar:1.5-dev

  Try downloading the file manually from the project website.

  Then, install it using the command: 
      mvn install:install-file -DgroupId=daisy -DartifactId=daisy-htmlcleaner -Dversion=1.5-dev -Dpackaging=jar -Dfile=/path/to/file

  Alternatively, if you host your own repository you can deploy the file there: 
      mvn deploy:deploy-file -DgroupId=daisy -DartifactId=daisy-htmlcleaner -Dversion=1.5-dev -Dpackaging=jar -Dfile=/path/to/file -Durl=[url] -DrepositoryId=[id]

  Path to dependency: 
  	1) org.apache.cocoon:cocoon-sitemaptags2daisy-plugin:maven-plugin:1.0.0-SNAPSHOT
  	2) daisy:daisy-htmlcleaner:jar:1.5-dev

9) daisy:daisy-util:jar:1.5-dev

  Try downloading the file manually from the project website.

  Then, install it using the command: 
      mvn install:install-file -DgroupId=daisy -DartifactId=daisy-util -Dversion=1.5-dev -Dpackaging=jar -Dfile=/path/to/file

  Alternatively, if you host your own repository you can deploy the file there: 
      mvn deploy:deploy-file -DgroupId=daisy -DartifactId=daisy-util -Dversion=1.5-dev -Dpackaging=jar -Dfile=/path/to/file -Durl=[url] -DrepositoryId=[id]

  Path to dependency: 
  	1) org.apache.cocoon:cocoon-sitemaptags2daisy-plugin:maven-plugin:1.0.0-SNAPSHOT
  	2) daisy:daisy-util:jar:1.5-dev

----------
9 required artifacts are missing.

for artifact: 
  org.apache.cocoon:cocoon-sitemaptags2daisy-plugin:maven-plugin:1.0.0-SNAPSHOT

from the specified remote repositories:
  gump-central (http://localhost:8192/maven2),
  maven-snapshot (http://snapshots.maven.codehaus.org/maven2/),
  cocoondev (http://cocoondev.org/repository),
  gump-apache.snapshots (http://localhost:8192/repo/m2-snapshot-repository),
  gkossakowski-maven2 (http://people.apache.org/~gkossakowski/maven2/repository)



[INFO] ------------------------------------------------------------------------
[INFO] For more information, run Maven with the -e switch
[INFO] ------------------------------------------------------------------------
[INFO] Total time: 1 minute 28 seconds
[INFO] Finished at: Tue Aug 17 08:34:33 UTC 2010
[INFO] Final Memory: 92M/220M
[INFO] ------------------------------------------------------------------------
---------------------------------------------

To subscribe to this information via syndicated feeds:
- RSS: http://vmgump.apache.org/gump/public/cocoon/cocoon22-reactor/rss.xml
- Atom: http://vmgump.apache.org/gump/public/cocoon/cocoon22-reactor/atom.xml

============================== Gump Tracking Only ===
Produced by Gump version 2.3.
Gump Run 29000017082010, vmgump.apache.org:vmgump:29000017082010
Gump E-mail Identifier (unique within run) #40.

*********************************************************** G U M P
[GUMP@vmgump]: Project ws-commons-axiom (in module ws-axis2-commons) failed
To whom it may engage...
        
This is an automated request, but not an unsolicited one. For 
more information please visit http://gump.apache.org/nagged.html, 
and/or contact the folk at general@gump.apache.org.

Project ws-commons-axiom has an issue affecting its community integration.
This issue affects 1 projects,
 and has been outstanding for 60 runs.
The current state of this project is 'Failed', with reason 'Build Failed'.
For reference only, the following projects are affected by this:
    - ws-commons-axiom :  Common stuff for the WS projects.


Full details are available at:
    http://vmgump.apache.org/gump/public/ws-axis2-commons/ws-commons-axiom/index.html

That said, some information snippets are provided here.

The following annotations (debug/informational/warning/error messages) were provided:
 -INFO- Optional dependency xml-batik failed with reason build failed
 -DEBUG- (Gump generated) Maven2 Settings in: /srv/gump/public/workspace/ws-axis2-commons/axiom/gump_mvn_settings.xml
 -INFO- Failed with reason build failed
 -DEBUG- Maven POM in: /srv/gump/public/workspace/ws-axis2-commons/axiom/pom.xml



The following work was performed:
http://vmgump.apache.org/gump/public/ws-axis2-commons/ws-commons-axiom/gump_work/build_ws-axis2-commons_ws-commons-axiom.html
Work Name: build_ws-axis2-commons_ws-commons-axiom (Type: Build)
Work ended in a state of : Failed
Elapsed: 1 min 50 secs
Command Line: mvn --batch-mode --settings /srv/gump/public/workspace/ws-axis2-commons/axiom/gump_mvn_settings.xml install 
[Working Directory: /srv/gump/public/workspace/ws-axis2-commons/axiom]
---------------------------------------------

Downloading: http://localhost:8192/maven2/org/apache/maven/reporting/maven-reporting/2.0/maven-reporting-2.0.pom

Downloading: http://localhost:8192/maven2/org/apache/maven/maven-error-diagnostics/2.0/maven-error-diagnostics-2.0.pom

Downloading: http://localhost:8192/maven2/org/apache/maven/maven-plugin-registry/2.0/maven-plugin-registry-2.0.pom

Downloading: http://localhost:8192/maven2/org/apache/maven/maven-plugin-descriptor/2.0/maven-plugin-descriptor-2.0.pom

Downloading: http://localhost:8192/maven2/org/apache/maven/maven-monitor/2.0/maven-monitor-2.0.pom

Downloading: http://localhost:8192/maven2/org/apache/maven/wagon/wagon-ssh/1.0-alpha-5/wagon-ssh-1.0-alpha-5.pom

Downloading: http://localhost:8192/maven2/com/jcraft/jsch/0.1.23/jsch-0.1.23.pom

Downloading: http://localhost:8192/maven2/oro/oro/2.0.7/oro-2.0.7.jar
Downloading: http://localhost:8192/maven2/org/apache/maven/doxia/doxia-site-renderer/1.0-alpha-8/doxia-site-renderer-1.0-alpha-8.jar
Downloading: http://localhost:8192/maven2/org/apache/commons/commons-compress/1.0/commons-compress-1.0.jar
Downloading: http://localhost:8192/maven2/org/apache/maven/reporting/maven-reporting-impl/2.0.4/maven-reporting-impl-2.0.4.jar
Downloading: http://localhost:8192/maven2/org/codehaus/plexus/plexus-utils/1.4/plexus-utils-1.4.jar
75K downloaded  (oro-2.0.7.jar)
Downloading: http://localhost:8192/maven2/commons-cli/commons-cli/1.1/commons-cli-1.1.jar
47K downloaded  (commons-cli-1.1.jar)
Downloading: http://localhost:8192/maven2/org/apache/maven/shared/maven-plugin-testing-harness/1.0-beta-1/maven-plugin-testing-harness-1.0-beta-1.jar
157K downloaded  (commons-compress-1.0.jar)
Downloading: http://localhost:8192/maven2/org/apache/rat/apache-rat-core/0.7/apache-rat-core-0.7.jar
94K downloaded  (apache-rat-core-0.7.jar)




Downloading: http://localhost:8192/maven2/org/apache/maven/doxia/doxia-core/1.0-alpha-8/doxia-core-1.0-alpha-8.jar

Downloading: http://localhost:8192/maven2/org/codehaus/plexus/plexus-i18n/1.0-beta-6/plexus-i18n-1.0-beta-6.jar

Downloading: http://localhost:8192/maven2/org/apache/maven/doxia/doxia-decoration-model/1.0-alpha-8/doxia-decoration-model-1.0-alpha-8.jar

[INFO] [apache-rat:check {execution: default}]
[INFO] Exclude: src/test/resources/**
[INFO] ------------------------------------------------------------------------
[ERROR] BUILD FAILURE
[INFO] ------------------------------------------------------------------------
[INFO] Too many unapproved licenses: 1
[INFO] ------------------------------------------------------------------------
[INFO] For more information, run Maven with the -e switch
[INFO] ------------------------------------------------------------------------
[INFO] Total time: 1 minute 49 seconds
[INFO] Finished at: Tue Aug 17 08:37:03 UTC 2010
[INFO] Final Memory: 43M/103M
[INFO] ------------------------------------------------------------------------
---------------------------------------------

To subscribe to this information via syndicated feeds:
- RSS: http://vmgump.apache.org/gump/public/ws-axis2-commons/ws-commons-axiom/rss.xml
- Atom: http://vmgump.apache.org/gump/public/ws-axis2-commons/ws-commons-axiom/atom.xml

============================== Gump Tracking Only ===
Produced by Gump version 2.3.
Gump Run 29000017082010, vmgump.apache.org:vmgump:29000017082010
Gump E-mail Identifier (unique within run) #41.

*********************************************************** G U M P
[GUMP@vmgump]: Project lenya (in module lenya) failed
To whom it may engage...
        
This is an automated request, but not an unsolicited one. For 
more information please visit http://gump.apache.org/nagged.html, 
and/or contact the folk at general@gump.apache.org.

Project lenya has an issue affecting its community integration.
This issue affects 1 projects,
 and has been outstanding for 74 runs.
The current state of this project is 'Failed', with reason 'Build Failed'.
For reference only, the following projects are affected by this:
    - lenya :  Content Management System


Full details are available at:
    http://vmgump.apache.org/gump/public/lenya/lenya/index.html

That said, some information snippets are provided here.

The following annotations (debug/informational/warning/error messages) were provided:
 -INFO- Optional dependency velocity-engine prerequisite failed with reason build failed
 -INFO- Optional dependency commons-lang failed with reason build failed
 -INFO- Optional dependency commons-io failed with reason build failed
 -INFO- Optional dependency cocoon22-reactor failed with reason build failed
 -DEBUG- (Gump generated) Maven2 Settings in: /srv/gump/public/workspace/lenya/gump_mvn_settings.xml
 -INFO- Failed with reason build failed
 -DEBUG- Maven POM in: /srv/gump/public/workspace/lenya/pom.xml



The following work was performed:
http://vmgump.apache.org/gump/public/lenya/lenya/gump_work/build_lenya_lenya.html
Work Name: build_lenya_lenya (Type: Build)
Work ended in a state of : Failed
Elapsed: 3 mins 50 secs
Command Line: mvn --batch-mode --settings /srv/gump/public/workspace/lenya/gump_mvn_settings.xml package 
[Working Directory: /srv/gump/public/workspace/lenya]
---------------------------------------------
/srv/gump/public/workspace/lenya/org.apache.lenya.core.api/src/main/java/org/apache/lenya/cms/cocoon/source/FallbackSourceFactory.java:[84,34] cannot find symbol
symbol  : class SourceResolver
location: class org.apache.lenya.cms.cocoon.source.FallbackSourceFactory

/srv/gump/public/workspace/lenya/org.apache.lenya.core.api/src/main/java/org/apache/lenya/cms/cocoon/source/FallbackSourceFactory.java:[88,14] cannot find symbol
symbol  : class SourceResolver
location: class org.apache.lenya.cms.cocoon.source.FallbackSourceFactory

/srv/gump/public/workspace/lenya/org.apache.lenya.core.api/src/main/java/org/apache/lenya/cms/cocoon/source/FallbackSourceFactory.java:[111,11] cannot find symbol
symbol  : class Source
location: class org.apache.lenya.cms.cocoon.source.FallbackSourceFactory

/srv/gump/public/workspace/lenya/org.apache.lenya.core.api/src/main/java/org/apache/lenya/cms/cocoon/source/FallbackSourceFactory.java:[175,14] cannot find symbol
symbol  : class Source
location: class org.apache.lenya.cms.cocoon.source.FallbackSourceFactory

/srv/gump/public/workspace/lenya/org.apache.lenya.core.api/src/main/java/org/apache/lenya/cms/cocoon/source/FallbackSourceFactory.java:[240,24] cannot find symbol
symbol  : class Source
location: class org.apache.lenya.cms.cocoon.source.FallbackSourceFactory

/srv/gump/public/workspace/lenya/org.apache.lenya.core.api/src/main/java/org/apache/lenya/cms/publication/templating/VisitingSourceResolver.java:[30,4] cannot find symbol
symbol  : class Source
location: interface org.apache.lenya.cms.publication.templating.VisitingSourceResolver

/srv/gump/public/workspace/lenya/org.apache.lenya.core.api/src/main/java/org/apache/lenya/cms/publication/templating/AllExistingSourceResolver.java:[23,34] package org.apache.excalibur.source does not exist

/srv/gump/public/workspace/lenya/org.apache.lenya.core.api/src/main/java/org/apache/lenya/cms/publication/templating/AllExistingSourceResolver.java:[24,34] package org.apache.excalibur.source does not exist

/srv/gump/public/workspace/lenya/org.apache.lenya.core.api/src/main/java/org/apache/lenya/cms/publication/templating/AllExistingSourceResolver.java:[31,22] cannot find symbol
symbol  : class SourceResolver
location: class org.apache.lenya.cms.publication.templating.AllExistingSourceResolver

/srv/gump/public/workspace/lenya/org.apache.lenya.core.api/src/main/java/org/apache/lenya/cms/cocoon/components/modules/input/DateConverterModule.java:[27,49] package org.apache.cocoon.components.modules.input does not exist

/srv/gump/public/workspace/lenya/org.apache.lenya.core.api/src/main/java/org/apache/lenya/cms/cocoon/components/modules/input/DateConverterModule.java:[36,41] cannot find symbol
symbol: class AbstractInputModule
public class DateConverterModule extends AbstractInputModule implements ThreadSafe {

/srv/gump/public/workspace/lenya/org.apache.lenya.core.api/src/main/java/org/apache/lenya/cms/cocoon/acting/ResourceExistsAction.java:[28,31] cannot find symbol
symbol  : class AbstractAction
location: package org.apache.cocoon.acting


[INFO] ------------------------------------------------------------------------
[INFO] For more information, run Maven with the -e switch
[INFO] ------------------------------------------------------------------------
[INFO] Total time: 3 minutes 46 seconds
[INFO] Finished at: Tue Aug 17 08:43:40 UTC 2010
[INFO] Final Memory: 39M/97M
[INFO] ------------------------------------------------------------------------
---------------------------------------------

To subscribe to this information via syndicated feeds:
- RSS: http://vmgump.apache.org/gump/public/lenya/lenya/rss.xml
- Atom: http://vmgump.apache.org/gump/public/lenya/lenya/atom.xml

============================== Gump Tracking Only ===
Produced by Gump version 2.3.
Gump Run 29000017082010, vmgump.apache.org:vmgump:29000017082010
Gump E-mail Identifier (unique within run) #42.

*********************************************************** G U M P
[GUMP@vmgump]: Project ws-axis2 (in module ws-axis2) failed
To whom it may engage...
        
This is an automated request, but not an unsolicited one. For 
more information please visit http://gump.apache.org/nagged.html, 
and/or contact the folk at general@gump.apache.org.

Project ws-axis2 has an issue affecting its community integration.
This issue affects 2 projects,
 and has been outstanding for 450 runs.
The current state of this project is 'Failed', with reason 'Build Failed'.
For reference only, the following projects are affected by this:
    - ws-axis2 :  Apache Axis2 SOAP Stack
    - ws-axis2-test :  Apache Axis2 SOAP Stack


Full details are available at:
    http://vmgump.apache.org/gump/public/ws-axis2/ws-axis2/index.html

That said, some information snippets are provided here.

The following annotations (debug/informational/warning/error messages) were provided:
 -DEBUG- Sole jar output [ws-axis2-17082010] identifier set to project name
 -INFO- Optional dependency ws-commons-axiom failed with reason build failed
 -DEBUG- (Gump generated) Maven2 Settings in: /srv/gump/public/workspace/ws-axis2/gump_mvn_settings.xml
 -INFO- Failed with reason build failed
 -DEBUG- Maven POM in: /srv/gump/public/workspace/ws-axis2/pom.xml
 -INFO- Failed to extract fallback artifacts from Gump Repository



The following work was performed:
http://vmgump.apache.org/gump/public/ws-axis2/ws-axis2/gump_work/build_ws-axis2_ws-axis2.html
Work Name: build_ws-axis2_ws-axis2 (Type: Build)
Work ended in a state of : Failed
Elapsed: 53 secs
Command Line: mvn --batch-mode -Dmaven.test.skip.exec=true --settings /srv/gump/public/workspace/ws-axis2/gump_mvn_settings.xml package 
[Working Directory: /srv/gump/public/workspace/ws-axis2]
---------------------------------------------
[INFO] Unable to find resource 'org.easymock:easymock:jar:2.4' in repository eclipse-repo (http://repo1.maven.org/eclipse)
Downloading: http://download.java.net/maven/1/org.easymock/jars/easymock-2.4.jar
[INFO] Unable to find resource 'org.easymock:easymock:jar:2.4' in repository java.net (http://download.java.net/maven/1)
Downloading: http://localhost:8192/maven2/org/easymock/easymock/2.4/easymock-2.4.jar
[INFO] Unable to find resource 'xmlpull:xmlpull:jar:1.1.3.1' in repository eclipse-repo (http://repo1.maven.org/eclipse)
Downloading: http://download.java.net/maven/1/xmlpull/jars/xmlpull-1.1.3.1.jar
[INFO] Unable to find resource 'xmlpull:xmlpull:jar:1.1.3.1' in repository java.net (http://download.java.net/maven/1)
Downloading: http://localhost:8192/maven2/xmlpull/xmlpull/1.1.3.1/xmlpull-1.1.3.1.jar

116K downloaded  (xmlpull-1.1.3.1.jar)
Downloading: http://localhost:8192/maven2/org/apache/felix/org.apache.felix.bundlerepository/1.6.2/org.apache.felix.bundlerepository-1.6.2.jar
Downloading: http://tomcat.apache.org/dev/dist/m2-repository/org/osgi/org.osgi.core/4.1.0/org.osgi.core-4.1.0.jar
[INFO] Unable to find resource 'org.osgi:org.osgi.core:jar:4.1.0' in repository tomcat-repository (http://tomcat.apache.org/dev/dist/m2-repository)
Downloading: http://repo1.maven.org/eclipse/org/osgi/org.osgi.core/4.1.0/org.osgi.core-4.1.0.jar


Downloading: http://localhost:8192/maven2/net/sf/kxml/kxml2/2.2.2/kxml2-2.2.2.jar
[INFO] Unable to find resource 'org.osgi:org.osgi.core:jar:4.1.0' in repository eclipse-repo (http://repo1.maven.org/eclipse)
Downloading: http://download.java.net/maven/1/org.osgi/jars/org.osgi.core-4.1.0.jar
[INFO] Unable to find resource 'org.osgi:org.osgi.core:jar:4.1.0' in repository java.net (http://download.java.net/maven/1)
Downloading: http://localhost:8192/maven2/org/osgi/org.osgi.core/4.1.0/org.osgi.core-4.1.0.jar

Downloading: http://localhost:8192/maven2/org/apache/felix/org.osgi.core/1.0.0/org.osgi.core-1.0.0.jar



Downloading: http://localhost:8192/maven2/org/apache/felix/org.osgi.service.obr/1.0.1/org.osgi.service.obr-1.0.1.jar

[INFO] snapshot org.apache.axis2:axis2-mar-maven-plugin:1.5.2-SNAPSHOT: checking for updates from apache-snapshots
[INFO] snapshot org.apache.axis2:axis2-mar-maven-plugin:1.5.2-SNAPSHOT: checking for updates from apache.snapshots
Downloading: http://people.apache.org/repo/m2-snapshot-repository/org/apache/axis2/axis2-mar-maven-plugin/1.5.2-SNAPSHOT/axis2-mar-maven-plugin-1.5.2-SNAPSHOT.pom
[INFO] Unable to find resource 'org.apache.axis2:axis2-mar-maven-plugin:pom:1.5.2-SNAPSHOT' in repository apache-snapshots (http://people.apache.org/repo/m2-snapshot-repository)
Downloading: http://localhost:8192/repo/m2-snapshot-repository/org/apache/axis2/axis2-mar-maven-plugin/1.5.2-SNAPSHOT/axis2-mar-maven-plugin-1.5.2-SNAPSHOT.pom
4K downloaded  (axis2-mar-maven-plugin-1.5.2-SNAPSHOT.pom)
Downloading: http://people.apache.org/repo/m2-snapshot-repository/org/apache/axis2/axis2-mar-maven-plugin/1.5.2-SNAPSHOT/axis2-mar-maven-plugin-1.5.2-SNAPSHOT.jar
[INFO] Unable to find resource 'org.apache.axis2:axis2-mar-maven-plugin:maven-plugin:1.5.2-SNAPSHOT' in repository apache-snapshots (http://people.apache.org/repo/m2-snapshot-repository)
Downloading: http://localhost:8192/repo/m2-snapshot-repository/org/apache/axis2/axis2-mar-maven-plugin/1.5.2-SNAPSHOT/axis2-mar-maven-plugin-1.5.2-SNAPSHOT.jar
17K downloaded  (axis2-mar-maven-plugin-1.5.2-SNAPSHOT.jar)
[INFO] ------------------------------------------------------------------------
[ERROR] BUILD ERROR
[INFO] ------------------------------------------------------------------------
[INFO] Internal error in the plugin manager getting plugin 'org.apache.axis2:axis2-mar-maven-plugin': Plugin 'org.apache.axis2:axis2-mar-maven-plugin:1.5.2-SNAPSHOT' has an invalid descriptor:
1) Plugin's descriptor contains the wrong version: SNAPSHOT
[INFO] ------------------------------------------------------------------------
[INFO] For more information, run Maven with the -e switch
[INFO] ------------------------------------------------------------------------
[INFO] Total time: 45 seconds
[INFO] Finished at: Tue Aug 17 09:12:56 UTC 2010
[INFO] Final Memory: 23M/55M
[INFO] ------------------------------------------------------------------------
---------------------------------------------

To subscribe to this information via syndicated feeds:
- RSS: http://vmgump.apache.org/gump/public/ws-axis2/ws-axis2/rss.xml
- Atom: http://vmgump.apache.org/gump/public/ws-axis2/ws-axis2/atom.xml

============================== Gump Tracking Only ===
Produced by Gump version 2.3.
Gump Run 29000017082010, vmgump.apache.org:vmgump:29000017082010
Gump E-mail Identifier (unique within run) #44.

*********************************************************** G U M P
[GUMP@vmgump]: Project portals-pluto-trunk-test (in module portals-pluto-trunk) failed
To whom it may engage...
        
This is an automated request, but not an unsolicited one. For 
more information please visit http://gump.apache.org/nagged.html, 
and/or contact the folk at general@gump.apache.org.

Project portals-pluto-trunk-test has an issue affecting its community integration.
This issue affects 1 projects,
 and has been outstanding for 7 runs.
The current state of this project is 'Failed', with reason 'Build Failed'.
For reference only, the following projects are affected by this:
    - portals-pluto-trunk-test :  JSR168 Container


Full details are available at:
    http://vmgump.apache.org/gump/public/portals-pluto-trunk/portals-pluto-trunk-test/index.html

That said, some information snippets are provided here.

The following annotations (debug/informational/warning/error messages) were provided:
 -WARNING- Overriding Maven2 settings: [/srv/gump/public/workspace/portals-pluto-trunk/gump_mvn_settings.xml]
 -DEBUG- (Gump generated) Maven2 Settings in: /srv/gump/public/workspace/portals-pluto-trunk/gump_mvn_settings.xml
 -INFO- Failed with reason build failed
 -DEBUG- Maven POM in: /srv/gump/public/workspace/portals-pluto-trunk/pom.xml



The following work was performed:
http://vmgump.apache.org/gump/public/portals-pluto-trunk/portals-pluto-trunk-test/gump_work/build_portals-pluto-trunk_portals-pluto-trunk-test.html
Work Name: build_portals-pluto-trunk_portals-pluto-trunk-test (Type: Build)
Work ended in a state of : Failed
Elapsed: 24 secs
Command Line: mvn --batch-mode --settings /srv/gump/public/workspace/portals-pluto-trunk/gump_mvn_settings.xml package 
[Working Directory: /srv/gump/public/workspace/portals-pluto-trunk]
---------------------------------------------
[ERROR] FATAL ERROR
[INFO] ------------------------------------------------------------------------
[INFO] org/xmlpull/v1/XmlPullParserFactory
org.xmlpull.v1.XmlPullParserFactory
[INFO] ------------------------------------------------------------------------
[INFO] Trace
java.lang.NoClassDefFoundError: org/xmlpull/v1/XmlPullParserFactory
	at com.thoughtworks.xstream.io.xml.XppDriver.createParser(XppDriver.java:57)
	at com.thoughtworks.xstream.io.xml.AbstractXppDriver.createReader(AbstractXppDriver.java:56)
	at com.thoughtworks.xstream.XStream.fromXML(XStream.java:880)
	at org.apache.maven.plugin.war.util.WebappStructureSerializer.fromXml(WebappStructureSerializer.java:73)
	at org.apache.maven.plugin.war.AbstractWarMojo.buildWebapp(AbstractWarMojo.java:423)
	at org.apache.maven.plugin.war.AbstractWarMojo.buildExplodedWebapp(AbstractWarMojo.java:394)
	at org.apache.maven.plugin.war.WarMojo.performPackaging(WarMojo.java:195)
	at org.apache.maven.plugin.war.WarMojo.execute(WarMojo.java:157)
	at org.apache.maven.plugin.DefaultPluginManager.executeMojo(DefaultPluginManager.java:490)
	at org.apache.maven.lifecycle.DefaultLifecycleExecutor.executeGoals(DefaultLifecycleExecutor.java:694)
	at org.apache.maven.lifecycle.DefaultLifecycleExecutor.executeGoalWithLifecycle(DefaultLifecycleExecutor.java:556)
	at org.apache.maven.lifecycle.DefaultLifecycleExecutor.executeGoal(DefaultLifecycleExecutor.java:535)
	at org.apache.maven.lifecycle.DefaultLifecycleExecutor.executeGoalAndHandleFailures(DefaultLifecycleExecutor.java:387)
	at org.apache.maven.lifecycle.DefaultLifecycleExecutor.executeTaskSegments(DefaultLifecycleExecutor.java:348)
	at org.apache.maven.lifecycle.DefaultLifecycleExecutor.execute(DefaultLifecycleExecutor.java:180)
	at org.apache.maven.DefaultMaven.doExecute(DefaultMaven.java:328)
	at org.apache.maven.DefaultMaven.execute(DefaultMaven.java:138)
	at org.apache.maven.cli.MavenCli.main(MavenCli.java:362)
	at org.apache.maven.cli.compat.CompatibleMain.main(CompatibleMain.java:60)
	at sun.reflect.NativeMethodAccessorImpl.invoke0(Native Method)
	at sun.reflect.NativeMethodAccessorImpl.invoke(NativeMethodAccessorImpl.java:57)
	at sun.reflect.DelegatingMethodAccessorImpl.invoke(DelegatingMethodAccessorImpl.java:43)
	at java.lang.reflect.Method.invoke(Method.java:616)
	at org.codehaus.classworlds.Launcher.launchEnhanced(Launcher.java:315)
	at org.codehaus.classworlds.Launcher.launch(Launcher.java:255)
	at org.codehaus.classworlds.Launcher.mainWithExitCode(Launcher.java:430)
	at org.codehaus.classworlds.Launcher.main(Launcher.java:375)
Caused by: java.lang.ClassNotFoundException: org.xmlpull.v1.XmlPullParserFactory
	at java.net.URLClassLoader$1.run(URLClassLoader.java:217)
	at java.security.AccessController.doPrivileged(Native Method)
	at java.net.URLClassLoader.findClass(URLClassLoader.java:205)
	at java.lang.ClassLoader.loadClass(ClassLoader.java:321)
	at org.codehaus.classworlds.RealmClassLoader.loadClassDirect(RealmClassLoader.java:195)
	at org.codehaus.classworlds.DefaultClassRealm.loadClass(DefaultClassRealm.java:255)
	at org.codehaus.classworlds.DefaultClassRealm.loadClass(DefaultClassRealm.java:274)
	at org.codehaus.classworlds.RealmClassLoader.loadClass(RealmClassLoader.java:214)
	at java.lang.ClassLoader.loadClass(ClassLoader.java:266)
	... 27 more
[INFO] ------------------------------------------------------------------------
[INFO] Total time: 23 seconds
[INFO] Finished at: Tue Aug 17 09:52:23 UTC 2010
[INFO] Final Memory: 48M/115M
[INFO] ------------------------------------------------------------------------
---------------------------------------------

To subscribe to this information via syndicated feeds:
- RSS: http://vmgump.apache.org/gump/public/portals-pluto-trunk/portals-pluto-trunk-test/rss.xml
- Atom: http://vmgump.apache.org/gump/public/portals-pluto-trunk/portals-pluto-trunk-test/atom.xml

============================== Gump Tracking Only ===
Produced by Gump version 2.3.
Gump Run 29000017082010, vmgump.apache.org:vmgump:29000017082010
Gump E-mail Identifier (unique within run) #47.

*********************************************************** G U M P
[GUMP@vmgump]: Project portals-bridges-script-test (in module portals-bridges) failed
To whom it may engage...
        
This is an automated request, but not an unsolicited one. For 
more information please visit http://gump.apache.org/nagged.html, 
and/or contact the folk at general@gump.apache.org.

Project portals-bridges-script-test has an issue affecting its community integration.
This issue affects 1 projects,
 and has been outstanding for 7 runs.
The current state of this project is 'Failed', with reason 'Build Failed'.
For reference only, the following projects are affected by this:
    - portals-bridges-script-test :  Support for JSR168 compliant Portlet development


Full details are available at:
    http://vmgump.apache.org/gump/public/portals-bridges/portals-bridges-script-test/index.html

That said, some information snippets are provided here.

The following annotations (debug/informational/warning/error messages) were provided:
 -WARNING- Overriding Maven2 settings: [/srv/gump/public/workspace/portals-bridges/bridges-script/trunk/portlet/gump_mvn_settings.xml]
 -DEBUG- (Gump generated) Maven2 Settings in: /srv/gump/public/workspace/portals-bridges/bridges-script/trunk/portlet/gump_mvn_settings.xml
 -INFO- Failed with reason build failed
 -DEBUG- Maven POM in: /srv/gump/public/workspace/portals-bridges/bridges-script/trunk/portlet/pom.xml



The following work was performed:
http://vmgump.apache.org/gump/public/portals-bridges/portals-bridges-script-test/gump_work/build_portals-bridges_portals-bridges-script-test.html
Work Name: build_portals-bridges_portals-bridges-script-test (Type: Build)
Work ended in a state of : Failed
Elapsed: 29 secs
Command Line: mvn --batch-mode --settings /srv/gump/public/workspace/portals-bridges/bridges-script/trunk/portlet/gump_mvn_settings.xml package 
[Working Directory: /srv/gump/public/workspace/portals-bridges/bridges-script/trunk/portlet]
---------------------------------------------
[INFO] Surefire report directory: /srv/gump/public/workspace/portals-bridges/bridges-script/trunk/portlet/target/surefire-reports

-------------------------------------------------------
 T E S T S
-------------------------------------------------------
Running org.apache.portals.bridges.script.TestHelloJythonScriptPortlet
Tests run: 5, Failures: 0, Errors: 5, Skipped: 0, Time elapsed: 5.695 sec <<< FAILURE!
Running org.apache.portals.bridges.script.TestHelloJRubyScriptPortlet
Tests run: 5, Failures: 0, Errors: 0, Skipped: 0, Time elapsed: 4.613 sec
Running org.apache.portals.bridges.script.TestHelloRhinoScriptPortlet
[WARNING] Rhino script engine embedded in the default Java 1.6+ has not fully tested yet.
[WARNING] Rhino script engine embedded in the default Java 1.6+ has not fully tested yet.
[WARNING] Rhino script engine embedded in the default Java 1.6+ has not fully tested yet.
[WARNING] Rhino script engine embedded in the default Java 1.6+ has not fully tested yet.
[WARNING] Rhino script engine embedded in the default Java 1.6+ has not fully tested yet.
[WARNING] Rhino script engine embedded in the default Java 1.6+ has not fully tested yet.
[WARNING] Rhino script engine embedded in the default Java 1.6+ has not fully tested yet.
[WARNING] Rhino script engine embedded in the default Java 1.6+ has not fully tested yet.
[WARNING] Rhino script engine embedded in the default Java 1.6+ has not fully tested yet.
[WARNING] Rhino script engine embedded in the default Java 1.6+ has not fully tested yet.
Tests run: 5, Failures: 0, Errors: 0, Skipped: 0, Time elapsed: 0.039 sec
Running org.apache.portals.bridges.script.TestHelloGroovyScriptPortlet
Tests run: 5, Failures: 0, Errors: 0, Skipped: 0, Time elapsed: 7.164 sec
Running org.apache.portals.bridges.script.TestHelloBeanShellScriptPortlet
Tests run: 5, Failures: 0, Errors: 0, Skipped: 0, Time elapsed: 2.997 sec

Results :

Tests in error: 
  testInit(org.apache.portals.bridges.script.TestHelloJythonScriptPortlet)
  testRender(org.apache.portals.bridges.script.TestHelloJythonScriptPortlet)
  testProcessAction(org.apache.portals.bridges.script.TestHelloJythonScriptPortlet)
  testProcessEvent(org.apache.portals.bridges.script.TestHelloJythonScriptPortlet)
  testServeResource(org.apache.portals.bridges.script.TestHelloJythonScriptPortlet)

Tests run: 25, Failures: 0, Errors: 5, Skipped: 0

[INFO] ------------------------------------------------------------------------
[ERROR] BUILD FAILURE
[INFO] ------------------------------------------------------------------------
[INFO] There are test failures.

Please refer to /srv/gump/public/workspace/portals-bridges/bridges-script/trunk/portlet/target/surefire-reports for the individual test results.
[INFO] ------------------------------------------------------------------------
[INFO] For more information, run Maven with the -e switch
[INFO] ------------------------------------------------------------------------
[INFO] Total time: 28 seconds
[INFO] Finished at: Tue Aug 17 09:57:35 UTC 2010
[INFO] Final Memory: 24M/57M
[INFO] ------------------------------------------------------------------------
---------------------------------------------

To subscribe to this information via syndicated feeds:
- RSS: http://vmgump.apache.org/gump/public/portals-bridges/portals-bridges-script-test/rss.xml
- Atom: http://vmgump.apache.org/gump/public/portals-bridges/portals-bridges-script-test/atom.xml

============================== Gump Tracking Only ===
Produced by Gump version 2.3.
Gump Run 29000017082010, vmgump.apache.org:vmgump:29000017082010
Gump E-mail Identifier (unique within run) #48.

*********************************************************** G U M P
[GUMP@vmgump]: Project apacheds-core-integ-test (in module apacheds) failed
To whom it may engage...
        
This is an automated request, but not an unsolicited one. For 
more information please visit http://gump.apache.org/nagged.html, 
and/or contact the folk at general@gump.apache.org.

Project apacheds-core-integ-test has an issue affecting its community integration.
This issue affects 1 projects,
 and has been outstanding for 2 runs.
The current state of this project is 'Failed', with reason 'Build Failed'.
For reference only, the following projects are affected by this:
    - apacheds-core-integ-test :  Apache Directory Server


Full details are available at:
    http://vmgump.apache.org/gump/public/apacheds/apacheds-core-integ-test/index.html

That said, some information snippets are provided here.

The following annotations (debug/informational/warning/error messages) were provided:
 -WARNING- Overriding Maven2 settings: [/srv/gump/public/workspace/apacheds/core-integ/gump_mvn_settings.xml]
 -DEBUG- (Gump generated) Maven2 Settings in: /srv/gump/public/workspace/apacheds/core-integ/gump_mvn_settings.xml
 -INFO- Failed with reason build failed
 -DEBUG- Maven POM in: /srv/gump/public/workspace/apacheds/core-integ/pom.xml



The following work was performed:
http://vmgump.apache.org/gump/public/apacheds/apacheds-core-integ-test/gump_work/build_apacheds_apacheds-core-integ-test.html
Work Name: build_apacheds_apacheds-core-integ-test (Type: Build)
Work ended in a state of : Failed
Elapsed: 5 mins 23 secs
Command Line: mvn --batch-mode --settings /srv/gump/public/workspace/apacheds/core-integ/gump_mvn_settings.xml test 
[Working Directory: /srv/gump/public/workspace/apacheds/core-integ]
---------------------------------------------
[INFO] Scanning for projects...
[INFO] ------------------------------------------------------------------------
[INFO] Building ApacheDS Core Integration
[INFO]    task-segment: [test]
[INFO] ------------------------------------------------------------------------
[INFO] Setting property: classpath.resource.loader.class => 'org.codehaus.plexus.velocity.ContextClassLoaderResourceLoader'.
[INFO] Setting property: velocimacro.messages.on => 'false'.
[INFO] Setting property: resource.loader => 'classpath'.
[INFO] Setting property: resource.manager.logwhenfound => 'false'.
[INFO] [remote-resources:process {execution: default}]
Downloading: http://localhost:8192/repo/m2-snapshot-repository/org/apache/directory/server/apacheds-protocol-ldap/1.5.8-SNAPSHOT/apacheds-protocol-ldap-1.5.8-SNAPSHOT.pom
[INFO] Unable to find resource 'org.apache.directory.server:apacheds-protocol-ldap:pom:1.5.8-SNAPSHOT' in repository apache.snapshots (https://repository.apache.org/content/repositories/snapshots/)
[INFO] [resources:resources {execution: default-resources}]
[INFO] Using 'UTF-8' encoding to copy filtered resources.
[INFO] Copying 0 resource
[INFO] Copying 3 resources
[INFO] [compiler:compile {execution: default-compile}]
[INFO] Nothing to compile - all classes are up to date
[INFO] [resources:testResources {execution: default-testResources}]
[INFO] Using 'UTF-8' encoding to copy filtered resources.
[INFO] Copying 7 resources
[INFO] Copying 3 resources
[INFO] [compiler:testCompile {execution: default-testCompile}]
[INFO] Nothing to compile - all classes are up to date
[INFO] [surefire:test {execution: default-test}]
[INFO] Surefire report directory: /srv/gump/public/workspace/apacheds/core-integ/target/surefire-reports

-------------------------------------------------------
 T E S T S
-------------------------------------------------------
Running org.apache.directory.server.core.suites.StockCoreISuite
Killed
---------------------------------------------

To subscribe to this information via syndicated feeds:
- RSS: http://vmgump.apache.org/gump/public/apacheds/apacheds-core-integ-test/rss.xml
- Atom: http://vmgump.apache.org/gump/public/apacheds/apacheds-core-integ-test/atom.xml

============================== Gump Tracking Only ===
Produced by Gump version 2.3.
Gump Run 29000017082010, vmgump.apache.org:vmgump:29000017082010
Gump E-mail Identifier (unique within run) #49.

*********************************************************** G U M P
[GUMP@vmgump]: Project apacheds-server-integ-test (in module apacheds) failed
To whom it may engage...
        
This is an automated request, but not an unsolicited one. For 
more information please visit http://gump.apache.org/nagged.html, 
and/or contact the folk at general@gump.apache.org.

Project apacheds-server-integ-test has an issue affecting its community integration.
This issue affects 1 projects,
 and has been outstanding for 7 runs.
The current state of this project is 'Failed', with reason 'Build Failed'.
For reference only, the following projects are affected by this:
    - apacheds-server-integ-test :  Apache Directory Server


Full details are available at:
    http://vmgump.apache.org/gump/public/apacheds/apacheds-server-integ-test/index.html

That said, some information snippets are provided here.

The following annotations (debug/informational/warning/error messages) were provided:
 -WARNING- Overriding Maven2 settings: [/srv/gump/public/workspace/apacheds/server-integ/gump_mvn_settings.xml]
 -DEBUG- (Gump generated) Maven2 Settings in: /srv/gump/public/workspace/apacheds/server-integ/gump_mvn_settings.xml
 -INFO- Failed with reason build failed
 -DEBUG- Maven POM in: /srv/gump/public/workspace/apacheds/server-integ/pom.xml



The following work was performed:
http://vmgump.apache.org/gump/public/apacheds/apacheds-server-integ-test/gump_work/build_apacheds_apacheds-server-integ-test.html
Work Name: build_apacheds_apacheds-server-integ-test (Type: Build)
Work ended in a state of : Failed
Elapsed: 15 mins 15 secs
Command Line: mvn --batch-mode --settings /srv/gump/public/workspace/apacheds/server-integ/gump_mvn_settings.xml package 
[Working Directory: /srv/gump/public/workspace/apacheds/server-integ]
---------------------------------------------
[INFO] Scanning for projects...
[INFO] ------------------------------------------------------------------------
[INFO] Building ApacheDS Server Integration
[INFO]    task-segment: [package]
[INFO] ------------------------------------------------------------------------
[INFO] Setting property: classpath.resource.loader.class => 'org.codehaus.plexus.velocity.ContextClassLoaderResourceLoader'.
[INFO] Setting property: velocimacro.messages.on => 'false'.
[INFO] Setting property: resource.loader => 'classpath'.
[INFO] Setting property: resource.manager.logwhenfound => 'false'.
[INFO] [remote-resources:process {execution: default}]
Downloading: http://localhost:8192/repo/m2-snapshot-repository/org/apache/directory/server/apacheds-protocol-ldap/1.5.8-SNAPSHOT/apacheds-protocol-ldap-1.5.8-SNAPSHOT.pom
[INFO] Unable to find resource 'org.apache.directory.server:apacheds-protocol-ldap:pom:1.5.8-SNAPSHOT' in repository apache.snapshots (https://repository.apache.org/content/repositories/snapshots/)
[INFO] [resources:resources {execution: default-resources}]
[INFO] Using 'UTF-8' encoding to copy filtered resources.
[INFO] Copying 0 resource
[INFO] Copying 3 resources
[INFO] [compiler:compile {execution: default-compile}]
[INFO] Nothing to compile - all classes are up to date
[INFO] [resources:testResources {execution: default-testResources}]
[INFO] Using 'UTF-8' encoding to copy filtered resources.
[INFO] Copying 6 resources
[INFO] Copying 3 resources
[INFO] [compiler:testCompile {execution: default-testCompile}]
[INFO] Nothing to compile - all classes are up to date
[INFO] [surefire:test {execution: default-test}]
[INFO] Surefire report directory: /srv/gump/public/workspace/apacheds/server-integ/target/surefire-reports

-------------------------------------------------------
 T E S T S
-------------------------------------------------------
Running org.apache.directory.server.suites.StockServerISuite
killed.
[INFO] ------------------------------------------------------------------------
[ERROR] BUILD ERROR
[INFO] ------------------------------------------------------------------------
[INFO] Error while executing forked tests.; nested exception is org.apache.maven.surefire.booter.shade.org.codehaus.plexus.util.cli.CommandLineTimeOutException: Error while executing external command, process killed.

Process timeout out after 900 seconds
[INFO] ------------------------------------------------------------------------
[INFO] For more information, run Maven with the -e switch
[INFO] ------------------------------------------------------------------------
[INFO] Total time: 15 minutes 14 seconds
[INFO] Finished at: Tue Aug 17 10:29:01 UTC 2010
[INFO] Final Memory: 50M/121M
[INFO] ------------------------------------------------------------------------
---------------------------------------------

To subscribe to this information via syndicated feeds:
- RSS: http://vmgump.apache.org/gump/public/apacheds/apacheds-server-integ-test/rss.xml
- Atom: http://vmgump.apache.org/gump/public/apacheds/apacheds-server-integ-test/atom.xml

============================== Gump Tracking Only ===
Produced by Gump version 2.3.
Gump Run 29000017082010, vmgump.apache.org:vmgump:29000017082010
Gump E-mail Identifier (unique within run) #50.

*********************************************************** G U M P
[GUMP@vmgump]: Project activemq-jaas (in module activemq) failed
To whom it may engage...
        
This is an automated request, but not an unsolicited one. For 
more information please visit http://gump.apache.org/nagged.html, 
and/or contact the folk at general@gump.apache.org.

Project activemq-jaas has an issue affecting its community integration.
This issue affects 5 projects,
 and has been outstanding for 27 runs.
The current state of this project is 'Failed', with reason 'Build Failed'.
For reference only, the following projects are affected by this:
    - activemq-core :  ActiveMQ :: Core
    - activemq-jaas :  ActiveMQ :: JAAS
    - activemq-jaas-test :  ActiveMQ message broker and enterprise integration patterns ...
    - activemq-pool :  ActiveMQ :: Pool
    - activemq-ra :  ActiveMQ :: RA


Full details are available at:
    http://vmgump.apache.org/gump/public/activemq/activemq-jaas/index.html

That said, some information snippets are provided here.

The following annotations (debug/informational/warning/error messages) were provided:
 -DEBUG- Sole jar output [activemq-jaas-*[0-9T].jar] identifier set to project name
 -INFO- Optional dependency velocity-engine prerequisite failed with reason build failed
 -DEBUG- (Gump generated) Maven2 Settings in: /srv/gump/public/workspace/activemq/activemq-jaas/gump_mvn_settings.xml
 -INFO- Failed with reason build failed
 -DEBUG- Maven POM in: /srv/gump/public/workspace/activemq/activemq-jaas/pom.xml
 -INFO- Failed to extract fallback artifacts from Gump Repository



The following work was performed:
http://vmgump.apache.org/gump/public/activemq/activemq-jaas/gump_work/build_activemq_activemq-jaas.html
Work Name: build_activemq_activemq-jaas (Type: Build)
Work ended in a state of : Failed
Elapsed: 41 secs
Command Line: mvn --batch-mode -Dmaven.test.skip.exec=true --settings /srv/gump/public/workspace/activemq/activemq-jaas/gump_mvn_settings.xml install 
[Working Directory: /srv/gump/public/workspace/activemq/activemq-jaas]
---------------------------------------------
[INFO] [remote-resources:process {execution: default}]
[INFO] [resources:resources {execution: default-resources}]
[INFO] Using 'UTF-8' encoding to copy filtered resources.
[INFO] skip non existing resourceDirectory /srv/gump/public/workspace/activemq/activemq-jaas/src/main/resources
[INFO] Copying 3 resources
[INFO] [compiler:compile {execution: default-compile}]
[INFO] Compiling 11 source files to /srv/gump/public/workspace/activemq/activemq-jaas/target/classes
[INFO] [resources:testResources {execution: default-testResources}]
[INFO] Using 'UTF-8' encoding to copy filtered resources.
[INFO] Copying 4 resources
[INFO] Copying 3 resources
[INFO] [compiler:testCompile {execution: default-testCompile}]
[INFO] Compiling 7 source files to /srv/gump/public/workspace/activemq/activemq-jaas/target/test-classes
[INFO] ------------------------------------------------------------------------
[ERROR] BUILD FAILURE
[INFO] ------------------------------------------------------------------------
[INFO] Compilation failure

/srv/gump/public/workspace/activemq/activemq-jaas/src/test/java/org/apache/activemq/jaas/LDAPLoginModuleTest.java:[39,45] cannot find symbol
symbol  : class Level
location: package org.apache.directory.server.core.integ

/srv/gump/public/workspace/activemq/activemq-jaas/src/test/java/org/apache/activemq/jaas/LDAPLoginModuleTest.java:[40,57] package org.apache.directory.server.core.integ.annotations does not exist

/srv/gump/public/workspace/activemq/activemq-jaas/src/test/java/org/apache/activemq/jaas/LDAPLoginModuleTest.java:[41,57] package org.apache.directory.server.core.integ.annotations does not exist

/srv/gump/public/workspace/activemq/activemq-jaas/src/test/java/org/apache/activemq/jaas/LDAPLoginModuleTest.java:[42,40] cannot find symbol
symbol  : class SiRunner
location: package org.apache.directory.server.integ

/srv/gump/public/workspace/activemq/activemq-jaas/src/test/java/org/apache/activemq/jaas/LDAPLoginModuleTest.java:[49,1] cannot find symbol
symbol: class CleanupLevel
@CleanupLevel ( Level.CLASS )

/srv/gump/public/workspace/activemq/activemq-jaas/src/test/java/org/apache/activemq/jaas/LDAPLoginModuleTest.java:[50,1] cannot find symbol
symbol: class ApplyLdifs
@ApplyLdifs( {

/srv/gump/public/workspace/activemq/activemq-jaas/src/test/java/org/apache/activemq/jaas/LDAPLoginModuleTest.java:[48,11] cannot find symbol
symbol: class SiRunner
@RunWith ( SiRunner.class ) 


[INFO] ------------------------------------------------------------------------
[INFO] For more information, run Maven with the -e switch
[INFO] ------------------------------------------------------------------------
[INFO] Total time: 40 seconds
[INFO] Finished at: Tue Aug 17 10:29:44 UTC 2010
[INFO] Final Memory: 58M/140M
[INFO] ------------------------------------------------------------------------
---------------------------------------------

To subscribe to this information via syndicated feeds:
- RSS: http://vmgump.apache.org/gump/public/activemq/activemq-jaas/rss.xml
- Atom: http://vmgump.apache.org/gump/public/activemq/activemq-jaas/atom.xml

============================== Gump Tracking Only ===
Produced by Gump version 2.3.
Gump Run 29000017082010, vmgump.apache.org:vmgump:29000017082010
Gump E-mail Identifier (unique within run) #51.

*********************************************************** G U M P
[GUMP@vmgump]: Project james-server (in module james-server) failed
To whom it may engage...
        
This is an automated request, but not an unsolicited one. For 
more information please visit http://gump.apache.org/nagged.html, 
and/or contact the folk at general@gump.apache.org.

Project james-server has an issue affecting its community integration.
This issue affects 2 projects.
The current state of this project is 'Failed', with reason 'Build Failed'.
For reference only, the following projects are affected by this:
    - james-server :  James Server
    - james-server-test :  James Server


Full details are available at:
    http://vmgump.apache.org/gump/public/james-server/james-server/index.html

That said, some information snippets are provided here.

The following annotations (debug/informational/warning/error messages) were provided:
 -INFO- Optional dependency excalibur-datasource prerequisite failed with reason build failed
 -INFO- Optional dependency excalibur-cornerstone-threads-impl prerequisite failed with reason build failed
 -INFO- Optional dependency excalibur-thread-impl prerequisite failed with reason build failed
 -INFO- Optional dependency excalibur-pool-impl prerequisite failed with reason build failed
 -INFO- Optional dependency excalibur-cornerstone-connection-impl prerequisite failed with reason build failed
 -INFO- Optional dependency excalibur-cornerstone-connection-api prerequisite failed with reason build failed
 -INFO- Optional dependency excalibur-cornerstone-threads-api prerequisite failed with reason build failed
 -INFO- Optional dependency excalibur-thread-api prerequisite failed with reason build failed
 -INFO- Optional dependency excalibur-framework-impl prerequisite failed with reason build failed
 -INFO- Optional dependency excalibur-pool-api prerequisite failed with reason build failed
 -INFO- Optional dependency jcs prerequisite failed with reason build failed
 -INFO- Optional dependency commons-dbcp prerequisite failed with reason build failed
 -INFO- Optional dependency james-jsieve failed with reason build failed
 -INFO- Optional dependency activemq-pool prerequisite failed with reason build failed
 -INFO- Optional dependency activemq-core prerequisite failed with reason build failed
 -DEBUG- (Gump generated) Maven2 Settings in: /srv/gump/public/workspace/james-server/gump_mvn_settings.xml
 -INFO- Failed with reason build failed
 -DEBUG- Maven POM in: /srv/gump/public/workspace/james-server/pom.xml
 -INFO- Failed to extract fallback artifacts from Gump Repository



The following work was performed:
http://vmgump.apache.org/gump/public/james-server/james-server/gump_work/build_james-server_james-server.html
Work Name: build_james-server_james-server (Type: Build)
Work ended in a state of : Failed
Elapsed: 5 mins 32 secs
Command Line: mvn --batch-mode -Dmaven.test.skip.exec=true --settings /srv/gump/public/workspace/james-server/gump_mvn_settings.xml install 
[Working Directory: /srv/gump/public/workspace/james-server]
---------------------------------------------
[INFO] [compiler:compile {execution: default-compile}]
[INFO] Compiling 45 source files to /srv/gump/public/workspace/james-server/spoolmanager/target/classes
[INFO] [resources:testResources {execution: default-testResources}]
[INFO] Using 'UTF-8' encoding to copy filtered resources.
[INFO] Copying 0 resource
[INFO] Copying 3 resources
[INFO] [compiler:testCompile {execution: default-testCompile}]
[INFO] Compiling 19 source files to /srv/gump/public/workspace/james-server/spoolmanager/target/test-classes
[INFO] [surefire:test {execution: default-test}]
[INFO] Tests are skipped.
[INFO] [jar:jar {execution: default-jar}]
[INFO] Building jar: /srv/gump/public/workspace/james-server/spoolmanager/target/james-server-spoolmanager-3.0-SNAPSHOT.jar
[INFO] [jar:test-jar {execution: default}]
[INFO] Building jar: /srv/gump/public/workspace/james-server/spoolmanager/target/james-server-spoolmanager-3.0-SNAPSHOT-tests.jar
[INFO] [install:install {execution: default-install}]
[INFO] Installing /srv/gump/public/workspace/james-server/spoolmanager/target/james-server-spoolmanager-3.0-SNAPSHOT.jar to /srv/gump/public/workspace/mvnlocalrepo/shared/org/apache/james/james-server-spoolmanager/3.0-SNAPSHOT/james-server-spoolmanager-3.0-SNAPSHOT.jar
[INFO] Installing /srv/gump/public/workspace/james-server/spoolmanager/target/james-server-spoolmanager-3.0-SNAPSHOT-tests.jar to /srv/gump/public/workspace/mvnlocalrepo/shared/org/apache/james/james-server-spoolmanager/3.0-SNAPSHOT/james-server-spoolmanager-3.0-SNAPSHOT-tests.jar
[INFO] ------------------------------------------------------------------------
[INFO] Building Apache JAMES Server RemoteManager
[INFO]    task-segment: [install]
[INFO] ------------------------------------------------------------------------
[INFO] [remote-resources:process {execution: default}]
[INFO] [resources:resources {execution: default-resources}]
[INFO] Using 'UTF-8' encoding to copy filtered resources.
[INFO] Copying 0 resource
[INFO] Copying 3 resources
[INFO] [compiler:compile {execution: default-compile}]
[INFO] Compiling 52 source files to /srv/gump/public/workspace/james-server/remotemanager/target/classes
[INFO] [resources:testResources {execution: default-testResources}]
[INFO] Using 'UTF-8' encoding to copy filtered resources.
[INFO] Copying 0 resource
[INFO] Copying 3 resources
[INFO] [compiler:testCompile {execution: default-testCompile}]
[INFO] Compiling 3 source files to /srv/gump/public/workspace/james-server/remotemanager/target/test-classes
[INFO] [surefire:test {execution: default-test}]
[INFO] Tests are skipped.
[INFO] [jar:jar {execution: default-jar}]
[INFO] ------------------------------------------------------------------------
[ERROR] BUILD ERROR
[INFO] ------------------------------------------------------------------------
[INFO] Error assembling JAR

Embedded error: Failed to read filesystem attributes for: /srv/gump/public/workspace/james-server/remotemanager/pom.xml
[INFO] ------------------------------------------------------------------------
[INFO] For more information, run Maven with the -e switch
[INFO] ------------------------------------------------------------------------
[INFO] Total time: 5 minutes 28 seconds
[INFO] Finished at: Tue Aug 17 10:35:58 UTC 2010
[INFO] Final Memory: 186M/447M
[INFO] ------------------------------------------------------------------------
---------------------------------------------

To subscribe to this information via syndicated feeds:
- RSS: http://vmgump.apache.org/gump/public/james-server/james-server/rss.xml
- Atom: http://vmgump.apache.org/gump/public/james-server/james-server/atom.xml

============================== Gump Tracking Only ===
Produced by Gump version 2.3.
Gump Run 29000017082010, vmgump.apache.org:vmgump:29000017082010
Gump E-mail Identifier (unique within run) #52.


--
Apache Gump
http://gump.apache.org/ [Instance: vmgump]

---------------------------------------------------------------------
To unsubscribe, e-mail: general-unsubscribe@gump.apache.org
For additional commands, e-mail: general-help@gump.apache.org


Mime
View raw message