gump-general mailing list archives

Site index · List index
Message view « Date » · « Thread »
Top « Date » · « Thread »
From g...@vmgump.apache.org
Subject BATCH: All dressed up, with nowhere to go...
Date Thu, 05 Aug 2010 11:25:17 GMT
Dear Gumpmeisters,
            
The following 42 notifys should have been sent

*********************************************************** G U M P
[GUMP@vmgump]: Module commons-dormant success, but with warnings.
[GUMP@vmgump]: Project nant (in module nant) failed
[GUMP@vmgump]: Project xmlunit.net-test (in module xmlunit) failed
[GUMP@vmgump]: Project gsbase (in module gsbase) failed
[GUMP@vmgump]: Project gsbase-test (in module gsbase) failed
[GUMP@vmgump]: Project logging-log4cxx-configure (in module logging-log4cxx) failed
[GUMP@vmgump]: Project apr-iconv-configure (in module apr-iconv) failed
[GUMP@vmgump]: Project jmock2 (in module jmock2) failed
[GUMP@vmgump]: Project emma (in module emma) failed
[GUMP@vmgump]: Project derby (in module db-derby) failed
[GUMP@vmgump]: Project dotnet-antlib-test (in module ant-antlibs) failed
[GUMP@vmgump]: Project lucene-java-contrib (in module lucene-java) failed
[GUMP@vmgump]: Project slf4j-test (in module slf4j) failed
[GUMP@vmgump]: Project xml-security-tests (in module xml-security) failed
[GUMP@vmgump]: Project castor-xml-test (in module castor) failed
[GUMP@vmgump]: Project JacORB-idllib (in module JacORB) failed
[GUMP@vmgump]: Project commons-jelly-tags-ant-test (in module commons-jelly) failed
[GUMP@vmgump]: Project portals-bridges-script-test (in module portals-bridges) failed
[GUMP@vmgump]: Project apache-mime4j-reactor (in module james-mime4j) failed
[GUMP@vmgump]: Project doxia-site-renderer (in module doxia) failed
[GUMP@vmgump]: Project axiom-api (in module ws-axis2-commons) failed
[GUMP@vmgump]: Project commons-jci (in module apache-commons) failed
[GUMP@vmgump]: Project ws-commons-xmlschema (in module ws-axis2-commons) failed
[GUMP@vmgump]: Project ws-commons-axiom (in module ws-axis2-commons) failed
[GUMP@vmgump]: Project castor-test (in module castor) failed
[GUMP@vmgump]: Project jersey-server (in module jersey) failed
[GUMP@vmgump]: Project ws-axis2 (in module ws-axis2) failed
[GUMP@vmgump]: Project htmlunit (in module htmlunit) failed
[GUMP@vmgump]: Project james-imap-test (in module james-imap) failed
[GUMP@vmgump]: Project portals-bridges-velocity (in module portals-bridges) failed
[GUMP@vmgump]: Project portals-pluto-portal-1.0 (in module portals-pluto-1.0) failed
[GUMP@vmgump]: Project tapestry (in module tapestry) failed
[GUMP@vmgump]: Module strutstestcase success, but with warnings.
[GUMP@vmgump]: Project cocoon22-flowscript-impl (in module cocoon) failed
[GUMP@vmgump]: Project portals-pluto-trunk-test (in module portals-pluto-trunk) failed
[GUMP@vmgump]: Project cocoon22-reactor (in module cocoon) failed
[GUMP@vmgump]: Module lenya success, but with warnings.
[GUMP@vmgump]: Project lenya (in module lenya) failed
[GUMP@vmgump]: Project apacheds-server-annotations-test (in module apacheds) failed
[GUMP@vmgump]: Project apacheds-server-integ-test (in module apacheds) failed
[GUMP@vmgump]: Project activemq-jaas (in module activemq) failed
[GUMP@vmgump]: Project james-server-test (in module james-server) failed
*********************************************************** G U M P
[GUMP@vmgump]: Module commons-dormant success, but with warnings.
To whom it may engage...
        
This is an automated request, but not an unsolicited one. For 
more information please visit http://gump.apache.org/nagged.html, 
and/or contact the folk at general@gump.apache.org.

Module commons-dormant contains errors.
The current state of this module is 'Success'.

Full details are available at:
    http://vmgump.apache.org/gump/public/commons-dormant/index.html

That said, some information snippets are provided here.

The following annotations (debug/informational/warning/error messages) were provided:
 -ERROR- *** Failed to update from source control.Stale contents ***



The following work was performed:
http://vmgump.apache.org/gump/public/commons-dormant/gump_work/update_commons-dormant.html
Work Name: update_commons-dormant (Type: Update)
Work ended in a state of : Failed
Elapsed: 
Command Line: svn --quiet update --non-interactive commons-dormant 
[Working Directory: /srv/gump/public/workspace/cvs]
---------------------------------------------
svn: Working copy 'commons-dormant' locked
svn: run 'svn cleanup' to remove locks (type 'svn help cleanup' for details)
---------------------------------------------

To subscribe to this information via syndicated feeds:
- RSS: http://vmgump.apache.org/gump/public/commons-dormant/rss.xml
- Atom: http://vmgump.apache.org/gump/public/commons-dormant/atom.xml

============================== Gump Tracking Only ===
Produced by Gump version 2.3.
Gump Run 12000005082010, vmgump:vmgump-public:12000005082010
Gump E-mail Identifier (unique within run) #1.

*********************************************************** G U M P
[GUMP@vmgump]: Project nant (in module nant) failed
To whom it may engage...
        
This is an automated request, but not an unsolicited one. For 
more information please visit http://gump.apache.org/nagged.html, 
and/or contact the folk at general@gump.apache.org.

Project nant has an issue affecting its community integration.
This issue affects 1 projects,
 and has been outstanding for 478 runs.
The current state of this project is 'Failed', with reason 'Build Failed'.
For reference only, the following projects are affected by this:
    - nant :  NAnt is a free .NET build tool. In theory it is kind of like...


Full details are available at:
    http://vmgump.apache.org/gump/public/nant/nant/index.html

That said, some information snippets are provided here.

The following annotations (debug/informational/warning/error messages) were provided:
 -INFO- Failed with reason build failed



The following work was performed:
http://vmgump.apache.org/gump/public/nant/nant/gump_work/build_nant_nant.html
Work Name: build_nant_nant (Type: Build)
Work ended in a state of : Failed
Elapsed: 1 sec
Command Line: make 
[Working Directory: /srv/gump/public/workspace/nant]
---------------------------------------------
mkdir -p bootstrap
cp -R lib/ bootstrap/lib
# Mono loads log4net before privatebinpath is set-up, so we need this in the same directory
# as NAnt.exe
cp lib/common/neutral/log4net.dll bootstrap
cp src/NAnt.Console/App.config bootstrap/NAnt.exe.config
mcs -target:exe -define:MONO -out:bootstrap/NAnt.exe -r:bootstrap/log4net.dll \
		-recurse:src/NAnt.Console/*.cs src/CommonAssemblyInfo.cs
resgen  src/NAnt.Core/Resources/Strings.resx bootstrap/NAnt.Core.Resources.Strings.resources
make: resgen: Command not found
make: *** [bootstrap/NAnt.Core.dll] Error 127
---------------------------------------------

To subscribe to this information via syndicated feeds:
- RSS: http://vmgump.apache.org/gump/public/nant/nant/rss.xml
- Atom: http://vmgump.apache.org/gump/public/nant/nant/atom.xml

============================== Gump Tracking Only ===
Produced by Gump version 2.3.
Gump Run 12000005082010, vmgump:vmgump-public:12000005082010
Gump E-mail Identifier (unique within run) #2.

*********************************************************** G U M P
[GUMP@vmgump]: Project xmlunit.net-test (in module xmlunit) failed
To whom it may engage...
        
This is an automated request, but not an unsolicited one. For 
more information please visit http://gump.apache.org/nagged.html, 
and/or contact the folk at general@gump.apache.org.

Project xmlunit.net-test has an issue affecting its community integration.
This issue affects 1 projects,
 and has been outstanding for 76 runs.
The current state of this project is 'Failed', with reason 'Build Failed'.
For reference only, the following projects are affected by this:
    - xmlunit.net-test :  JUnit extension for XML unit tests.


Full details are available at:
    http://vmgump.apache.org/gump/public/xmlunit/xmlunit.net-test/index.html

That said, some information snippets are provided here.

The following annotations (debug/informational/warning/error messages) were provided:
 -INFO- Failed with reason build failed



The following work was performed:
http://vmgump.apache.org/gump/public/xmlunit/xmlunit.net-test/gump_work/build_xmlunit_xmlunit.net-test.html
Work Name: build_xmlunit_xmlunit.net-test (Type: Build)
Work ended in a state of : Failed
Elapsed: 5 secs
Command Line: nant -D:java.awt.headless=true -D:gump.merge=/srv/gump/public/gump/work/merge.xml -D:build.sysclasspath=only -buildfile:xmlunit.nant.build test 
[Working Directory: /srv/gump/public/workspace/xmlunit]
---------------------------------------------
compile-core:


compile:


test:

   [nunit2] Tests run: 79, Failures: 4, Not run: 0, Time: 0.686 seconds
   [nunit2] 
   [nunit2] Failures:
   [nunit2] 1) net.sf.xmlunit.validation.ValidatorTest.ShouldSuccessfullyValidateInstance :   Expected validation to pass, first validation error is XmlSchema error: Could not resolve schema location URI: http://www.publishing.org src/tests/resources/Book.xsd XML  Line 2, Position 2.
   [nunit2]   Expected: True
   [nunit2]   But was:  False
   [nunit2] 
   [nunit2]   at net.sf.xmlunit.validation.ValidatorTest.ShouldSuccessfullyValidateInstance () [0x00000] 
   [nunit2]   at (wrapper managed-to-native) System.Reflection.MonoMethod:InternalInvoke (object,object[])
   [nunit2]   at System.Reflection.MonoMethod.Invoke (System.Object obj, BindingFlags invokeAttr, System.Reflection.Binder binder, System.Object[] parameters, System.Globalization.CultureInfo culture) [0x00000] 
   [nunit2] 
   [nunit2] 2) net.sf.xmlunit.xpath.XPathEngineTest.AbstractXPathEngineTest.EvaluateWithSingleMatch : System.NotImplementedException : The requested feature is not implemented.
   [nunit2]   at System.Xml.XPath.XPathNavigator.ValueAs (System.Type type, IXmlNamespaceResolver nsResolver) [0x00000] 
   [nunit2]   at net.sf.xmlunit.xpath.XPathEngine.Evaluate (System.String xPath, ISource s) [0x00000] 
   [nunit2]   at net.sf.xmlunit.xpath.AbstractXPathEngineTest.EvaluateWithSingleMatch () [0x00000] 
   [nunit2]   at (wrapper managed-to-native) System.Reflection.MonoMethod:InternalInvoke (object,object[])
   [nunit2]   at System.Reflection.MonoMethod.Invoke (System.Object obj, BindingFlags invokeAttr, System.Reflection.Binder binder, System.Object[] parameters, System.Globalization.CultureInfo culture) [0x00000] 
   [nunit2] 
   [nunit2] 3) net.sf.xmlunit.xpath.XPathEngineTest.AbstractXPathEngineTest.EvaluateWithSingleMatchTextSelector : System.NotImplementedException : The requested feature is not implemented.
   [nunit2]   at System.Xml.XPath.XPathNavigator.ValueAs (System.Type type, IXmlNamespaceResolver nsResolver) [0x00000] 
   [nunit2]   at net.sf.xmlunit.xpath.XPathEngine.Evaluate (System.String xPath, ISource s) [0x00000] 
   [nunit2]   at net.sf.xmlunit.xpath.AbstractXPathEngineTest.EvaluateWithSingleMatchTextSelector () [0x00000] 
   [nunit2]   at (wrapper managed-to-native) System.Reflection.MonoMethod:InternalInvoke (object,object[])
   [nunit2]   at System.Reflection.MonoMethod.Invoke (System.Object obj, BindingFlags invokeAttr, System.Reflection.Binder binder, System.Object[] parameters, System.Globalization.CultureInfo culture) [0x00000] 
   [nunit2] 
   [nunit2] 4) net.sf.xmlunit.xpath.XPathEngineTest.AbstractXPathEngineTest.EvaluateWithMultipleMatches : System.NotImplementedException : The requested feature is not implemented.
   [nunit2]   at System.Xml.XPath.XPathNavigator.ValueAs (System.Type type, IXmlNamespaceResolver nsResolver) [0x00000] 
   [nunit2]   at net.sf.xmlunit.xpath.XPathEngine.Evaluate (System.String xPath, ISource s) [0x00000] 
   [nunit2]   at net.sf.xmlunit.xpath.AbstractXPathEngineTest.EvaluateWithMultipleMatches () [0x00000] 
   [nunit2]   at (wrapper managed-to-native) System.Reflection.MonoMethod:InternalInvoke (object,object[])
   [nunit2]   at System.Reflection.MonoMethod.Invoke (System.Object obj, BindingFlags invokeAttr, System.Reflection.Binder binder, System.Object[] parameters, System.Globalization.CultureInfo culture) [0x00000] 
   [nunit2] 
   [nunit2] 
   [nunit2] 

BUILD FAILED

/srv/gump/public/workspace/xmlunit/xmlunit.nant.build(121,6):
Tests Failed.

Total time: 4 seconds.

---------------------------------------------

To subscribe to this information via syndicated feeds:
- RSS: http://vmgump.apache.org/gump/public/xmlunit/xmlunit.net-test/rss.xml
- Atom: http://vmgump.apache.org/gump/public/xmlunit/xmlunit.net-test/atom.xml

============================== Gump Tracking Only ===
Produced by Gump version 2.3.
Gump Run 12000005082010, vmgump:vmgump-public:12000005082010
Gump E-mail Identifier (unique within run) #3.

*********************************************************** G U M P
[GUMP@vmgump]: Project gsbase (in module gsbase) failed
To whom it may engage...
        
This is an automated request, but not an unsolicited one. For 
more information please visit http://gump.apache.org/nagged.html, 
and/or contact the folk at general@gump.apache.org.

Project gsbase has an issue affecting its community integration.
This issue affects 1 projects,
 and has been outstanding for 92 runs.
The current state of this project is 'Failed', with reason 'Build Failed'.
For reference only, the following projects are affected by this:
    - gsbase :  A collection of java utility classes


Full details are available at:
    http://vmgump.apache.org/gump/public/gsbase/gsbase/index.html

That said, some information snippets are provided here.

The following annotations (debug/informational/warning/error messages) were provided:
 -DEBUG- Sole jar output [gsbase-05082010.jar] identifier set to project name
 -DEBUG- (Gump generated) Maven Properties in: /srv/gump/public/workspace/gsbase/build.properties
 -INFO- Failed with reason build failed
 -DEBUG- Maven POM in: /srv/gump/public/workspace/gsbase/project.xml
 -DEBUG- Maven project properties in: /srv/gump/public/workspace/gsbase/project.properties
 -INFO- Failed to extract fallback artifacts from Gump Repository



The following work was performed:
http://vmgump.apache.org/gump/public/gsbase/gsbase/gump_work/build_gsbase_gsbase.html
Work Name: build_gsbase_gsbase (Type: Build)
Work ended in a state of : Failed
Elapsed: 7 secs
Command Line: maven --offline jar 
[Working Directory: /srv/gump/public/workspace/gsbase]
---------------------------------------------
| |\/| / _` \ V / -_) ' \  ~ intelligent projects ~
|_|  |_\__,_|\_/\___|_||_|  v. 1.0.2

build:start:

java:prepare-filesystem:
    [mkdir] Created dir: /srv/gump/public/workspace/gsbase/target/classes

java:compile:
    [echo] Compiling to /srv/gump/public/workspace/gsbase/target/classes
    [echo] 
==========================================================

  NOTE: Targetting JVM 1.6, classes
  will not run on earlier JVMs

==========================================================
          
    [javac] Compiling 66 source files to /srv/gump/public/workspace/gsbase/target/classes
/srv/gump/public/workspace/gsbase/src/java/com/gargoylesoftware/base/resource/jdbc/StatementWrapper.java:65: com.gargoylesoftware.base.resource.jdbc.StatementWrapper is not abstract and does not override abstract method isPoolable() in java.sql.Statement
public class StatementWrapper implements Statement {
       ^
/srv/gump/public/workspace/gsbase/src/java/com/gargoylesoftware/base/resource/jdbc/PreparedStatementWrapper.java:64: com.gargoylesoftware.base.resource.jdbc.PreparedStatementWrapper is not abstract and does not override abstract method setNClob(int,java.io.Reader) in java.sql.PreparedStatement
public class PreparedStatementWrapper
       ^
/srv/gump/public/workspace/gsbase/src/java/com/gargoylesoftware/base/resource/jdbc/ConnectionWrapper.java:77: com.gargoylesoftware.base.resource.jdbc.ConnectionWrapper is not abstract and does not override abstract method createStruct(java.lang.String,java.lang.Object[]) in java.sql.Connection
public final class ConnectionWrapper implements Connection, ManagedResource {
             ^
/srv/gump/public/workspace/gsbase/src/java/com/gargoylesoftware/base/resource/jdbc/CallableStatementWrapper.java:81: com.gargoylesoftware.base.resource.jdbc.CallableStatementWrapper is not abstract and does not override abstract method setNClob(java.lang.String,java.io.Reader) in java.sql.CallableStatement
public final class CallableStatementWrapper
             ^
/srv/gump/public/workspace/gsbase/src/java/com/gargoylesoftware/base/resource/jdbc/DatabaseMetaDataWrapper.java:54: com.gargoylesoftware.base.resource.jdbc.DatabaseMetaDataWrapper is not abstract and does not override abstract method getFunctionColumns(java.lang.String,java.lang.String,java.lang.String,java.lang.String) in java.sql.DatabaseMetaData
public final class DatabaseMetaDataWrapper implements DatabaseMetaData {
             ^
/srv/gump/public/workspace/gsbase/src/java/com/gargoylesoftware/base/resource/jdbc/ResultSetWrapper.java:150: com.gargoylesoftware.base.resource.jdbc.ResultSetWrapper is not abstract and does not override abstract method updateNClob(java.lang.String,java.io.Reader) in java.sql.ResultSet
public final class ResultSetWrapper implements ResultSet {
             ^
Note: Some input files use unchecked or unsafe operations.
Note: Recompile with -Xlint:unchecked for details.
6 errors

BUILD FAILED
File...... /home/gump/.maven/cache/maven-java-plugin-1.5/plugin.jelly
Element... ant:javac
Line...... 63
Column.... 48
Compile failed; see the compiler error output for details.
Total time: 7 seconds
Finished at: Thu Aug 05 00:28:25 PDT 2010

---------------------------------------------

To subscribe to this information via syndicated feeds:
- RSS: http://vmgump.apache.org/gump/public/gsbase/gsbase/rss.xml
- Atom: http://vmgump.apache.org/gump/public/gsbase/gsbase/atom.xml

============================== Gump Tracking Only ===
Produced by Gump version 2.3.
Gump Run 12000005082010, vmgump:vmgump-public:12000005082010
Gump E-mail Identifier (unique within run) #4.

*********************************************************** G U M P
[GUMP@vmgump]: Project gsbase-test (in module gsbase) failed
To whom it may engage...
        
This is an automated request, but not an unsolicited one. For 
more information please visit http://gump.apache.org/nagged.html, 
and/or contact the folk at general@gump.apache.org.

Project gsbase-test has an issue affecting its community integration.
This issue affects 1 projects,
 and has been outstanding for 92 runs.
The current state of this project is 'Failed', with reason 'Build Failed'.
For reference only, the following projects are affected by this:
    - gsbase-test :  A collection of java utility classes


Full details are available at:
    http://vmgump.apache.org/gump/public/gsbase/gsbase-test/index.html

That said, some information snippets are provided here.

The following annotations (debug/informational/warning/error messages) were provided:
 -WARNING- Overriding Maven properties: [/srv/gump/public/workspace/gsbase/build.properties]
 -DEBUG- (Gump generated) Maven Properties in: /srv/gump/public/workspace/gsbase/build.properties
 -INFO- Failed with reason build failed
 -DEBUG- Maven POM in: /srv/gump/public/workspace/gsbase/project.xml
 -DEBUG- Maven project properties in: /srv/gump/public/workspace/gsbase/project.properties



The following work was performed:
http://vmgump.apache.org/gump/public/gsbase/gsbase-test/gump_work/build_gsbase_gsbase-test.html
Work Name: build_gsbase_gsbase-test (Type: Build)
Work ended in a state of : Failed
Elapsed: 4 secs
Command Line: maven --offline jar 
[Working Directory: /srv/gump/public/workspace/gsbase]
---------------------------------------------
|  \/  |__ _Apache__ ___
| |\/| / _` \ V / -_) ' \  ~ intelligent projects ~
|_|  |_\__,_|\_/\___|_||_|  v. 1.0.2

build:start:

java:prepare-filesystem:

java:compile:
    [echo] Compiling to /srv/gump/public/workspace/gsbase/target/classes
    [echo] 
==========================================================

  NOTE: Targetting JVM 1.6, classes
  will not run on earlier JVMs

==========================================================
          
    [javac] Compiling 60 source files to /srv/gump/public/workspace/gsbase/target/classes
/srv/gump/public/workspace/gsbase/src/java/com/gargoylesoftware/base/resource/jdbc/StatementWrapper.java:65: com.gargoylesoftware.base.resource.jdbc.StatementWrapper is not abstract and does not override abstract method isPoolable() in java.sql.Statement
public class StatementWrapper implements Statement {
       ^
/srv/gump/public/workspace/gsbase/src/java/com/gargoylesoftware/base/resource/jdbc/PreparedStatementWrapper.java:64: com.gargoylesoftware.base.resource.jdbc.PreparedStatementWrapper is not abstract and does not override abstract method setNClob(int,java.io.Reader) in java.sql.PreparedStatement
public class PreparedStatementWrapper
       ^
/srv/gump/public/workspace/gsbase/src/java/com/gargoylesoftware/base/resource/jdbc/ConnectionWrapper.java:77: com.gargoylesoftware.base.resource.jdbc.ConnectionWrapper is not abstract and does not override abstract method createStruct(java.lang.String,java.lang.Object[]) in java.sql.Connection
public final class ConnectionWrapper implements Connection, ManagedResource {
             ^
/srv/gump/public/workspace/gsbase/src/java/com/gargoylesoftware/base/resource/jdbc/CallableStatementWrapper.java:81: com.gargoylesoftware.base.resource.jdbc.CallableStatementWrapper is not abstract and does not override abstract method setNClob(java.lang.String,java.io.Reader) in java.sql.CallableStatement
public final class CallableStatementWrapper
             ^
/srv/gump/public/workspace/gsbase/src/java/com/gargoylesoftware/base/resource/jdbc/DatabaseMetaDataWrapper.java:54: com.gargoylesoftware.base.resource.jdbc.DatabaseMetaDataWrapper is not abstract and does not override abstract method getFunctionColumns(java.lang.String,java.lang.String,java.lang.String,java.lang.String) in java.sql.DatabaseMetaData
public final class DatabaseMetaDataWrapper implements DatabaseMetaData {
             ^
/srv/gump/public/workspace/gsbase/src/java/com/gargoylesoftware/base/resource/jdbc/ResultSetWrapper.java:150: com.gargoylesoftware.base.resource.jdbc.ResultSetWrapper is not abstract and does not override abstract method updateNClob(java.lang.String,java.io.Reader) in java.sql.ResultSet
public final class ResultSetWrapper implements ResultSet {
             ^
Note: Some input files use unchecked or unsafe operations.
Note: Recompile with -Xlint:unchecked for details.
6 errors

BUILD FAILED
File...... /home/gump/.maven/cache/maven-java-plugin-1.5/plugin.jelly
Element... ant:javac
Line...... 63
Column.... 48
Compile failed; see the compiler error output for details.
Total time: 4 seconds
Finished at: Thu Aug 05 00:28:39 PDT 2010

---------------------------------------------

To subscribe to this information via syndicated feeds:
- RSS: http://vmgump.apache.org/gump/public/gsbase/gsbase-test/rss.xml
- Atom: http://vmgump.apache.org/gump/public/gsbase/gsbase-test/atom.xml

============================== Gump Tracking Only ===
Produced by Gump version 2.3.
Gump Run 12000005082010, vmgump:vmgump-public:12000005082010
Gump E-mail Identifier (unique within run) #5.

*********************************************************** G U M P
[GUMP@vmgump]: Project logging-log4cxx-configure (in module logging-log4cxx) failed
To whom it may engage...
        
This is an automated request, but not an unsolicited one. For 
more information please visit http://gump.apache.org/nagged.html, 
and/or contact the folk at general@gump.apache.org.

Project logging-log4cxx-configure has an issue affecting its community integration.
This issue affects 3 projects,
 and has been outstanding for 123 runs.
The current state of this project is 'Failed', with reason 'Build Failed'.
For reference only, the following projects are affected by this:
    - logging-log4cxx-configure :  Apache log4cxx
    - logging-log4cxx-make :  Apache log4cxx
    - logging-log4cxx-make-install :  Apache log4cxx


Full details are available at:
    http://vmgump.apache.org/gump/public/logging-log4cxx/logging-log4cxx-configure/index.html

That said, some information snippets are provided here.

The following annotations (debug/informational/warning/error messages) were provided:
 -DEBUG- Dependency on apr-make-install exists, no need to add for property --with-apr.
 -INFO- Failed with reason build failed



The following work was performed:
http://vmgump.apache.org/gump/public/logging-log4cxx/logging-log4cxx-configure/gump_work/buildscript_logging-log4cxx_logging-log4cxx-configure.html
Work Name: buildscript_logging-log4cxx_logging-log4cxx-configure (Type: Build)
Work ended in a state of : Failed
Elapsed: 19 secs
Command Line: /srv/gump/public/workspace/logging-log4cxx/configure --with-apr=/srv/gump/public/workspace/apr --prefix=/srv/gump/public/workspace/logging-log4cxx/dest-05082010 
[Working Directory: /srv/gump/public/workspace/logging-log4cxx]
---------------------------------------------
checking for f95... no
checking for fort... no
checking for ifort... no
checking for ifc... no
checking for efc... no
checking for pgf95... no
checking for lf95... no
checking for ftn... no
checking whether we are using the GNU Fortran 77 compiler... no
checking whether  accepts -g... no
checking the maximum length of command line arguments... 98304
checking command to parse /usr/bin/nm -B output from ccache gcc object... ok
checking for objdir... .libs
checking for ar... ar
checking for ranlib... ranlib
checking for strip... strip
checking if ccache gcc supports -fno-rtti -fno-exceptions... no
checking for ccache gcc option to produce PIC... -fPIC
checking if ccache gcc PIC flag -fPIC works... yes
checking if ccache gcc static flag -static works... yes
checking if ccache gcc supports -c -o file.o... yes
checking whether the ccache gcc linker (/usr/bin/ld) supports shared libraries... yes
checking whether -lc should be explicitly linked in... no
checking dynamic linker characteristics... GNU/Linux ld.so
checking how to hardcode library paths into programs... immediate
checking whether stripping libraries is possible... yes
checking if libtool supports shared libraries... yes
checking whether to build shared libraries... yes
checking whether to build static libraries... yes
configure: creating libtool
appending configuration tag "CXX" to libtool
checking for ld used by ccache g++... /usr/bin/ld
checking if the linker (/usr/bin/ld) is GNU ld... yes
checking whether the ccache g++ linker (/usr/bin/ld) supports shared libraries... yes
checking for ccache g++ option to produce PIC... -fPIC
checking if ccache g++ PIC flag -fPIC works... yes
checking if ccache g++ static flag -static works... yes
checking if ccache g++ supports -c -o file.o... yes
checking whether the ccache g++ linker (/usr/bin/ld) supports shared libraries... yes
checking dynamic linker characteristics... GNU/Linux ld.so
(cached) (cached) checking how to hardcode library paths into programs... immediate
appending configuration tag "F77" to libtool
checking for a BSD-compatible install... /usr/bin/install -c
checking whether make sets $(MAKE)... (cached) yes
checking whether we are using the GNU C++ compiler... (cached) yes
checking whether ccache g++ accepts -g... (cached) yes
checking dependency style of ccache g++... (cached) gcc3
checking how to run the C++ preprocessor... ccache g++ -E
checking for doxygen... no
checking for APR... configure: error: the --with-apr parameter is incorrect. It must specify an install prefix, a build directory, or an apr-config file.
---------------------------------------------

To subscribe to this information via syndicated feeds:
- RSS: http://vmgump.apache.org/gump/public/logging-log4cxx/logging-log4cxx-configure/rss.xml
- Atom: http://vmgump.apache.org/gump/public/logging-log4cxx/logging-log4cxx-configure/atom.xml

============================== Gump Tracking Only ===
Produced by Gump version 2.3.
Gump Run 12000005082010, vmgump:vmgump-public:12000005082010
Gump E-mail Identifier (unique within run) #6.

*********************************************************** G U M P
[GUMP@vmgump]: Project apr-iconv-configure (in module apr-iconv) failed
To whom it may engage...
        
This is an automated request, but not an unsolicited one. For 
more information please visit http://gump.apache.org/nagged.html, 
and/or contact the folk at general@gump.apache.org.

Project apr-iconv-configure has an issue affecting its community integration.
This issue affects 2 projects,
 and has been outstanding for 338 runs.
The current state of this project is 'Failed', with reason 'Build Failed'.
For reference only, the following projects are affected by this:
    - apr-iconv-configure :  Apache Portable Runtime
    - apr-iconv-make :  Apache Portable Runtime


Full details are available at:
    http://vmgump.apache.org/gump/public/apr-iconv/apr-iconv-configure/index.html

That said, some information snippets are provided here.

The following annotations (debug/informational/warning/error messages) were provided:
 -INFO- Failed with reason build failed



The following work was performed:
http://vmgump.apache.org/gump/public/apr-iconv/apr-iconv-configure/gump_work/buildscript_apr-iconv_apr-iconv-configure.html
Work Name: buildscript_apr-iconv_apr-iconv-configure (Type: Build)
Work ended in a state of : Failed
Elapsed: 1 sec
Command Line: /srv/gump/public/workspace/apr-iconv/configure --with-apr=/srv/gump/public/workspace/apr/dest-05082010 --prefix=/srv/gump/public/workspace/apr-iconv/dest-05082010 
[Working Directory: /srv/gump/public/workspace/apr-iconv]
---------------------------------------------
checking for gawk... no
checking for mawk... mawk
checking for a BSD-compatible install... /usr/bin/install -c
checking for APR... configure: error: the --with-apr parameter is incorrect. It must specify an install prefix, a build directory, or an apr-config file.
---------------------------------------------

To subscribe to this information via syndicated feeds:
- RSS: http://vmgump.apache.org/gump/public/apr-iconv/apr-iconv-configure/rss.xml
- Atom: http://vmgump.apache.org/gump/public/apr-iconv/apr-iconv-configure/atom.xml

============================== Gump Tracking Only ===
Produced by Gump version 2.3.
Gump Run 12000005082010, vmgump:vmgump-public:12000005082010
Gump E-mail Identifier (unique within run) #7.

*********************************************************** G U M P
[GUMP@vmgump]: Project jmock2 (in module jmock2) failed
To whom it may engage...
        
This is an automated request, but not an unsolicited one. For 
more information please visit http://gump.apache.org/nagged.html, 
and/or contact the folk at general@gump.apache.org.

Project jmock2 has an issue affecting its community integration.
This issue affects 1 projects,
 and has been outstanding for 92 runs.
The current state of this project is 'Failed', with reason 'Build Failed'.
For reference only, the following projects are affected by this:
    - jmock2 :  jMock is a library for testing Java code using mock objects.


Full details are available at:
    http://vmgump.apache.org/gump/public/jmock2/jmock2/index.html

That said, some information snippets are provided here.

The following annotations (debug/informational/warning/error messages) were provided:
 -INFO- Failed with reason build failed
 -INFO- Failed to extract fallback artifacts from Gump Repository



The following work was performed:
http://vmgump.apache.org/gump/public/jmock2/jmock2/gump_work/build_jmock2_jmock2.html
Work Name: build_jmock2_jmock2 (Type: Build)
Work ended in a state of : Failed
Elapsed: 5 secs
Command Line: /usr/lib/jvm/java-6-sun/bin/java -Djava.awt.headless=true -Xbootclasspath/p:/srv/gump/public/workspace/xml-xerces2/build/xercesImpl.jar:/srv/gump/public/workspace/xml-commons/java/external/build/xml-apis.jar org.apache.tools.ant.Main -Dgump.merge=/srv/gump/public/gump/work/merge.xml -Dbuild.sysclasspath=only -Dversion=05082010 
[Working Directory: /srv/gump/public/workspace/jmock2]
CLASSPATH: /usr/lib/jvm/java-6-sun/lib/tools.jar:/srv/gump/public/workspace/jmock2/build/classes:/srv/gump/public/workspace/jmock2/lib/objenesis-1.0.jar:/srv/gump/public/workspace/ant/dist/lib/ant.jar:/srv/gump/public/workspace/ant/dist/lib/ant-launcher.jar:/srv/gump/public/workspace/ant/dist/lib/ant-jmf.jar:/srv/gump/public/workspace/ant/dist/lib/ant-junit.jar:/srv/gump/public/workspace/ant/dist/lib/ant-swing.jar:/srv/gump/public/workspace/ant/dist/lib/ant-apache-resolver.jar:/srv/gump/public/workspace/ant/dist/lib/ant-apache-xalan2.jar:/srv/gump/packages/bsh-2.0b4/bsh-2.0b4.jar:/srv/gump/packages/bsh-2.0b4/bsh-bsf-2.0b4.jar:/srv/gump/packages/bsh-2.0b4/bsh-classpath-2.0b4.jar:/srv/gump/packages/bsh-2.0b4/bsh-commands-2.0b4.jar:/srv/gump/packages/bsh-2.0b4/bsh-core-2.0b4.jar:/srv/gump/packages/bsh-2.0b4/bsh-reflect-2.0b4.jar:/srv/gump/packages/bsh-2.0b4/bsh-util-2.0b4.jar:/srv/gump/packages/cglib/cglib-nodep-2.1_3.jar:/srv/gump/public/workspace/hamcrest/hamcrest-java/build/h
 amcrest-core-05082010.jar:/srv/gump/public/workspace/hamcrest/hamcrest-java/build/hamcrest-generator-05082010.jar:/srv/gump/public/workspace/hamcrest/hamcrest-java/build/hamcrest-library-05082010.jar:/srv/gump/public/workspace/junit/dist/junit-05082010.jar:/srv/gump/packages/junit3.8.1/junit.jar:/srv/gump/public/workspace/xml-commons/java/external/build/xml-apis-ext.jar
---------------------------------------------
    [javac] location: class org.jmock.test.unit.lib.CurrentStateMatcherTests
    [javac]         assertTrue("should match", isNotCurrently("S").matches(stateMachine));
    [javac]         ^
    [javac] /srv/gump/public/workspace/jmock2/test/org/jmock/test/unit/lib/CurrentStateMatcherTests.java:38: cannot find symbol
    [javac] symbol  : method assertTrue(java.lang.String,boolean)
    [javac] location: class org.jmock.test.unit.lib.CurrentStateMatcherTests
    [javac]         assertTrue("should not match", !isCurrentlyS.matches(null));
    [javac]         ^
    [javac] /srv/gump/public/workspace/jmock2/test/org/jmock/test/unit/lib/CurrentStateMatcherTests.java:42: cannot find symbol
    [javac] symbol  : method assertTrue(java.lang.String,boolean)
    [javac] location: class org.jmock.test.unit.lib.CurrentStateMatcherTests
    [javac]         assertTrue("should not match", !isCurrentlyS.matches("something else"));
    [javac]         ^
    [javac] /srv/gump/public/workspace/jmock2/test/org/jmock/test/unit/lib/CurrentStateMatcherTests.java:46: cannot find symbol
    [javac] symbol  : method assertEquals(java.lang.String,java.lang.String)
    [javac] location: class org.jmock.test.unit.lib.CurrentStateMatcherTests
    [javac]         assertEquals("a state machine that is S", asString(isCurrently("S")));
    [javac]         ^
    [javac] /srv/gump/public/workspace/jmock2/test/org/jmock/test/unit/lib/CurrentStateMatcherTests.java:47: cannot find symbol
    [javac] symbol  : method assertEquals(java.lang.String,java.lang.String)
    [javac] location: class org.jmock.test.unit.lib.CurrentStateMatcherTests
    [javac]         assertEquals("a state machine that is not S", asString(isNotCurrently("S")));
    [javac]         ^
    [javac] /srv/gump/public/workspace/jmock2/test/org/jmock/test/unit/lib/CurrentStateMatcherTests.java:53: cannot find symbol
    [javac] symbol  : method assertMismatchDescription(java.lang.String,org.hamcrest.Matcher<org.jmock.States>,org.jmock.States)
    [javac] location: class org.jmock.test.unit.lib.CurrentStateMatcherTests
    [javac]         assertMismatchDescription("was not S", isCurrently("S"), stateMachine);
    [javac]         ^
    [javac] /srv/gump/public/workspace/jmock2/test/org/jmock/test/unit/lib/CurrentStateMatcherTests.java:56: method does not override or implement a method from a supertype
    [javac]     @Override
    [javac]     ^
    [javac] /srv/gump/public/workspace/jmock2/test/org/jmock/test/unit/support/SyntheticEmptyInterfaceClassLoader.java:35: cannot find symbol
    [javac] symbol  : variable COMPUTE_MAXS
    [javac] location: class net.sf.cglib.asm.ClassWriter
    [javac]         ClassWriter writer = new ClassWriter(ClassWriter.COMPUTE_MAXS);
    [javac]                                                         ^
    [javac] /srv/gump/public/workspace/jmock2/test/org/jmock/test/unit/support/SyntheticEmptyInterfaceClassLoader.java:35: internal error; cannot instantiate ClassWriter(boolean) at net.sf.cglib.asm.ClassWriter to ()
    [javac]         ClassWriter writer = new ClassWriter(ClassWriter.COMPUTE_MAXS);
    [javac]                              ^
    [javac] /srv/gump/public/workspace/jmock2/test/org/jmock/test/unit/support/SyntheticEmptyInterfaceClassLoader.java:36: visit(int,int,java.lang.String,java.lang.String,java.lang.String[],java.lang.String) in net.sf.cglib.asm.ClassWriter cannot be applied to (int,int,java.lang.String,<nulltype>,java.lang.String,<nulltype>)
    [javac]                 writer.visit(CLASS_FORMAT_VERSION,
    [javac]                       ^
    [javac] Note: /srv/gump/public/workspace/jmock2/src/org/jmock/integration/junit4/JMock.java uses or overrides a deprecated API.
    [javac] Note: Recompile with -Xlint:deprecation for details.
    [javac] 21 errors

BUILD FAILED
/srv/gump/public/workspace/jmock2/build.xml:61: Compile failed; see the compiler error output for details.

Total time: 4 seconds
---------------------------------------------

To subscribe to this information via syndicated feeds:
- RSS: http://vmgump.apache.org/gump/public/jmock2/jmock2/rss.xml
- Atom: http://vmgump.apache.org/gump/public/jmock2/jmock2/atom.xml

============================== Gump Tracking Only ===
Produced by Gump version 2.3.
Gump Run 12000005082010, vmgump:vmgump-public:12000005082010
Gump E-mail Identifier (unique within run) #8.

*********************************************************** G U M P
[GUMP@vmgump]: Project emma (in module emma) failed
To whom it may engage...
        
This is an automated request, but not an unsolicited one. For 
more information please visit http://gump.apache.org/nagged.html, 
and/or contact the folk at general@gump.apache.org.

Project emma has an issue affecting its community integration.
This issue affects 1 projects,
 and has been outstanding for 92 runs.
The current state of this project is 'Failed', with reason 'Build Failed'.
For reference only, the following projects are affected by this:
    - emma :  code coverage tool


Full details are available at:
    http://vmgump.apache.org/gump/public/emma/emma/index.html

That said, some information snippets are provided here.

The following annotations (debug/informational/warning/error messages) were provided:
 -INFO- Failed with reason build failed
 -INFO- Failed to extract fallback artifacts from Gump Repository



The following work was performed:
http://vmgump.apache.org/gump/public/emma/emma/gump_work/build_emma_emma.html
Work Name: build_emma_emma (Type: Build)
Work ended in a state of : Failed
Elapsed: 4 secs
Command Line: /usr/lib/jvm/java-6-sun/bin/java -Djava.awt.headless=true -Xbootclasspath/p:/srv/gump/public/workspace/xml-commons/java/external/build/xml-apis.jar:/srv/gump/public/workspace/xml-xerces2/build/xercesImpl.jar org.apache.tools.ant.Main -Dgump.merge=/srv/gump/public/gump/work/merge.xml -Dbuild.sysclasspath=only -Dapp.short.name=emma-05082010 
[Working Directory: /srv/gump/public/workspace/emma]
CLASSPATH: /usr/lib/jvm/java-6-sun/lib/tools.jar:/srv/gump/public/workspace/emma/out/core/classes:/srv/gump/public/workspace/emma/out/ant/classes:/srv/gump/public/workspace/emma/lib/internal/stamptool.jar:/srv/gump/public/workspace/ant/dist/lib/ant.jar:/srv/gump/public/workspace/ant/dist/lib/ant-launcher.jar:/srv/gump/public/workspace/ant/dist/lib/ant-jmf.jar:/srv/gump/public/workspace/ant/dist/lib/ant-junit.jar:/srv/gump/public/workspace/ant/dist/lib/ant-swing.jar:/srv/gump/public/workspace/ant/dist/lib/ant-apache-resolver.jar:/srv/gump/public/workspace/ant/dist/lib/ant-apache-xalan2.jar:/srv/gump/public/workspace/xml-commons/java/external/build/xml-apis-ext.jar
---------------------------------------------
timestamp:

-pre-compile:

core.bootstrap.compile:
    [javac] Compiling 2 source files to /srv/gump/public/workspace/emma/out/core/classes
    [javac] 
    [javac]           WARNING
    [javac] 
    [javac] The -source switch defaults to 1.5 in JDK 1.5 and 1.6.
    [javac] If you specify -target 1.2 you now must also specify -source 1.2.
    [javac] Ant will implicitly add -source 1.2 for you.  Please change your build file.

core.java14.compile:
    [javac] Compiling 1 source file to /srv/gump/public/workspace/emma/out/core/classes
    [javac] 
    [javac]           WARNING
    [javac] 
    [javac] The -source switch defaults to 1.5 in JDK 1.5 and 1.6.
    [javac] If you specify -target 1.2 you now must also specify -source 1.2.
    [javac] Ant will implicitly add -source 1.2 for you.  Please change your build file.

core.java13.compile:
    [javac] Compiling 1 source file to /srv/gump/public/workspace/emma/out/core/classes
    [javac] 
    [javac]           WARNING
    [javac] 
    [javac] The -source switch defaults to 1.5 in JDK 1.5 and 1.6.
    [javac] If you specify -target 1.2 you now must also specify -source 1.2.
    [javac] Ant will implicitly add -source 1.2 for you.  Please change your build file.

core.compile:
    [javac] Compiling 175 source files to /srv/gump/public/workspace/emma/out/core/classes
    [javac] 
    [javac]           WARNING
    [javac] 
    [javac] The -source switch defaults to 1.5 in JDK 1.5 and 1.6.
    [javac] If you specify -target 1.2 you now must also specify -source 1.2.
    [javac] Ant will implicitly add -source 1.2 for you.  Please change your build file.
    [javac] /srv/gump/public/workspace/emma/core/java12/com/vladium/emma/run/InstrClassLoader.java:346: reference to CodeSource is ambiguous, both method CodeSource(java.net.URL,java.security.cert.Certificate[]) in java.security.CodeSource and method CodeSource(java.net.URL,java.security.CodeSigner[]) in java.security.CodeSource match
    [javac]         final CodeSource csrc = new CodeSource (srcURL, null);
    [javac]                                 ^
    [javac] Note: Some input files use or override a deprecated API.
    [javac] Note: Recompile with -Xlint:deprecation for details.
    [javac] 1 error

BUILD FAILED
/srv/gump/public/workspace/emma/build.xml:297: Compile failed; see the compiler error output for details.

Total time: 3 seconds
---------------------------------------------

To subscribe to this information via syndicated feeds:
- RSS: http://vmgump.apache.org/gump/public/emma/emma/rss.xml
- Atom: http://vmgump.apache.org/gump/public/emma/emma/atom.xml

============================== Gump Tracking Only ===
Produced by Gump version 2.3.
Gump Run 12000005082010, vmgump:vmgump-public:12000005082010
Gump E-mail Identifier (unique within run) #9.

*********************************************************** G U M P
[GUMP@vmgump]: Project derby (in module db-derby) failed
To whom it may engage...
        
This is an automated request, but not an unsolicited one. For 
more information please visit http://gump.apache.org/nagged.html, 
and/or contact the folk at general@gump.apache.org.

Project derby has an issue affecting its community integration.
This issue affects 1 projects,
 and has been outstanding for 14 runs.
The current state of this project is 'Failed', with reason 'Build Failed'.
For reference only, the following projects are affected by this:
    - derby :  Apache Derby, 100% Java relational database.


Full details are available at:
    http://vmgump.apache.org/gump/public/db-derby/derby/index.html

That said, some information snippets are provided here.

The following annotations (debug/informational/warning/error messages) were provided:
 -INFO- Failed with reason build failed
 -INFO- Failed to extract fallback artifacts from Gump Repository



The following work was performed:
http://vmgump.apache.org/gump/public/db-derby/derby/gump_work/build_db-derby_derby.html
Work Name: build_db-derby_derby (Type: Build)
Work ended in a state of : Failed
Elapsed: 34 secs
Command Line: /usr/lib/jvm/java-6-sun/bin/java -Djava.awt.headless=true -Xbootclasspath/p:/srv/gump/public/workspace/xml-commons/java/external/build/xml-apis.jar:/srv/gump/public/workspace/xml-xerces2/build/xercesImpl.jar:/srv/gump/public/workspace/xml-xalan/build/xalan-unbundled.jar:/srv/gump/public/workspace/xml-xalan/build/serializer.jar org.apache.tools.ant.Main -Dgump.merge=/srv/gump/public/gump/work/merge.xml -Dbuild.sysclasspath=only -Dsane=false gump_all 
[Working Directory: /srv/gump/public/workspace/db-derby]
CLASSPATH: /usr/lib/jvm/java-6-sun/lib/tools.jar:/srv/gump/public/workspace/db-derby/classes:/srv/gump/public/workspace/ant/dist/lib/ant.jar:/srv/gump/public/workspace/ant/dist/lib/ant-launcher.jar:/srv/gump/public/workspace/ant/dist/lib/ant-jmf.jar:/srv/gump/public/workspace/ant/dist/lib/ant-junit.jar:/srv/gump/public/workspace/ant/dist/lib/ant-swing.jar:/srv/gump/public/workspace/ant/dist/lib/ant-apache-resolver.jar:/srv/gump/public/workspace/ant/dist/lib/ant-apache-xalan2.jar:/srv/gump/public/workspace/xml-commons/java/external/build/xml-apis-ext.jar:/srv/gump/public/workspace/jakarta-servletapi-5/jsr154/dist/lib/servlet-api.jar:/srv/gump/public/workspace/jakarta-oro/jakarta-oro-05082010.jar:/srv/gump/packages/javacc-3.1/bin/lib/javacc.jar:/srv/gump/public/workspace/junit/dist/junit-05082010.jar
---------------------------------------------
engine_169:

compile_reference:
    [javac] Compiling 11 source files to /srv/gump/public/workspace/db-derby/classes
    [javac] Compiling 1 source file to /srv/gump/public/workspace/db-derby/classes

compile_authentication:
    [javac] Compiling 2 source files to /srv/gump/public/workspace/db-derby/classes

authentication:

compile_security:
    [javac] Compiling 2 source files to /srv/gump/public/workspace/db-derby/classes

security:

compile_mbeans:
    [javac] Compiling 4 source files to /srv/gump/public/workspace/db-derby/classes

compile_io:

storage:

compile_iapi_error_jsr169:

compile_reference:
    [javac] Compiling 2 source files to /srv/gump/public/workspace/db-derby/classes

compile_util:

compile_types:
    [javac] Compiling 1 source file to /srv/gump/public/workspace/db-derby/classes
    [javac] /srv/gump/public/workspace/db-derby/java/engine/org/apache/derby/impl/jdbc/EmbedStatement.java:60: org.apache.derby.impl.jdbc.EmbedStatement is not abstract and does not override abstract method isWrapperFor(java.lang.Class) in java.sql.Wrapper
    [javac] public class EmbedStatement extends ConnectionChild
    [javac]        ^
    [javac] /srv/gump/public/workspace/db-derby/java/engine/org/apache/derby/impl/jdbc/EmbedResultSetMetaData.java:59: org.apache.derby.impl.jdbc.EmbedResultSetMetaData is not abstract and does not override abstract method isWrapperFor(java.lang.Class) in java.sql.Wrapper
    [javac] public class EmbedResultSetMetaData
    [javac]        ^
    [javac] /srv/gump/public/workspace/db-derby/java/engine/org/apache/derby/impl/jdbc/EmbedDatabaseMetaData.java:88: org.apache.derby.impl.jdbc.EmbedDatabaseMetaData is not abstract and does not override abstract method autoCommitFailureClosesAllResultSets() in java.sql.DatabaseMetaData
    [javac] public class EmbedDatabaseMetaData extends ConnectionChild 
    [javac]        ^
    [javac] 3 errors

BUILD FAILED
/srv/gump/public/workspace/db-derby/build.xml:453: The following error occurred while executing this line:
/srv/gump/public/workspace/db-derby/java/engine/build.xml:79: The following error occurred while executing this line:
/srv/gump/public/workspace/db-derby/java/engine/org/apache/derby/iapi/build.xml:65: The following error occurred while executing this line:
/srv/gump/public/workspace/db-derby/java/engine/org/apache/derby/iapi/types/build.xml:53: Compile failed; see the compiler error output for details.

Total time: 33 seconds
---------------------------------------------

To subscribe to this information via syndicated feeds:
- RSS: http://vmgump.apache.org/gump/public/db-derby/derby/rss.xml
- Atom: http://vmgump.apache.org/gump/public/db-derby/derby/atom.xml

============================== Gump Tracking Only ===
Produced by Gump version 2.3.
Gump Run 12000005082010, vmgump:vmgump-public:12000005082010
Gump E-mail Identifier (unique within run) #10.

*********************************************************** G U M P
[GUMP@vmgump]: Project dotnet-antlib-test (in module ant-antlibs) failed
To whom it may engage...
        
This is an automated request, but not an unsolicited one. For 
more information please visit http://gump.apache.org/nagged.html, 
and/or contact the folk at general@gump.apache.org.

Project dotnet-antlib-test has an issue affecting its community integration.
This issue affects 1 projects,
 and has been outstanding for 92 runs.
The current state of this project is 'Failed', with reason 'Build Failed'.
For reference only, the following projects are affected by this:
    - dotnet-antlib-test :  Task and Type Libraries for Apache Ant


Full details are available at:
    http://vmgump.apache.org/gump/public/ant-antlibs/dotnet-antlib-test/index.html

That said, some information snippets are provided here.

The following annotations (debug/informational/warning/error messages) were provided:
 -INFO- Failed with reason build failed



The following work was performed:
http://vmgump.apache.org/gump/public/ant-antlibs/dotnet-antlib-test/gump_work/build_ant-antlibs_dotnet-antlib-test.html
Work Name: build_ant-antlibs_dotnet-antlib-test (Type: Build)
Work ended in a state of : Failed
Elapsed: 17 secs
Command Line: /usr/lib/jvm/java-6-sun/bin/java -Djava.awt.headless=true -Xbootclasspath/p:/srv/gump/public/workspace/xml-xerces2/build/xercesImpl.jar:/srv/gump/public/workspace/xml-commons/java/external/build/xml-apis.jar org.apache.tools.ant.Main -Dgump.merge=/srv/gump/public/gump/work/merge.xml -Dbuild.sysclasspath=only -Dant-testutil.jar=/srv/gump/public/workspace/ant/build/lib/ant-testutil.jar test 
[Working Directory: /srv/gump/public/workspace/ant-antlibs/dotnet]
CLASSPATH: /usr/lib/jvm/java-6-sun/lib/tools.jar:/srv/gump/public/workspace/ant-antlibs/dotnet/build/test-classes:/srv/gump/public/workspace/ant/dist/lib/ant.jar:/srv/gump/public/workspace/ant/dist/lib/ant-launcher.jar:/srv/gump/public/workspace/ant/dist/lib/ant-jmf.jar:/srv/gump/public/workspace/ant/dist/lib/ant-junit.jar:/srv/gump/public/workspace/ant/dist/lib/ant-swing.jar:/srv/gump/public/workspace/ant/dist/lib/ant-apache-resolver.jar:/srv/gump/public/workspace/ant/dist/lib/ant-apache-xalan2.jar:/srv/gump/public/workspace/ant-antlibs/antunit/build/ant-antunit-05082010.jar:/srv/gump/public/workspace/ant-antlibs/dotnet/build/ant-dotnet-05082010.jar:/srv/gump/public/workspace/xml-commons/java/external/build/xml-apis-ext.jar
---------------------------------------------
[au:antunit] 	at line 96, column 37
[au:antunit] 	Message: Needed .net apps are missing
[au:antunit] 	took 0.009 sec
[au:antunit] Target: testBothSrc  caused an ERROR
[au:antunit] 	at line 96, column 37
[au:antunit] 	Message: Needed .net apps are missing
[au:antunit] 	took 0.006 sec
[au:antunit] Target: testSchemaFileMustHaveOneOptionOnly  caused an ERROR
[au:antunit] 	at line 96, column 37
[au:antunit] 	Message: Needed .net apps are missing
[au:antunit] 	took 0.007 sec
[au:antunit] Target: testLocalWsdl  caused an ERROR
[au:antunit] 	at line 96, column 37
[au:antunit] 	Message: Needed .net apps are missing
[au:antunit] 	took 0.014 sec
[au:antunit] Target: testSrcIsDir  caused an ERROR
[au:antunit] 	at line 96, column 37
[au:antunit] 	Message: Needed .net apps are missing
[au:antunit] 	took 0.006 sec
[au:antunit] Target: testLocalWsdlServerVB  caused an ERROR
[au:antunit] 	at line 96, column 37
[au:antunit] 	Message: Needed .net apps are missing
[au:antunit] 	took 0.008 sec
[au:antunit] Target: testLocalWsdlServer  caused an ERROR
[au:antunit] 	at line 96, column 37
[au:antunit] 	Message: Needed .net apps are missing
[au:antunit] 	took 0.009 sec
[au:antunit] Target: testNoSrc  caused an ERROR
[au:antunit] 	at line 96, column 37
[au:antunit] 	Message: Needed .net apps are missing
[au:antunit] 	took 0.009 sec
[au:antunit] Target: testSchemaFileMustExist  caused an ERROR
[au:antunit] 	at line 96, column 37
[au:antunit] 	Message: Needed .net apps are missing
[au:antunit] 	took 0.007 sec
[au:antunit] Target: testInvalidExtraOpsVB  caused an ERROR
[au:antunit] 	at line 96, column 37
[au:antunit] 	Message: Needed .net apps are missing
[au:antunit] 	took 0.013 sec
[au:antunit] Target: testDestIsDir  caused an ERROR
[au:antunit] 	at line 96, column 37
[au:antunit] 	Message: Needed .net apps are missing
[au:antunit] 	took 0.008 sec

test:

BUILD FAILED
/srv/gump/public/workspace/ant-antlibs/dotnet/common/build.xml:226: At least one AntUnit test has failed.

Total time: 16 seconds
---------------------------------------------

To subscribe to this information via syndicated feeds:
- RSS: http://vmgump.apache.org/gump/public/ant-antlibs/dotnet-antlib-test/rss.xml
- Atom: http://vmgump.apache.org/gump/public/ant-antlibs/dotnet-antlib-test/atom.xml

============================== Gump Tracking Only ===
Produced by Gump version 2.3.
Gump Run 12000005082010, vmgump:vmgump-public:12000005082010
Gump E-mail Identifier (unique within run) #13.

*********************************************************** G U M P
[GUMP@vmgump]: Project lucene-java-contrib (in module lucene-java) failed
To whom it may engage...
        
This is an automated request, but not an unsolicited one. For 
more information please visit http://gump.apache.org/nagged.html, 
and/or contact the folk at general@gump.apache.org.

Project lucene-java-contrib has an issue affecting its community integration.
This issue affects 1 projects,
 and has been outstanding for 10 runs.
The current state of this project is 'Failed', with reason 'Build Failed'.
For reference only, the following projects are affected by this:
    - lucene-java-contrib :  Java Based Search Engine


Full details are available at:
    http://vmgump.apache.org/gump/public/lucene-java/lucene-java-contrib/index.html

That said, some information snippets are provided here.

The following annotations (debug/informational/warning/error messages) were provided:
 -DEBUG- Dependency on javacc exists, no need to add for property javacc.home.
 -INFO- Failed with reason build failed



The following work was performed:
http://vmgump.apache.org/gump/public/lucene-java/lucene-java-contrib/gump_work/build_lucene-java_lucene-java-contrib.html
Work Name: build_lucene-java_lucene-java-contrib (Type: Build)
Work ended in a state of : Failed
Elapsed: 7 secs
Command Line: /usr/lib/jvm/java-6-sun/bin/java -Djava.awt.headless=true -Xbootclasspath/p:/srv/gump/public/workspace/xml-commons/java/external/build/xml-apis.jar:/srv/gump/public/workspace/xml-xerces2/build/xercesImpl.jar org.apache.tools.ant.Main -Dgump.merge=/srv/gump/public/gump/work/merge.xml -Dbuild.sysclasspath=only -Dversion=05082010 -Djavacc.home=/srv/gump/packages/javacc-3.1 package 
[Working Directory: /srv/gump/public/workspace/lucene-java]
CLASSPATH: /usr/lib/jvm/java-6-sun/lib/tools.jar:/srv/gump/public/workspace/lucene-java/build/classes/demo:/srv/gump/public/workspace/lucene-java/build/classes/test:/srv/gump/public/workspace/lucene-java/contrib/db/bdb/lib/db-4.7.25.jar:/srv/gump/public/workspace/lucene-java/contrib/gdata-server/lib/gdata-client-1.0.jar:/srv/gump/public/workspace/lucene-java/build/contrib/analyzers/common/classes/java:/srv/gump/public/workspace/lucene-java/build/contrib/analyzers/smartcn/classes/java:/srv/gump/public/workspace/lucene-java/build/contrib/analyzers/stempel/classes/java:/srv/gump/public/workspace/lucene-java/build/contrib/ant/classes/java:/srv/gump/public/workspace/lucene-java/build/contrib/benchmark/classes/java:/srv/gump/public/workspace/lucene-java/build/contrib/collation/classes/java:/srv/gump/public/workspace/lucene-java/build/contrib/db/bdb-je/classes/java:/srv/gump/public/workspace/lucene-java/build/contrib/db/bdb/classes/java:/srv/gump/public/workspace/lucene-java/build/c
 ontrib/fast-vector-highlighter/classes/java:/srv/gump/public/workspace/lucene-java/build/contrib/gdata-server/classes/java:/srv/gump/public/workspace/lucene-java/build/contrib/highlighter/classes/java:/srv/gump/public/workspace/lucene-java/build/contrib/icu/classes/java:/srv/gump/public/workspace/lucene-java/build/contrib/instantiated/classes/java:/srv/gump/public/workspace/lucene-java/build/contrib/javascript/classes/java:/srv/gump/public/workspace/lucene-java/build/contrib/lucli/classes/java:/srv/gump/public/workspace/lucene-java/build/contrib/memory/classes/java:/srv/gump/public/workspace/lucene-java/build/contrib/misc/classes/java:/srv/gump/public/workspace/lucene-java/build/contrib/queries/classes/java:/srv/gump/public/workspace/lucene-java/build/contrib/queryparser/classes/java:/srv/gump/public/workspace/lucene-java/build/contrib/regex/classes/java:/srv/gump/public/workspace/lucene-java/build/contrib/remote/classes/java:/srv/gump/public/workspace/lucene-java/build/cont
 rib/similarity/classes/java:/srv/gump/public/workspace/lucene-java/build/contrib/snowball/classes/java:/srv/gump/public/workspace/lucene-java/build/contrib/spatial/classes/java:/srv/gump/public/workspace/lucene-java/build/contrib/spellchecker/classes/java:/srv/gump/public/workspace/lucene-java/build/contrib/surround/classes/java:/srv/gump/public/workspace/lucene-java/build/contrib/swing/classes/java:/srv/gump/public/workspace/lucene-java/build/contrib/wikipedia/classes/java:/srv/gump/public/workspace/lucene-java/build/contrib/wordnet/classes/java:/srv/gump/public/workspace/lucene-java/build/contrib/xml-query-parser/classes/java:/srv/gump/public/workspace/ant/dist/lib/ant.jar:/srv/gump/public/workspace/ant/dist/lib/ant-launcher.jar:/srv/gump/public/workspace/ant/dist/lib/ant-jmf.jar:/srv/gump/public/workspace/ant/dist/lib/ant-junit.jar:/srv/gump/public/workspace/ant/dist/lib/ant-swing.jar:/srv/gump/public/workspace/ant/dist/lib/ant-apache-resolver.jar:/srv/gump/public/workspa
 ce/ant/dist/lib/ant-apache-xalan2.jar:/srv/gump/packages/junit3.8.1/junit.jar:/srv/gump/public/workspace/xml-commons/java/build/resolver.jar:/srv/gump/packages/je-1.7.1/lib/je.jar:/srv/gump/public/workspace/apache-commons/digester/dist/commons-digester.jar:/srv/gump/packages/caucho-libs/hessian-3.0.8.jar:/srv/gump/public/workspace/icu4j/main/classes/core/out/lib/icu4j-core.jar:/srv/gump/public/workspace/icu4j/main/classes/collate/out/lib/icu4j-collate.jar:/srv/gump/public/workspace/icu4j/main/classes/currdata/out/lib/icu4j-currdata.jar:/srv/gump/public/workspace/icu4j/main/classes/langdata/out/lib/icu4j-langdata.jar:/srv/gump/public/workspace/icu4j/main/classes/regiondata/out/lib/icu4j-regiondata.jar:/srv/gump/public/workspace/icu4j/main/classes/translit/out/lib/icu4j-translit.jar:/srv/gump/public/workspace/icu4j/main/classes/charset/out/lib/icu4j-charset.jar:/srv/gump/public/workspace/icu4j/main/classes/localespi/out/lib/icu4j-localespi.jar:/srv/gump/public/workspace/jakart
 a-regexp/build/jakarta-regexp-05082010.jar:/srv/gump/packages/javacc-3.1/bin/lib/javacc.jar:/srv/gump/public/workspace/jline/target/jline-0.9.95-SNAPSHOT.jar:/srv/gump/packages/jtidy/jtidy-r938.jar:/srv/gump/public/workspace/junit/dist/junit-05082010.jar:/srv/gump/public/workspace/lucene-java/build/lucene-core-05082010.jar:/srv/gump/public/workspace/xml-commons/java/external/build/xml-apis-ext.jar:/srv/gump/public/workspace/apache-commons/compress/target/commons-compress-1.1-SNAPSHOT.jar:/srv/gump/public/workspace/apache-commons/logging/target/commons-logging-05082010.jar:/srv/gump/public/workspace/apache-commons/logging/target/commons-logging-api-05082010.jar:/srv/gump/public/workspace/jakarta-servletapi-5/jsr154/dist/lib/servlet-api.jar:/srv/gump/packages/nekohtml-0.9.5/nekohtml.jar
---------------------------------------------
Buildfile: /srv/gump/public/workspace/lucene-java/build.xml

jflex-uptodate-check:

jflex-notice:

javacc-uptodate-check:

javacc-notice:

init:

clover.setup:

clover.info:
     [echo] 
     [echo]       Clover not found. Code coverage reports disabled.
     [echo]   	

clover:

common.compile-core:

compile-core:

jar-core:
      [jar] Building jar: /srv/gump/public/workspace/lucene-java/build/lucene-core-05082010.jar

compile-test:
    [javac] Compiling 1 source file to /srv/gump/public/workspace/lucene-java/build/classes/test

build-contrib:
     [echo] Building ant...

compile-analyzers-common:

BUILD FAILED
/srv/gump/public/workspace/lucene-java/build.xml:546: The following error occurred while executing this line:
/srv/gump/public/workspace/lucene-java/build.xml:535: The following error occurred while executing this line:
/srv/gump/public/workspace/lucene-java/contrib/ant/build.xml:49: /srv/gump/public/workspace/modules/analysis/common does not exist.

Total time: 5 seconds
---------------------------------------------

To subscribe to this information via syndicated feeds:
- RSS: http://vmgump.apache.org/gump/public/lucene-java/lucene-java-contrib/rss.xml
- Atom: http://vmgump.apache.org/gump/public/lucene-java/lucene-java-contrib/atom.xml

============================== Gump Tracking Only ===
Produced by Gump version 2.3.
Gump Run 12000005082010, vmgump:vmgump-public:12000005082010
Gump E-mail Identifier (unique within run) #18.

*********************************************************** G U M P
[GUMP@vmgump]: Project slf4j-test (in module slf4j) failed
To whom it may engage...
        
This is an automated request, but not an unsolicited one. For 
more information please visit http://gump.apache.org/nagged.html, 
and/or contact the folk at general@gump.apache.org.

Project slf4j-test has an issue affecting its community integration.
This issue affects 1 projects.
The current state of this project is 'Failed', with reason 'Build Failed'.
For reference only, the following projects are affected by this:
    - slf4j-test :  Simple Logging Facade for Java


Full details are available at:
    http://vmgump.apache.org/gump/public/slf4j/slf4j-test/index.html

That said, some information snippets are provided here.

The following annotations (debug/informational/warning/error messages) were provided:
 -WARNING- Overriding Maven2 settings: [/srv/gump/public/workspace/slf4j/gump_mvn_settings.xml]
 -DEBUG- (Gump generated) Maven2 Settings in: /srv/gump/public/workspace/slf4j/gump_mvn_settings.xml
 -INFO- Failed with reason build failed
 -DEBUG- Maven POM in: /srv/gump/public/workspace/slf4j/pom.xml



The following work was performed:
http://vmgump.apache.org/gump/public/slf4j/slf4j-test/gump_work/build_slf4j_slf4j-test.html
Work Name: build_slf4j_slf4j-test (Type: Build)
Work ended in a state of : Failed
Elapsed: 14 secs
Command Line: mvn --batch-mode --settings /srv/gump/public/workspace/slf4j/gump_mvn_settings.xml package 
[Working Directory: /srv/gump/public/workspace/slf4j]
---------------------------------------------
[INFO] ------------------------------------------------------------------------
[INFO] Building SLF4J JDK14 Binding
[INFO]    task-segment: [package]
[INFO] ------------------------------------------------------------------------
[INFO] [resources:resources {execution: default-resources}]
[WARNING] File encoding has not been set, using platform encoding UTF-8, i.e. build is platform dependent!
[WARNING] Using platform encoding (UTF-8 actually) to copy filtered resources, i.e. build is platform dependent!
[INFO] Copying 1 resource
[INFO] [compiler:compile {execution: default-compile}]
[INFO] Nothing to compile - all classes are up to date
[INFO] [resources:testResources {execution: default-testResources}]
[WARNING] Using platform encoding (UTF-8 actually) to copy filtered resources, i.e. build is platform dependent!
[INFO] skip non existing resourceDirectory /srv/gump/public/workspace/slf4j/slf4j-jdk14/src/test/resources
[INFO] [compiler:testCompile {execution: default-testCompile}]
[INFO] Nothing to compile - all classes are up to date
[INFO] [surefire:test {execution: default-test}]
[INFO] Surefire report directory: /srv/gump/public/workspace/slf4j/slf4j-jdk14/target/surefire-reports

-------------------------------------------------------
 T E S T S
-------------------------------------------------------
Running org.slf4j.impl.JDK14AdapterLoggerNameTest
Tests run: 2, Failures: 0, Errors: 0, Skipped: 0, Time elapsed: 0.072 sec
Running org.slf4j.impl.PerfTest
Host runs at 9518.025736836773 BIPS
currentBIPS=9398.0501865278 BIPS
Tests run: 1, Failures: 1, Errors: 0, Skipped: 0, Time elapsed: 1.223 sec <<< FAILURE!
Running org.slf4j.InvocationTest
Tests run: 5, Failures: 0, Errors: 0, Skipped: 0, Time elapsed: 0.018 sec

Results :

Failed tests: 
  testBug72(org.slf4j.impl.PerfTest)

Tests run: 8, Failures: 1, Errors: 0, Skipped: 0

[INFO] ------------------------------------------------------------------------
[ERROR] BUILD FAILURE
[INFO] ------------------------------------------------------------------------
[INFO] There are test failures.

Please refer to /srv/gump/public/workspace/slf4j/slf4j-jdk14/target/surefire-reports for the individual test results.
[INFO] ------------------------------------------------------------------------
[INFO] For more information, run Maven with the -e switch
[INFO] ------------------------------------------------------------------------
[INFO] Total time: 12 seconds
[INFO] Finished at: Thu Aug 05 02:50:14 PDT 2010
[INFO] Final Memory: 22M/53M
[INFO] ------------------------------------------------------------------------
---------------------------------------------

To subscribe to this information via syndicated feeds:
- RSS: http://vmgump.apache.org/gump/public/slf4j/slf4j-test/rss.xml
- Atom: http://vmgump.apache.org/gump/public/slf4j/slf4j-test/atom.xml

============================== Gump Tracking Only ===
Produced by Gump version 2.3.
Gump Run 12000005082010, vmgump:vmgump-public:12000005082010
Gump E-mail Identifier (unique within run) #19.

*********************************************************** G U M P
[GUMP@vmgump]: Project xml-security-tests (in module xml-security) failed
To whom it may engage...
        
This is an automated request, but not an unsolicited one. For 
more information please visit http://gump.apache.org/nagged.html, 
and/or contact the folk at general@gump.apache.org.

Project xml-security-tests has an issue affecting its community integration.
This issue affects 1 projects,
 and has been outstanding for 14 runs.
The current state of this project is 'Failed', with reason 'Build Failed'.
For reference only, the following projects are affected by this:
    - xml-security-tests :  XML-Signature Syntax and Processing


Full details are available at:
    http://vmgump.apache.org/gump/public/xml-security/xml-security-tests/index.html

That said, some information snippets are provided here.

The following annotations (debug/informational/warning/error messages) were provided:
 -DEBUG- Dependency on jce exists, no need to add for property lib.jce.
 -INFO- Failed with reason build failed



The following work was performed:
http://vmgump.apache.org/gump/public/xml-security/xml-security-tests/gump_work/build_xml-security_xml-security-tests.html
Work Name: build_xml-security_xml-security-tests (Type: Build)
Work ended in a state of : Failed
Elapsed: 3 secs
Command Line: /usr/lib/jvm/java-6-sun/bin/java -Djava.awt.headless=true -Dant.build.clonevm=true -Xbootclasspath/p:/srv/gump/public/workspace/xml-commons/java/external/build/xml-apis.jar:/srv/gump/public/workspace/xml-xerces2/build/xercesImpl.jar:/srv/gump/public/workspace/xml-xalan/build/xalan-unbundled.jar:/srv/gump/public/workspace/xml-xalan/build/serializer.jar org.apache.tools.ant.Main -Dgump.merge=/srv/gump/public/gump/work/merge.xml -Dbuild.sysclasspath=only -Djce.download.sha1=c1f0e975e8c8e0a0105787b249a50615b485d109 -Dlib.jce=/srv/gump/packages/jce/jce-jdk13-116.jar -Djce.download.md5=85c64cd754719a4bc8da7e9aa0e113fd test 
[Working Directory: /srv/gump/public/workspace/xml-security]
CLASSPATH: /usr/lib/jvm/java-6-sun/lib/tools.jar:/srv/gump/public/workspace/xml-security/build/test:/srv/gump/public/workspace/xml-security:/srv/gump/public/workspace/xml-security/build/xmlsec-05082010.jar:/srv/gump/public/workspace/ant/dist/lib/ant.jar:/srv/gump/public/workspace/ant/dist/lib/ant-launcher.jar:/srv/gump/public/workspace/ant/dist/lib/ant-jmf.jar:/srv/gump/public/workspace/ant/dist/lib/ant-junit.jar:/srv/gump/public/workspace/ant/dist/lib/ant-swing.jar:/srv/gump/public/workspace/ant/dist/lib/ant-apache-resolver.jar:/srv/gump/public/workspace/ant/dist/lib/ant-apache-xalan2.jar:/srv/gump/packages/junit3.8.1/junit.jar:/srv/gump/public/workspace/xml-commons/java/build/resolver.jar:/srv/gump/public/workspace/xml-commons/java/external/build/xml-apis-ext.jar:/srv/gump/packages/jce/jce-jdk13-116.jar:/srv/gump/public/workspace/apache-commons/logging/target/commons-logging-05082010.jar:/srv/gump/public/workspace/apache-commons/logging/target/commons-logging-api-05082010.j
 ar:/srv/gump/public/workspace/junit/dist/junit-05082010.jar
---------------------------------------------
Buildfile: /srv/gump/public/workspace/xml-security/build.xml
  [taskdef] Could not load definitions from resource clovertasks. It could not be found.

manifest:

do.build.src:

init:
     [echo] 
     [echo] -------------------------------------------------------------------
     [echo] --------- Apache-XML-Security-J v1.4.4-SNAPSHOT [2000-2010] -----------
     [echo] -------------------------------------------------------------------
     [echo] Building with Apache Ant version 1.8.2alpha compiled on August 5 2010
     [echo] Java 1.6.0_20 located at /usr/lib/jvm/java-6-sun-1.6.0.20/jre 
     [echo] -------------------------------------------------------------------
     [echo] 

env.mk.dirs:

do.check.bindist:

build.src:

build.test:

build.samples:

build.jar:
      [jar] Building jar: /srv/gump/public/workspace/xml-security/build/xmlsec-1.4.4-SNAPSHOT.jar
      [jar] Building jar: /srv/gump/public/workspace/xml-security/build/xmlsecSamples-1.4.4-SNAPSHOT.jar
      [jar] Building jar: /srv/gump/public/workspace/xml-security/build/xmlsecTests-1.4.4-SNAPSHOT.jar

test:
    [mkdir] Created dir: /srv/gump/public/workspace/xml-security/build/docs/xml/junit
    [mkdir] Created dir: /srv/gump/public/workspace/xml-security/build/docs/html/junit
     [copy] Copying 1 file to /srv/gump/public/workspace/xml-security/build/libs/endorsed
     [copy] Copying 1 file to /srv/gump/public/workspace/xml-security/build/libs/endorsed
     [copy] Copying 1 file to /srv/gump/public/workspace/xml-security/build/libs/endorsed
     [copy] Copying 1 file to /srv/gump/public/workspace/xml-security/build/libs/endorsed
     [copy] Copying 1 file to /srv/gump/public/workspace/xml-security/build/libs/endorsed
     [copy] Copying 1 file to /srv/gump/public/workspace/xml-security/build/libs/endorsed

BUILD FAILED
/srv/gump/public/workspace/xml-security/build.xml:353: Warning: Could not find file /srv/gump/public/workspace/xml-security/libs/junit-3.8.1.jar to copy.

Total time: 2 seconds
---------------------------------------------

To subscribe to this information via syndicated feeds:
- RSS: http://vmgump.apache.org/gump/public/xml-security/xml-security-tests/rss.xml
- Atom: http://vmgump.apache.org/gump/public/xml-security/xml-security-tests/atom.xml

============================== Gump Tracking Only ===
Produced by Gump version 2.3.
Gump Run 12000005082010, vmgump:vmgump-public:12000005082010
Gump E-mail Identifier (unique within run) #20.

*********************************************************** G U M P
[GUMP@vmgump]: Project castor-xml-test (in module castor) failed
To whom it may engage...
        
This is an automated request, but not an unsolicited one. For 
more information please visit http://gump.apache.org/nagged.html, 
and/or contact the folk at general@gump.apache.org.

Project castor-xml-test has an issue affecting its community integration.
This issue affects 1 projects,
 and has been outstanding for 40 runs.
The current state of this project is 'Failed', with reason 'Build Failed'.
For reference only, the following projects are affected by this:
    - castor-xml-test :  Java to XML, SQL, LDAP bindings


Full details are available at:
    http://vmgump.apache.org/gump/public/castor/castor-xml-test/index.html

That said, some information snippets are provided here.

The following annotations (debug/informational/warning/error messages) were provided:
 -WARNING- Overriding Maven2 settings: [/srv/gump/public/workspace/castor/xml/gump_mvn_settings.xml]
 -DEBUG- (Gump generated) Maven2 Settings in: /srv/gump/public/workspace/castor/xml/gump_mvn_settings.xml
 -INFO- Failed with reason build failed
 -DEBUG- Maven POM in: /srv/gump/public/workspace/castor/xml/pom.xml



The following work was performed:
http://vmgump.apache.org/gump/public/castor/castor-xml-test/gump_work/build_castor_castor-xml-test.html
Work Name: build_castor_castor-xml-test (Type: Build)
Work ended in a state of : Failed
Elapsed: 18 secs
Command Line: mvn --batch-mode --settings /srv/gump/public/workspace/castor/xml/gump_mvn_settings.xml package 
[Working Directory: /srv/gump/public/workspace/castor/xml]
---------------------------------------------
Tests run: 4, Failures: 0, Errors: 0, Skipped: 0, Time elapsed: 0.011 sec
Running org.castor.xml.JavaNamingTest
[main] - Package name: . is not valid
[main] - Package name: .org is not valid
[main] - Package name: org. is not valid
[main] - Package name: . is not valid
[main] - Package name: .org is not valid
[main] - Package name: org. is not valid
Tests run: 10, Failures: 0, Errors: 0, Skipped: 0, Time elapsed: 0.036 sec
Running org.castor.util.TestBase64Decoder
Tests run: 2, Failures: 0, Errors: 0, Skipped: 0, Time elapsed: 0.006 sec
Running org.exolab.castor.xml.PrimitiveObjectTest
Tests run: 22, Failures: 0, Errors: 0, Skipped: 0, Time elapsed: 0.014 sec
Running org.exolab.castor.xml.Sax2EventFromStaxProducerIntegrationTest
Tests run: 4, Failures: 1, Errors: 0, Skipped: 0, Time elapsed: 0.043 sec <<< FAILURE!
Running org.exolab.castor.xml.validators.IntegerValidatorTest
Tests run: 10, Failures: 0, Errors: 0, Skipped: 0, Time elapsed: 0.028 sec
Running org.castor.xml.XMLPropertiesTest
Tests run: 4, Failures: 0, Errors: 0, Skipped: 0, Time elapsed: 0.01 sec
Running org.castor.util.TestHex
Tests run: 1, Failures: 0, Errors: 0, Skipped: 0, Time elapsed: 0.005 sec
Running org.exolab.castor.xml.TestUnmarshaller
[main] - InternalContext must not be null
[main] - InternalContext must not be null
[main] - InternalContext must not be null
[main] - InternalContext must not be null
Tests run: 19, Failures: 0, Errors: 0, Skipped: 0, Time elapsed: 0.096 sec
Running org.exolab.castor.xml.XMLContextTest
Tests run: 2, Failures: 0, Errors: 0, Skipped: 0, Time elapsed: 0.153 sec

Results :

Failed tests: 
  testPrefixUnbound(org.exolab.castor.xml.Sax2EventFromStaxProducerIntegrationTest)

Tests run: 134, Failures: 1, Errors: 0, Skipped: 0

[INFO] ------------------------------------------------------------------------
[ERROR] BUILD FAILURE
[INFO] ------------------------------------------------------------------------
[INFO] There are test failures.

Please refer to /srv/gump/public/workspace/castor/xml/target/surefire-reports for the individual test results.
[INFO] ------------------------------------------------------------------------
[INFO] For more information, run Maven with the -e switch
[INFO] ------------------------------------------------------------------------
[INFO] Total time: 16 seconds
[INFO] Finished at: Thu Aug 05 03:50:13 PDT 2010
[INFO] Final Memory: 13M/31M
[INFO] ------------------------------------------------------------------------
---------------------------------------------

To subscribe to this information via syndicated feeds:
- RSS: http://vmgump.apache.org/gump/public/castor/castor-xml-test/rss.xml
- Atom: http://vmgump.apache.org/gump/public/castor/castor-xml-test/atom.xml

============================== Gump Tracking Only ===
Produced by Gump version 2.3.
Gump Run 12000005082010, vmgump:vmgump-public:12000005082010
Gump E-mail Identifier (unique within run) #23.

*********************************************************** G U M P
[GUMP@vmgump]: Project JacORB-idllib (in module JacORB) failed
To whom it may engage...
        
This is an automated request, but not an unsolicited one. For 
more information please visit http://gump.apache.org/nagged.html, 
and/or contact the folk at general@gump.apache.org.

Project JacORB-idllib has an issue affecting its community integration.
This issue affects 2 projects,
 and has been outstanding for 64 runs.
The current state of this project is 'Failed', with reason 'Build Failed'.
For reference only, the following projects are affected by this:
    - JacORB :  The free Java implementation of the OMG's CORBA standard.
    - JacORB-idllib :  The free Java implementation of the OMG's CORBA standard.


Full details are available at:
    http://vmgump.apache.org/gump/public/JacORB/JacORB-idllib/index.html

That said, some information snippets are provided here.

The following annotations (debug/informational/warning/error messages) were provided:
 -DEBUG- Sole jar output [idl.jar] identifier set to project name
 -INFO- Failed with reason build failed
 -INFO- Failed to extract fallback artifacts from Gump Repository



The following work was performed:
http://vmgump.apache.org/gump/public/JacORB/JacORB-idllib/gump_work/build_JacORB_JacORB-idllib.html
Work Name: build_JacORB_JacORB-idllib (Type: Build)
Work ended in a state of : Failed
Elapsed: 5 secs
Command Line: /usr/lib/jvm/java-6-sun/bin/java -Djava.awt.headless=true -Xbootclasspath/p:/srv/gump/public/workspace/xml-commons/java/external/build/xml-apis.jar:/srv/gump/public/workspace/xml-xerces2/build/xercesImpl.jar org.apache.tools.ant.Main -Dgump.merge=/srv/gump/public/gump/work/merge.xml -Dbuild.sysclasspath=only init idllib 
[Working Directory: /srv/gump/public/workspace/JacORB]
CLASSPATH: /usr/lib/jvm/java-6-sun/lib/tools.jar:/srv/gump/public/workspace/ant/build/lib/ant.jar:/srv/gump/public/workspace/ant/build/lib/ant-launcher.jar:/srv/gump/public/workspace/ant/build/lib/ant-antlr.jar:/srv/gump/public/workspace/ant/build/lib/ant-apache-bcel.jar:/srv/gump/public/workspace/ant/build/lib/ant-apache-bsf.jar:/srv/gump/public/workspace/ant/build/lib/ant-apache-log4j.jar:/srv/gump/public/workspace/ant/build/lib/ant-apache-oro.jar:/srv/gump/public/workspace/ant/build/lib/ant-apache-regexp.jar:/srv/gump/public/workspace/ant/build/lib/ant-apache-resolver.jar:/srv/gump/public/workspace/ant/build/lib/ant-apache-xalan2.jar:/srv/gump/public/workspace/ant/build/lib/ant-commons-logging.jar:/srv/gump/public/workspace/ant/build/lib/ant-commons-net.jar:/srv/gump/public/workspace/ant/build/lib/ant-jai.jar:/srv/gump/public/workspace/ant/build/lib/ant-javamail.jar:/srv/gump/public/workspace/ant/build/lib/ant-jdepend.jar:/srv/gump/public/workspace/ant/build/lib/ant-jmf.ja
 r:/srv/gump/public/workspace/ant/build/lib/ant-jsch.jar:/srv/gump/public/workspace/ant/build/lib/ant-junit.jar:/srv/gump/public/workspace/ant/build/lib/ant-junit4.jar:/srv/gump/public/workspace/ant/build/lib/ant-swing.jar:/srv/gump/public/workspace/xml-commons/java/external/build/xml-apis-ext.jar:/srv/gump/packages/antlr/antlr-3.1.3.jar:/srv/gump/public/workspace/excalibur/framework/api/target/avalon-framework-api-4.3.2-SNAPSHOT.jar:/srv/gump/packages/dougLea/concurrent.jar:/srv/gump/packages/avalon/avalon-logkit-2.1.jar:/srv/gump/public/workspace/xml-xalan/tools/java_cup.jar:/srv/gump/public/workspace/xml-xalan/lib/runtime.jar
---------------------------------------------
    [javac] location: package org.jacorb.idl.runtime
    [javac]               CUP$parser$result = new org.jacorb.idl.runtime.Symbol(89/*param_dcls*/, ((org.jacorb.idl.runtime.Symbol)CUP$parser$stack.elementAt(CUP$parser$top-2)).left, ((org.jacorb.idl.runtime.Symbol)CUP$parser$stack.elementAt(CUP$parser$top-0)).right, RESULT);
    [javac]                                                                                                                                                                                                   ^
    [javac] /srv/gump/public/workspace/JacORB/src/org/jacorb/idl/parser.java:2099: cannot find symbol
    [javac] symbol  : class Symbol
    [javac] location: package org.jacorb.idl.runtime
    [javac]               CUP$parser$result = new org.jacorb.idl.runtime.Symbol(91/*parameter_dcls*/, ((org.jacorb.idl.runtime.Symbol)CUP$parser$stack.elementAt(CUP$parser$top-1)).left, ((org.jacorb.idl.runtime.Symbol)CUP$parser$stack.elementAt(CUP$parser$top-0)).right, RESULT);
    [javac]                                                             ^
    [javac] /srv/gump/public/workspace/JacORB/src/org/jacorb/idl/parser.java:2099: cannot find symbol
    [javac] symbol  : class Symbol
    [javac] location: package org.jacorb.idl.runtime
    [javac]               CUP$parser$result = new org.jacorb.idl.runtime.Symbol(91/*parameter_dcls*/, ((org.jacorb.idl.runtime.Symbol)CUP$parser$stack.elementAt(CUP$parser$top-1)).left, ((org.jacorb.idl.runtime.Symbol)CUP$parser$stack.elementAt(CUP$parser$top-0)).right, RESULT);
    [javac]                                                                                                                   ^
    [javac] /srv/gump/public/workspace/JacORB/src/org/jacorb/idl/parser.java:2099: cannot find symbol
    [javac] symbol  : class Symbol
    [javac] location: package org.jacorb.idl.runtime
    [javac]               CUP$parser$result = new org.jacorb.idl.runtime.Symbol(91/*parameter_dcls*/, ((org.jacorb.idl.runtime.Symbol)CUP$parser$stack.elementAt(CUP$parser$top-1)).left, ((org.jacorb.idl.runtime.Symbol)CUP$parser$stack.elementAt(CUP$parser$top-0)).right, RESULT);
    [javac]                                                                                                                                                                                                       ^
    [javac] /srv/gump/public/workspace/JacORB/src/org/jacorb/idl/parser.java:2107: cannot find symbol
    [javac] symbol  : class Symbol
    [javac] location: package org.jacorb.idl.runtime
    [javac] 		int pdsleft = ((org.jacorb.idl.runtime.Symbol)CUP$parser$stack.elementAt(CUP$parser$top-1)).left;
    [javac] 		                                      ^
    [javac] /srv/gump/public/workspace/JacORB/src/org/jacorb/idl/parser.java:2108: cannot find symbol
    [javac] symbol  : class Symbol
    [javac] location: package org.jacorb.idl.runtime
    [javac] 		int pdsright = ((org.jacorb.idl.runtime.Symbol)CUP$parser$stack.elementAt(CUP$parser$top-1)).right;
    [javac] 		                                       ^
    [javac] /srv/gump/public/workspace/JacORB/src/org/jacorb/idl/parser.java:2109: cannot find symbol
    [javac] symbol  : class Symbol
    [javac] location: package org.jacorb.idl.runtime
    [javac] 		SymbolList pds = (SymbolList)((org.jacorb.idl.runtime.Symbol) CUP$parser$stack.elementAt(CUP$parser$top-1)).value;
    [javac] 		                                                     ^
    [javac] /srv/gump/public/workspace/JacORB/src/org/jacorb/idl/parser.java:2113: cannot find symbol
    [javac] symbol  : class Symbol
    [javac] location: package org.jacorb.idl.runtime
    [javac]               CUP$parser$result = new org.jacorb.idl.runtime.Symbol(91/*parameter_dcls*/, ((org.jacorb.idl.runtime.Symbol)CUP$parser$stack.elementAt(CUP$parser$top-2)).left, ((org.jacorb.idl.runtime.Symbol)CUP$parser$stack.elementAt(CUP$parser$top-0)).right, RESULT);
    [javac]                                                             ^
    [javac] Note: Some input files use or override a deprecated API.
    [javac] Note: Recompile with -Xlint:deprecation for details.
    [javac] Note: Some input files use unchecked or unsafe operations.
    [javac] Note: Recompile with -Xlint:unchecked for details.
    [javac] 100 errors

BUILD FAILED
/srv/gump/public/workspace/JacORB/build.xml:110: The following error occurred while executing this line:
/srv/gump/public/workspace/JacORB/src/org/jacorb/idl/build.xml:18: The following error occurred while executing this line:
/srv/gump/public/workspace/JacORB/etc/common.xml:83: Compile failed; see the compiler error output for details.

Total time: 5 seconds
---------------------------------------------

To subscribe to this information via syndicated feeds:
- RSS: http://vmgump.apache.org/gump/public/JacORB/JacORB-idllib/rss.xml
- Atom: http://vmgump.apache.org/gump/public/JacORB/JacORB-idllib/atom.xml

============================== Gump Tracking Only ===
Produced by Gump version 2.3.
Gump Run 12000005082010, vmgump:vmgump-public:12000005082010
Gump E-mail Identifier (unique within run) #26.

*********************************************************** G U M P
[GUMP@vmgump]: Project commons-jelly-tags-ant-test (in module commons-jelly) failed
To whom it may engage...
        
This is an automated request, but not an unsolicited one. For 
more information please visit http://gump.apache.org/nagged.html, 
and/or contact the folk at general@gump.apache.org.

Project commons-jelly-tags-ant-test has an issue affecting its community integration.
This issue affects 1 projects,
 and has been outstanding for 14 runs.
The current state of this project is 'Failed', with reason 'Build Failed'.
For reference only, the following projects are affected by this:
    - commons-jelly-tags-ant-test :  Commons Jelly


Full details are available at:
    http://vmgump.apache.org/gump/public/commons-jelly/commons-jelly-tags-ant-test/index.html

That said, some information snippets are provided here.

The following annotations (debug/informational/warning/error messages) were provided:
 -DEBUG- Dependency on ant exists, no need to add for property maven.jar.ant-optional.
 -DEBUG- Dependency on xml-xerces exists, no need to add for property maven.jar.xerces.
 -DEBUG- Dependency on commons-jexl-1.x exists, no need to add for property maven.jar.commons-jexl.
 -WARNING- Overriding Maven properties: [/srv/gump/public/workspace/commons-jelly/jelly-tags/ant/build.properties]
 -DEBUG- (Gump generated) Maven Properties in: /srv/gump/public/workspace/commons-jelly/jelly-tags/ant/build.properties
 -INFO- Failed with reason build failed
 -DEBUG- Maven POM in: /srv/gump/public/workspace/commons-jelly/jelly-tags/ant/project.xml
 -DEBUG- Maven project properties in: /srv/gump/public/workspace/commons-jelly/jelly-tags/ant/project.properties
 -INFO- Project Reports in: /srv/gump/public/workspace/commons-jelly/jelly-tags/ant/target/test-reports



The following work was performed:
http://vmgump.apache.org/gump/public/commons-jelly/commons-jelly-tags-ant-test/gump_work/build_commons-jelly_commons-jelly-tags-ant-test.html
Work Name: build_commons-jelly_commons-jelly-tags-ant-test (Type: Build)
Work ended in a state of : Failed
Elapsed: 11 secs
Command Line: maven --offline jar 
[Working Directory: /srv/gump/public/workspace/commons-jelly/jelly-tags/ant]
---------------------------------------------
    [junit] Actual expression: (${foo4.1})=(null)
    [junit] 	at org.apache.commons.jelly.tags.junit.AssertTagSupport.fail(AssertTagSupport.java:44)
    [junit] 	at org.apache.commons.jelly.tags.junit.AssertTagSupport.failNotEquals(AssertTagSupport.java:77)
    [junit] 	at org.apache.commons.jelly.tags.junit.AssertEqualsTag.doTag(AssertEqualsTag.java:56)
    [junit] 	at org.apache.commons.jelly.impl.TagScript.run(TagScript.java:267)
    [junit] 	at org.apache.commons.jelly.impl.ScriptBlock.run(ScriptBlock.java:96)
    [junit] 	at org.apache.commons.jelly.tags.junit.CaseTag$1.runTest(CaseTag.java:60)
    [junit] 
    [junit] 
    [junit] Testcase: startUpReadWrite(org.apache.commons.jelly.tags.junit.CaseTag$1):	Caused an ERROR
    [junit] file:/srv/gump/public/workspace/commons-jelly/jelly-tags/ant/target/test-classes/org/apache/commons/jelly/ant/suite.jelly:98:5: <test:assertEquals> file:/srv/gump/public/workspace/commons-jelly/jelly-tags/ant/target/test-classes/org/apache/commons/jelly/ant/suite.jelly:98:5: <test:assertEquals>  expected:[bar5] but was:[null]
    [junit] Expected expression: (bar5)=(bar5)
    [junit] Actual expression: (${foo5.1})=(null)
    [junit] org.apache.commons.jelly.JellyTagException: file:/srv/gump/public/workspace/commons-jelly/jelly-tags/ant/target/test-classes/org/apache/commons/jelly/ant/suite.jelly:98:5: <test:assertEquals> file:/srv/gump/public/workspace/commons-jelly/jelly-tags/ant/target/test-classes/org/apache/commons/jelly/ant/suite.jelly:98:5: <test:assertEquals>  expected:[bar5] but was:[null]
    [junit] Expected expression: (bar5)=(bar5)
    [junit] Actual expression: (${foo5.1})=(null)
    [junit] 	at org.apache.commons.jelly.impl.TagScript.handleException(TagScript.java:732)
    [junit] 	at org.apache.commons.jelly.impl.TagScript.run(TagScript.java:287)
    [junit] 	at org.apache.commons.jelly.impl.ScriptBlock.run(ScriptBlock.java:96)
    [junit] 	at org.apache.commons.jelly.tags.junit.CaseTag$1.runTest(CaseTag.java:60)
    [junit] Caused by: org.apache.commons.jelly.tags.junit.JellyAssertionFailedError: file:/srv/gump/public/workspace/commons-jelly/jelly-tags/ant/target/test-classes/org/apache/commons/jelly/ant/suite.jelly:98:5: <test:assertEquals>  expected:[bar5] but was:[null]
    [junit] Expected expression: (bar5)=(bar5)
    [junit] Actual expression: (${foo5.1})=(null)
    [junit] 	at org.apache.commons.jelly.tags.junit.AssertTagSupport.fail(AssertTagSupport.java:44)
    [junit] 	at org.apache.commons.jelly.tags.junit.AssertTagSupport.failNotEquals(AssertTagSupport.java:77)
    [junit] 	at org.apache.commons.jelly.tags.junit.AssertEqualsTag.doTag(AssertEqualsTag.java:56)
    [junit] 	at org.apache.commons.jelly.impl.TagScript.run(TagScript.java:267)
    [junit] Root cause
    [junit] org.apache.commons.jelly.tags.junit.JellyAssertionFailedError: file:/srv/gump/public/workspace/commons-jelly/jelly-tags/ant/target/test-classes/org/apache/commons/jelly/ant/suite.jelly:98:5: <test:assertEquals>  expected:[bar5] but was:[null]
    [junit] Expected expression: (bar5)=(bar5)
    [junit] Actual expression: (${foo5.1})=(null)
    [junit] 	at org.apache.commons.jelly.tags.junit.AssertTagSupport.fail(AssertTagSupport.java:44)
    [junit] 	at org.apache.commons.jelly.tags.junit.AssertTagSupport.failNotEquals(AssertTagSupport.java:77)
    [junit] 	at org.apache.commons.jelly.tags.junit.AssertEqualsTag.doTag(AssertEqualsTag.java:56)
    [junit] 	at org.apache.commons.jelly.impl.TagScript.run(TagScript.java:267)
    [junit] 	at org.apache.commons.jelly.impl.ScriptBlock.run(ScriptBlock.java:96)
    [junit] 	at org.apache.commons.jelly.tags.junit.CaseTag$1.runTest(CaseTag.java:60)
    [junit] 
    [junit] 
    [junit] [ERROR] TEST org.apache.commons.jelly.ant.TestJelly FAILED

BUILD FAILED
File...... /home/gump/.maven/cache/maven-test-plugin-1.6.2/plugin.jelly
Element... fail
Line...... 181
Column.... 54
There were test failures.
Total time: 11 seconds
Finished at: Thu Aug 05 04:26:40 PDT 2010

---------------------------------------------

To subscribe to this information via syndicated feeds:
- RSS: http://vmgump.apache.org/gump/public/commons-jelly/commons-jelly-tags-ant-test/rss.xml
- Atom: http://vmgump.apache.org/gump/public/commons-jelly/commons-jelly-tags-ant-test/atom.xml

============================== Gump Tracking Only ===
Produced by Gump version 2.3.
Gump Run 12000005082010, vmgump:vmgump-public:12000005082010
Gump E-mail Identifier (unique within run) #29.

*********************************************************** G U M P
[GUMP@vmgump]: Project portals-bridges-script-test (in module portals-bridges) failed
To whom it may engage...
        
This is an automated request, but not an unsolicited one. For 
more information please visit http://gump.apache.org/nagged.html, 
and/or contact the folk at general@gump.apache.org.

Project portals-bridges-script-test has an issue affecting its community integration.
This issue affects 1 projects,
 and has been outstanding for 48 runs.
The current state of this project is 'Failed', with reason 'Build Failed'.
For reference only, the following projects are affected by this:
    - portals-bridges-script-test :  Support for JSR168 compliant Portlet development


Full details are available at:
    http://vmgump.apache.org/gump/public/portals-bridges/portals-bridges-script-test/index.html

That said, some information snippets are provided here.

The following annotations (debug/informational/warning/error messages) were provided:
 -WARNING- Overriding Maven2 settings: [/srv/gump/public/workspace/portals-bridges/bridges-script/trunk/portlet/gump_mvn_settings.xml]
 -DEBUG- (Gump generated) Maven2 Settings in: /srv/gump/public/workspace/portals-bridges/bridges-script/trunk/portlet/gump_mvn_settings.xml
 -INFO- Failed with reason build failed
 -DEBUG- Maven POM in: /srv/gump/public/workspace/portals-bridges/bridges-script/trunk/portlet/pom.xml



The following work was performed:
http://vmgump.apache.org/gump/public/portals-bridges/portals-bridges-script-test/gump_work/build_portals-bridges_portals-bridges-script-test.html
Work Name: build_portals-bridges_portals-bridges-script-test (Type: Build)
Work ended in a state of : Failed
Elapsed: 20 secs
Command Line: mvn --batch-mode --settings /srv/gump/public/workspace/portals-bridges/bridges-script/trunk/portlet/gump_mvn_settings.xml package 
[Working Directory: /srv/gump/public/workspace/portals-bridges/bridges-script/trunk/portlet]
---------------------------------------------
[INFO] Surefire report directory: /srv/gump/public/workspace/portals-bridges/bridges-script/trunk/portlet/target/surefire-reports

-------------------------------------------------------
 T E S T S
-------------------------------------------------------
Running org.apache.portals.bridges.script.TestHelloJythonScriptPortlet
Tests run: 5, Failures: 0, Errors: 5, Skipped: 0, Time elapsed: 4.378 sec <<< FAILURE!
Running org.apache.portals.bridges.script.TestHelloJRubyScriptPortlet
Tests run: 5, Failures: 0, Errors: 0, Skipped: 0, Time elapsed: 3.193 sec
Running org.apache.portals.bridges.script.TestHelloRhinoScriptPortlet
[WARNING] Rhino script engine embedded in the default Java 1.6+ has not fully tested yet.
[WARNING] Rhino script engine embedded in the default Java 1.6+ has not fully tested yet.
[WARNING] Rhino script engine embedded in the default Java 1.6+ has not fully tested yet.
[WARNING] Rhino script engine embedded in the default Java 1.6+ has not fully tested yet.
[WARNING] Rhino script engine embedded in the default Java 1.6+ has not fully tested yet.
[WARNING] Rhino script engine embedded in the default Java 1.6+ has not fully tested yet.
[WARNING] Rhino script engine embedded in the default Java 1.6+ has not fully tested yet.
[WARNING] Rhino script engine embedded in the default Java 1.6+ has not fully tested yet.
[WARNING] Rhino script engine embedded in the default Java 1.6+ has not fully tested yet.
[WARNING] Rhino script engine embedded in the default Java 1.6+ has not fully tested yet.
Tests run: 5, Failures: 0, Errors: 0, Skipped: 0, Time elapsed: 0.015 sec
Running org.apache.portals.bridges.script.TestHelloGroovyScriptPortlet
Tests run: 5, Failures: 0, Errors: 0, Skipped: 0, Time elapsed: 3.43 sec
Running org.apache.portals.bridges.script.TestHelloBeanShellScriptPortlet
Tests run: 5, Failures: 0, Errors: 0, Skipped: 0, Time elapsed: 2.294 sec

Results :

Tests in error: 
  testInit(org.apache.portals.bridges.script.TestHelloJythonScriptPortlet)
  testRender(org.apache.portals.bridges.script.TestHelloJythonScriptPortlet)
  testProcessAction(org.apache.portals.bridges.script.TestHelloJythonScriptPortlet)
  testProcessEvent(org.apache.portals.bridges.script.TestHelloJythonScriptPortlet)
  testServeResource(org.apache.portals.bridges.script.TestHelloJythonScriptPortlet)

Tests run: 25, Failures: 0, Errors: 5, Skipped: 0

[INFO] ------------------------------------------------------------------------
[ERROR] BUILD FAILURE
[INFO] ------------------------------------------------------------------------
[INFO] There are test failures.

Please refer to /srv/gump/public/workspace/portals-bridges/bridges-script/trunk/portlet/target/surefire-reports for the individual test results.
[INFO] ------------------------------------------------------------------------
[INFO] For more information, run Maven with the -e switch
[INFO] ------------------------------------------------------------------------
[INFO] Total time: 19 seconds
[INFO] Finished at: Thu Aug 05 05:01:15 PDT 2010
[INFO] Final Memory: 15M/37M
[INFO] ------------------------------------------------------------------------
---------------------------------------------

To subscribe to this information via syndicated feeds:
- RSS: http://vmgump.apache.org/gump/public/portals-bridges/portals-bridges-script-test/rss.xml
- Atom: http://vmgump.apache.org/gump/public/portals-bridges/portals-bridges-script-test/atom.xml

============================== Gump Tracking Only ===
Produced by Gump version 2.3.
Gump Run 12000005082010, vmgump:vmgump-public:12000005082010
Gump E-mail Identifier (unique within run) #35.

*********************************************************** G U M P
[GUMP@vmgump]: Project apache-mime4j-reactor (in module james-mime4j) failed
To whom it may engage...
        
This is an automated request, but not an unsolicited one. For 
more information please visit http://gump.apache.org/nagged.html, 
and/or contact the folk at general@gump.apache.org.

Project apache-mime4j-reactor has an issue affecting its community integration.
This issue affects 1 projects,
 and has been outstanding for 47 runs.
The current state of this project is 'Failed', with reason 'Build Failed'.
For reference only, the following projects are affected by this:
    - apache-mime4j-reactor :  Java stream based MIME message parser


Full details are available at:
    http://vmgump.apache.org/gump/public/james-mime4j/apache-mime4j-reactor/index.html

That said, some information snippets are provided here.

The following annotations (debug/informational/warning/error messages) were provided:
 -WARNING- Overriding Maven2 settings: [/srv/gump/public/workspace/james-mime4j/gump_mvn_settings.xml]
 -DEBUG- (Gump generated) Maven2 Settings in: /srv/gump/public/workspace/james-mime4j/gump_mvn_settings.xml
 -INFO- Failed with reason build failed
 -DEBUG- Maven POM in: /srv/gump/public/workspace/james-mime4j/pom.xml



The following work was performed:
http://vmgump.apache.org/gump/public/james-mime4j/apache-mime4j-reactor/gump_work/build_james-mime4j_apache-mime4j-reactor.html
Work Name: build_james-mime4j_apache-mime4j-reactor (Type: Build)
Work ended in a state of : Failed
Elapsed: 48 secs
Command Line: mvn --batch-mode --settings /srv/gump/public/workspace/james-mime4j/gump_mvn_settings.xml package 
[Working Directory: /srv/gump/public/workspace/james-mime4j]
---------------------------------------------
Running org.apache.james.mime4j.stream.MimeTokenStreamTest
Tests run: 1, Failures: 0, Errors: 0, Skipped: 0, Time elapsed: 0.003 sec
Running org.apache.james.mime4j.TestUtil
Tests run: 0, Failures: 0, Errors: 0, Skipped: 0, Time elapsed: 0.002 sec
Running org.apache.james.mime4j.io.PositionInputStreamTest
Tests run: 1, Failures: 0, Errors: 0, Skipped: 0, Time elapsed: 0.003 sec
Running org.apache.james.mime4j.stream.MimeTokenNoRecurseTest
Tests run: 4, Failures: 0, Errors: 0, Skipped: 0, Time elapsed: 0.011 sec
Running org.apache.james.mime4j.parser.MimeStreamParserTest
Tests run: 11, Failures: 0, Errors: 0, Skipped: 0, Time elapsed: 0.042 sec
Running org.apache.james.mime4j.codec.DecoderUtilTest
Tests run: 13, Failures: 0, Errors: 0, Skipped: 0, Time elapsed: 0.08 sec
Running org.apache.james.mime4j.MimeExceptionTest
Tests run: 3, Failures: 0, Errors: 0, Skipped: 0, Time elapsed: 0.002 sec
Running org.apache.james.mime4j.codec.QuotedPrintableEncodeTest
Tests run: 5, Failures: 0, Errors: 0, Skipped: 0, Time elapsed: 0.009 sec
Running org.apache.james.mime4j.MimeIOExceptionTest
Tests run: 1, Failures: 0, Errors: 0, Skipped: 0, Time elapsed: 0.003 sec
Running org.apache.james.mime4j.codec.QuotedPrintableInputStreamTest
Tests run: 19, Failures: 0, Errors: 0, Skipped: 0, Time elapsed: 0.013 sec
Running org.apache.james.mime4j.stream.MimeTokenStreamBodyDescriptorTest
Tests run: 2, Failures: 0, Errors: 0, Skipped: 0, Time elapsed: 0.004 sec
Running org.apache.james.mime4j.codec.CodecUtilTest
Tests run: 5, Failures: 0, Errors: 0, Skipped: 0, Time elapsed: 0.015 sec
Running org.apache.james.mime4j.stream.MultipartStreamTest
Tests run: 2, Failures: 0, Errors: 0, Skipped: 0, Time elapsed: 0.006 sec

Results :

Tests run: 225, Failures: 0, Errors: 0, Skipped: 0

[INFO] [jar:jar {execution: default-jar}]
[INFO] Building jar: /srv/gump/public/workspace/james-mime4j/core/target/apache-mime4j-core-0.7-SNAPSHOT.jar
[INFO] [jar:test-jar {execution: default}]
[INFO] Building jar: /srv/gump/public/workspace/james-mime4j/core/target/apache-mime4j-core-0.7-SNAPSHOT-tests.jar
[INFO] [javadoc:jar {execution: javadoc-jar}]
[INFO] The goal 'org.apache.maven.plugins:maven-javadoc-plugin:2.6.1:javadoc' has not be previously called for the project: 'org.apache.james:apache-mime4j-benchmark:jar:0.7-SNAPSHOT'. Trying to invoke it...
[ERROR] MavenInvocationException: Error when invoking Maven, consult the invoker log file: /srv/gump/public/workspace/james-mime4j/core/target/invoker/maven-javadoc-plugin653862078.txt
[INFO] ------------------------------------------------------------------------
[ERROR] BUILD ERROR
[INFO] ------------------------------------------------------------------------
[INFO] MavenReportException: Error while creating archive:Error when invoking Maven, consult the invoker log file: /srv/gump/public/workspace/james-mime4j/core/target/invoker/maven-javadoc-plugin653862078.txt

[INFO] ------------------------------------------------------------------------
[INFO] For more information, run Maven with the -e switch
[INFO] ------------------------------------------------------------------------
[INFO] Total time: 46 seconds
[INFO] Finished at: Thu Aug 05 05:05:22 PDT 2010
[INFO] Final Memory: 35M/84M
[INFO] ------------------------------------------------------------------------
---------------------------------------------

To subscribe to this information via syndicated feeds:
- RSS: http://vmgump.apache.org/gump/public/james-mime4j/apache-mime4j-reactor/rss.xml
- Atom: http://vmgump.apache.org/gump/public/james-mime4j/apache-mime4j-reactor/atom.xml

============================== Gump Tracking Only ===
Produced by Gump version 2.3.
Gump Run 12000005082010, vmgump:vmgump-public:12000005082010
Gump E-mail Identifier (unique within run) #36.

*********************************************************** G U M P
[GUMP@vmgump]: Project doxia-site-renderer (in module doxia) failed
To whom it may engage...
        
This is an automated request, but not an unsolicited one. For 
more information please visit http://gump.apache.org/nagged.html, 
and/or contact the folk at general@gump.apache.org.

Project doxia-site-renderer has an issue affecting its community integration.
This issue affects 1 projects.
The current state of this project is 'Failed', with reason 'Build Failed'.
For reference only, the following projects are affected by this:
    - doxia-site-renderer :  A content generation framework which aims to provide its use...


Full details are available at:
    http://vmgump.apache.org/gump/public/doxia/doxia-site-renderer/index.html

That said, some information snippets are provided here.

The following annotations (debug/informational/warning/error messages) were provided:
 -DEBUG- Sole jar output [doxia-site-renderer-*[0-9T].jar] identifier set to project name
 -DEBUG- (Gump generated) Maven2 Settings in: /srv/gump/public/workspace/doxia/doxia-sitetools/doxia-site-renderer/gump_mvn_settings.xml
 -INFO- Failed with reason build failed
 -DEBUG- Maven POM in: /srv/gump/public/workspace/doxia/doxia-sitetools/doxia-site-renderer/pom.xml
 -INFO- Failed to extract fallback artifacts from Gump Repository



The following work was performed:
http://vmgump.apache.org/gump/public/doxia/doxia-site-renderer/gump_work/build_doxia_doxia-site-renderer.html
Work Name: build_doxia_doxia-site-renderer (Type: Build)
Work ended in a state of : Failed
Elapsed: 43 secs
Command Line: mvn --batch-mode --settings /srv/gump/public/workspace/doxia/doxia-sitetools/doxia-site-renderer/gump_mvn_settings.xml install 
[Working Directory: /srv/gump/public/workspace/doxia/doxia-sitetools/doxia-site-renderer]
---------------------------------------------
	at org.apache.maven.doxia.siterenderer.DefaultSiteRendererTest.testRender(DefaultSiteRendererTest.java:129)
	at sun.reflect.NativeMethodAccessorImpl.invoke0(Native Method)
	at sun.reflect.NativeMethodAccessorImpl.invoke(NativeMethodAccessorImpl.java:39)
	at sun.reflect.DelegatingMethodAccessorImpl.invoke(DelegatingMethodAccessorImpl.java:25)
	at java.lang.reflect.Method.invoke(Method.java:597)
	at junit.framework.TestCase.runTest(TestCase.java:168)
	at junit.framework.TestCase.runBare(TestCase.java:134)
	at junit.framework.TestResult$1.protect(TestResult.java:110)
	at junit.framework.TestResult.runProtected(TestResult.java:128)
	at junit.framework.TestResult.run(TestResult.java:113)
	at junit.framework.TestCase.run(TestCase.java:124)
	at junit.framework.TestSuite.runTest(TestSuite.java:243)
	at junit.framework.TestSuite.run(TestSuite.java:238)
	at sun.reflect.NativeMethodAccessorImpl.invoke0(Native Method)
	at sun.reflect.NativeMethodAccessorImpl.invoke(NativeMethodAccessorImpl.java:39)
	at sun.reflect.DelegatingMethodAccessorImpl.invoke(DelegatingMethodAccessorImpl.java:25)
	at java.lang.reflect.Method.invoke(Method.java:597)
	at org.apache.maven.surefire.junit.JUnitTestSet.execute(JUnitTestSet.java:213)
	at org.apache.maven.surefire.suite.AbstractDirectoryTestSuite.executeTestSet(AbstractDirectoryTestSuite.java:140)
	at org.apache.maven.surefire.suite.AbstractDirectoryTestSuite.execute(AbstractDirectoryTestSuite.java:127)
	at org.apache.maven.surefire.Surefire.run(Surefire.java:177)
	at sun.reflect.NativeMethodAccessorImpl.invoke0(Native Method)
	at sun.reflect.NativeMethodAccessorImpl.invoke(NativeMethodAccessorImpl.java:39)
	at sun.reflect.DelegatingMethodAccessorImpl.invoke(DelegatingMethodAccessorImpl.java:25)
	at java.lang.reflect.Method.invoke(Method.java:597)
	at org.apache.maven.surefire.booter.SurefireBooter.runSuitesInProcess(SurefireBooter.java:345)
	at org.apache.maven.surefire.booter.SurefireBooter.main(SurefireBooter.java:1009)

Tests run: 1, Failures: 0, Errors: 1, Skipped: 0, Time elapsed: 1.109 sec <<< FAILURE!

Results :

Tests in error: 
  testRender(org.apache.maven.doxia.siterenderer.DefaultSiteRendererTest)

Tests run: 1, Failures: 0, Errors: 1, Skipped: 0

[INFO] ------------------------------------------------------------------------
[ERROR] BUILD FAILURE
[INFO] ------------------------------------------------------------------------
[INFO] There are test failures.

Please refer to /srv/gump/public/workspace/doxia/doxia-sitetools/doxia-site-renderer/target/surefire-reports for the individual test results.
[INFO] ------------------------------------------------------------------------
[INFO] For more information, run Maven with the -e switch
[INFO] ------------------------------------------------------------------------
[INFO] Total time: 42 seconds
[INFO] Finished at: Thu Aug 05 05:10:07 PDT 2010
[INFO] Final Memory: 24M/64M
[INFO] ------------------------------------------------------------------------
---------------------------------------------

To subscribe to this information via syndicated feeds:
- RSS: http://vmgump.apache.org/gump/public/doxia/doxia-site-renderer/rss.xml
- Atom: http://vmgump.apache.org/gump/public/doxia/doxia-site-renderer/atom.xml

============================== Gump Tracking Only ===
Produced by Gump version 2.3.
Gump Run 12000005082010, vmgump:vmgump-public:12000005082010
Gump E-mail Identifier (unique within run) #37.

*********************************************************** G U M P
[GUMP@vmgump]: Project axiom-api (in module ws-axis2-commons) failed
To whom it may engage...
        
This is an automated request, but not an unsolicited one. For 
more information please visit http://gump.apache.org/nagged.html, 
and/or contact the folk at general@gump.apache.org.

Project axiom-api has an issue affecting its community integration.
This issue affects 4 projects.
The current state of this project is 'Failed', with reason 'Build Failed'.
For reference only, the following projects are affected by this:
    - axiom-api :  Common stuff for the WS projects.
    - axiom-dom :  Common stuff for the WS projects.
    - axiom-impl :  Common stuff for the WS projects.
    - axiom-impl-test :  Common stuff for the WS projects.


Full details are available at:
    http://vmgump.apache.org/gump/public/ws-axis2-commons/axiom-api/index.html

That said, some information snippets are provided here.

The following annotations (debug/informational/warning/error messages) were provided:
 -DEBUG- Sole jar output [axiom-api-*[0-9T].jar] identifier set to project name
 -DEBUG- Sole testsjar output [axiom-api-*[0-9T]-tests.jar] identifier set to project name
 -DEBUG- Sole pom output [pom.xml] identifier set to project name
 -INFO- Optional dependency doxia-site-renderer failed with reason build failed
 -DEBUG- (Gump generated) Maven2 Settings in: /srv/gump/public/workspace/ws-axis2-commons/axiom/modules/axiom-api/gump_mvn_settings.xml
 -INFO- Failed with reason build failed
 -DEBUG- Maven POM in: /srv/gump/public/workspace/ws-axis2-commons/axiom/modules/axiom-api/pom.xml
 -INFO- Failed to extract fallback artifacts from Gump Repository



The following work was performed:
http://vmgump.apache.org/gump/public/ws-axis2-commons/axiom-api/gump_work/build_ws-axis2-commons_axiom-api.html
Work Name: build_ws-axis2-commons_axiom-api (Type: Build)
Work ended in a state of : Failed
Elapsed: 2 mins 39 secs
Command Line: mvn --batch-mode --settings /srv/gump/public/workspace/ws-axis2-commons/axiom/modules/axiom-api/gump_mvn_settings.xml package 
[Working Directory: /srv/gump/public/workspace/ws-axis2-commons/axiom/modules/axiom-api]
---------------------------------------------
Downloading: http://localhost:8192/maven2/org/codehaus/groovy/groovy-all/1.6.5/groovy-all-1.6.5.pom

Downloading: http://localhost:8192/maven2/org/apache/ant/ant/1.7.1/ant-1.7.1.pom

Downloading: http://localhost:8192/maven2/org/apache/ant/ant-parent/1.7.1/ant-parent-1.7.1.pom

Downloading: http://localhost:8192/maven2/org/apache/ant/ant-launcher/1.7.1/ant-launcher-1.7.1.pom

Downloading: http://localhost:8192/maven2/jline/jline/0.9.94/jline-0.9.94.pom

Downloading: http://localhost:8192/maven2/jline/jline/0.9.94/jline-0.9.94.jar
Downloading: http://localhost:8192/maven2/org/apache/ant/ant/1.7.1/ant-1.7.1.jar
Downloading: http://localhost:8192/maven2/org/codehaus/gmaven/runtime/gmaven-runtime-1.6/1.2/gmaven-runtime-1.6-1.2.jar
Downloading: http://localhost:8192/maven2/org/codehaus/groovy/groovy-all/1.6.5/groovy-all-1.6.5.jar
86K downloaded  (jline-0.9.94.jar)
1881K downloaded  (ant-1.7.1.jar)
Downloading: http://localhost:8192/maven2/org/apache/ant/ant-launcher/1.7.1/ant-launcher-1.7.1.jar
12K downloaded  (ant-launcher-1.7.1.jar)


[INFO] [resources:testResources {execution: default-testResources}]
[INFO] Using 'UTF-8' encoding to copy filtered resources.
[INFO] Copying 47 resources
[INFO] Copying 1 resource
[INFO] Copying 3 resources
[INFO] [compiler:testCompile {execution: default-testCompile}]
[INFO] Compiling 66 source files to /srv/gump/public/workspace/ws-axis2-commons/axiom/modules/axiom-api/target/test-classes
[INFO] ------------------------------------------------------------------------
[ERROR] BUILD FAILURE
[INFO] ------------------------------------------------------------------------
[INFO] Compilation failure

/srv/gump/public/workspace/ws-axis2-commons/axiom/modules/axiom-api/src/test/java/org/apache/axiom/om/impl/XMLStreamWriterFilterTestCase.java:[43,23] package com.ibm.jvm.util does not exist

/srv/gump/public/workspace/ws-axis2-commons/axiom/modules/axiom-api/src/test/java/org/apache/axiom/om/impl/XMLStreamWriterFilterTestCase.java:[100,2] cannot find symbol
symbol  : class ByteArrayOutputStream
location: class org.apache.axiom.om.impl.XMLStreamWriterFilterTestCase

/srv/gump/public/workspace/ws-axis2-commons/axiom/modules/axiom-api/src/test/java/org/apache/axiom/om/impl/XMLStreamWriterFilterTestCase.java:[100,35] cannot find symbol
symbol  : class ByteArrayOutputStream
location: class org.apache.axiom.om.impl.XMLStreamWriterFilterTestCase


[INFO] ------------------------------------------------------------------------
[INFO] For more information, run Maven with the -e switch
[INFO] ------------------------------------------------------------------------
[INFO] Total time: 2 minutes 38 seconds
[INFO] Finished at: Thu Aug 05 05:13:07 PDT 2010
[INFO] Final Memory: 38M/90M
[INFO] ------------------------------------------------------------------------
---------------------------------------------

To subscribe to this information via syndicated feeds:
- RSS: http://vmgump.apache.org/gump/public/ws-axis2-commons/axiom-api/rss.xml
- Atom: http://vmgump.apache.org/gump/public/ws-axis2-commons/axiom-api/atom.xml

============================== Gump Tracking Only ===
Produced by Gump version 2.3.
Gump Run 12000005082010, vmgump:vmgump-public:12000005082010
Gump E-mail Identifier (unique within run) #38.

*********************************************************** G U M P
[GUMP@vmgump]: Project commons-jci (in module apache-commons) failed
To whom it may engage...
        
This is an automated request, but not an unsolicited one. For 
more information please visit http://gump.apache.org/nagged.html, 
and/or contact the folk at general@gump.apache.org.

Project commons-jci has an issue affecting its community integration.
This issue affects 3 projects,
 and has been outstanding for 1649 runs.
The current state of this project is 'Failed', with reason 'Build Failed'.
For reference only, the following projects are affected by this:
    - commons-javaflow :  Commons Javaflow
    - commons-jci :  Commons JCI
    - commons-jci-test :  Apache Commons


Full details are available at:
    http://vmgump.apache.org/gump/public/apache-commons/commons-jci/index.html

That said, some information snippets are provided here.

The following annotations (debug/informational/warning/error messages) were provided:
 -DEBUG- Sole jar output [commons-jci-05082010.jar] identifier set to project name
 -INFO- Optional dependency doxia-site-renderer failed with reason build failed
 -DEBUG- (Gump generated) Maven2 Settings in: /srv/gump/public/workspace/apache-commons/jci/gump_mvn_settings.xml
 -INFO- Failed with reason build failed
 -DEBUG- Maven POM in: /srv/gump/public/workspace/apache-commons/jci/pom.xml
 -INFO- Failed to extract fallback artifacts from Gump Repository



The following work was performed:
http://vmgump.apache.org/gump/public/apache-commons/commons-jci/gump_work/build_apache-commons_commons-jci.html
Work Name: build_apache-commons_commons-jci (Type: Build)
Work ended in a state of : Failed
Elapsed: 58 secs
Command Line: mvn --batch-mode -Dmaven.test.skip.exec=true --settings /srv/gump/public/workspace/apache-commons/jci/gump_mvn_settings.xml package 
[Working Directory: /srv/gump/public/workspace/apache-commons/jci]
---------------------------------------------
Downloading: http://localhost:8192/maven2/asm/asm-analysis/2.2.1/asm-analysis-2.2.1.jar
17K downloaded  (asm-analysis-2.2.1.jar)
Downloading: http://localhost:8192/maven2/asm/asm-tree/2.2.1/asm-tree-2.2.1.jar
21K downloaded  (asm-tree-2.2.1.jar)
Downloading: http://localhost:8192/maven2/asm/asm-attrs/2.2.1/asm-attrs-2.2.1.jar


[INFO] [antrun:run {execution: javadoc.resources}]
[INFO] Executing tasks
[INFO] Executed tasks
[INFO] [remote-resources:process {execution: default}]
[INFO] [resources:resources {execution: default-resources}]
[INFO] Using 'iso-8859-1' encoding to copy filtered resources.
[INFO] Copying 0 resource to META-INF
[INFO] [compiler:compile {execution: default-compile}]
[INFO] Compiling 6 source files to /srv/gump/public/workspace/apache-commons/jci/compilers/javac/target/classes
[INFO] -------------------------------------------------------------
[ERROR] COMPILATION ERROR : 
[INFO] -------------------------------------------------------------
[ERROR] /srv/gump/public/workspace/apache-commons/jci/compilers/javac/src/main/java/org/apache/commons/jci/compilers/JavacClassLoader.java:[108,46] cannot find symbol
symbol  : constructor ClassWriter(boolean,boolean)
location: class org.objectweb.asm.ClassWriter

[ERROR] /srv/gump/public/workspace/apache-commons/jci/compilers/javac/src/main/java/org/apache/commons/jci/compilers/JavacClassLoader.java:[109,44] cannot find symbol
symbol  : method accept(org.vafer.dependency.asm.RenamingVisitor,boolean)
location: class org.objectweb.asm.ClassReader

[INFO] 2 errors 
[INFO] -------------------------------------------------------------
[INFO] ------------------------------------------------------------------------
[ERROR] BUILD FAILURE
[INFO] ------------------------------------------------------------------------
[INFO] Compilation failure

/srv/gump/public/workspace/apache-commons/jci/compilers/javac/src/main/java/org/apache/commons/jci/compilers/JavacClassLoader.java:[108,46] cannot find symbol
symbol  : constructor ClassWriter(boolean,boolean)
location: class org.objectweb.asm.ClassWriter

/srv/gump/public/workspace/apache-commons/jci/compilers/javac/src/main/java/org/apache/commons/jci/compilers/JavacClassLoader.java:[109,44] cannot find symbol
symbol  : method accept(org.vafer.dependency.asm.RenamingVisitor,boolean)
location: class org.objectweb.asm.ClassReader


[INFO] ------------------------------------------------------------------------
[INFO] For more information, run Maven with the -e switch
[INFO] ------------------------------------------------------------------------
[INFO] Total time: 56 seconds
[INFO] Finished at: Thu Aug 05 05:20:03 PDT 2010
[INFO] Final Memory: 58M/139M
[INFO] ------------------------------------------------------------------------
---------------------------------------------

To subscribe to this information via syndicated feeds:
- RSS: http://vmgump.apache.org/gump/public/apache-commons/commons-jci/rss.xml
- Atom: http://vmgump.apache.org/gump/public/apache-commons/commons-jci/atom.xml

============================== Gump Tracking Only ===
Produced by Gump version 2.3.
Gump Run 12000005082010, vmgump:vmgump-public:12000005082010
Gump E-mail Identifier (unique within run) #39.

*********************************************************** G U M P
[GUMP@vmgump]: Project ws-commons-xmlschema (in module ws-axis2-commons) failed
To whom it may engage...
        
This is an automated request, but not an unsolicited one. For 
more information please visit http://gump.apache.org/nagged.html, 
and/or contact the folk at general@gump.apache.org.

Project ws-commons-xmlschema has an issue affecting its community integration.
This issue affects 1 projects,
 and has been outstanding for 9 runs.
The current state of this project is 'Failed', with reason 'Build Failed'.
For reference only, the following projects are affected by this:
    - ws-commons-xmlschema :  Common stuff for the WS projects.


Full details are available at:
    http://vmgump.apache.org/gump/public/ws-axis2-commons/ws-commons-xmlschema/index.html

That said, some information snippets are provided here.

The following annotations (debug/informational/warning/error messages) were provided:
 -INFO- Optional dependency doxia-site-renderer failed with reason build failed
 -DEBUG- (Gump generated) Maven2 Settings in: /srv/gump/public/workspace/ws-axis2-commons/XmlSchema/gump_mvn_settings.xml
 -INFO- Failed with reason build failed
 -DEBUG- Maven POM in: /srv/gump/public/workspace/ws-axis2-commons/XmlSchema/pom.xml
 -INFO- Failed to extract fallback artifacts from Gump Repository



The following work was performed:
http://vmgump.apache.org/gump/public/ws-axis2-commons/ws-commons-xmlschema/gump_work/build_ws-axis2-commons_ws-commons-xmlschema.html
Work Name: build_ws-axis2-commons_ws-commons-xmlschema (Type: Build)
Work ended in a state of : Failed
Elapsed: 20 secs
Command Line: mvn --batch-mode --settings /srv/gump/public/workspace/ws-axis2-commons/XmlSchema/gump_mvn_settings.xml install 
[Working Directory: /srv/gump/public/workspace/ws-axis2-commons/XmlSchema]
---------------------------------------------
urls[9] = file:/srv/gump/public/workspace/mvnlocalrepo/shared/org/apache/maven/shared/maven-doxia-tools/1.0/maven-doxia-tools-1.0.jar
urls[10] = file:/srv/gump/public/workspace/mvnlocalrepo/shared/commons-io/commons-io/1.4/commons-io-1.4.jar
urls[11] = file:/srv/gump/public/workspace/mvnlocalrepo/shared/org/apache/maven/doxia/doxia-decoration-model/1.0-alpha-11/doxia-decoration-model-1.0-alpha-11.jar
urls[12] = file:/srv/gump/public/workspace/mvnlocalrepo/shared/org/codehaus/plexus/plexus-i18n/1.0-beta-7/plexus-i18n-1.0-beta-7.jar
urls[13] = file:/srv/gump/public/workspace/mvnlocalrepo/shared/org/codehaus/plexus/plexus-resources/1.0-alpha-4/plexus-resources-1.0-alpha-4.jar
urls[14] = file:/srv/gump/public/workspace/mvnlocalrepo/shared/checkstyle/checkstyle/4.4/checkstyle-4.4.jar
urls[15] = file:/srv/gump/public/workspace/mvnlocalrepo/shared/antlr/antlr/2.7.6/antlr-2.7.6.jar
urls[16] = file:/srv/gump/public/workspace/mvnlocalrepo/shared/commons-beanutils/commons-beanutils-core/1.7.0/commons-beanutils-core-1.7.0.jar
urls[17] = file:/srv/gump/public/workspace/mvnlocalrepo/shared/commons-logging/commons-logging/1.0.3/commons-logging-1.0.3.jar
urls[18] = file:/srv/gump/public/workspace/mvnlocalrepo/shared/commons-collections/commons-collections/2.1/commons-collections-2.1.jar
urls[19] = file:/srv/gump/public/workspace/mvnlocalrepo/shared/commons-cli/commons-cli/1.0/commons-cli-1.0.jar
urls[20] = file:/srv/gump/public/workspace/mvnlocalrepo/shared/commons-lang/commons-lang/1.0/commons-lang-1.0.jar
urls[21] = file:/srv/gump/public/workspace/mvnlocalrepo/shared/checkstyle/checkstyle-optional/4.4/checkstyle-optional-4.4.jar
[FATAL ERROR] Container realm = plexus.core
urls[0] = file:/opt/maven2/lib/maven-2.2.1-uber.jar
[INFO] ------------------------------------------------------------------------
[ERROR] FATAL ERROR
[INFO] ------------------------------------------------------------------------
[INFO] com.puppycrawl.tools.checkstyle.PackageNamesLoader.loadModuleFactory(Ljava/lang/ClassLoader;)Lcom/puppycrawl/tools/checkstyle/ModuleFactory;
[INFO] ------------------------------------------------------------------------
[INFO] Trace
java.lang.NoSuchMethodError: com.puppycrawl.tools.checkstyle.PackageNamesLoader.loadModuleFactory(Ljava/lang/ClassLoader;)Lcom/puppycrawl/tools/checkstyle/ModuleFactory;
	at org.apache.maven.plugin.checkstyle.CheckstyleReport.getModuleFactory(CheckstyleReport.java:1157)
	at org.apache.maven.plugin.checkstyle.CheckstyleReport.executeReport(CheckstyleReport.java:605)
	at org.apache.maven.reporting.AbstractMavenReport.generate(AbstractMavenReport.java:98)
	at org.apache.maven.reporting.AbstractMavenReport.execute(AbstractMavenReport.java:73)
	at org.apache.maven.plugin.DefaultPluginManager.executeMojo(DefaultPluginManager.java:490)
	at org.apache.maven.lifecycle.DefaultLifecycleExecutor.executeGoals(DefaultLifecycleExecutor.java:694)
	at org.apache.maven.lifecycle.DefaultLifecycleExecutor.executeGoalWithLifecycle(DefaultLifecycleExecutor.java:556)
	at org.apache.maven.lifecycle.DefaultLifecycleExecutor.executeGoal(DefaultLifecycleExecutor.java:535)
	at org.apache.maven.lifecycle.DefaultLifecycleExecutor.executeGoalAndHandleFailures(DefaultLifecycleExecutor.java:387)
	at org.apache.maven.lifecycle.DefaultLifecycleExecutor.executeTaskSegments(DefaultLifecycleExecutor.java:348)
	at org.apache.maven.lifecycle.DefaultLifecycleExecutor.execute(DefaultLifecycleExecutor.java:180)
	at org.apache.maven.DefaultMaven.doExecute(DefaultMaven.java:328)
	at org.apache.maven.DefaultMaven.execute(DefaultMaven.java:138)
	at org.apache.maven.cli.MavenCli.main(MavenCli.java:362)
	at org.apache.maven.cli.compat.CompatibleMain.main(CompatibleMain.java:60)
	at sun.reflect.NativeMethodAccessorImpl.invoke0(Native Method)
	at sun.reflect.NativeMethodAccessorImpl.invoke(NativeMethodAccessorImpl.java:39)
	at sun.reflect.DelegatingMethodAccessorImpl.invoke(DelegatingMethodAccessorImpl.java:25)
	at java.lang.reflect.Method.invoke(Method.java:597)
	at org.codehaus.classworlds.Launcher.launchEnhanced(Launcher.java:315)
	at org.codehaus.classworlds.Launcher.launch(Launcher.java:255)
	at org.codehaus.classworlds.Launcher.mainWithExitCode(Launcher.java:430)
	at org.codehaus.classworlds.Launcher.main(Launcher.java:375)
[INFO] ------------------------------------------------------------------------
[INFO] Total time: 18 seconds
[INFO] Finished at: Thu Aug 05 05:26:08 PDT 2010
[INFO] Final Memory: 14M/33M
[INFO] ------------------------------------------------------------------------
---------------------------------------------

To subscribe to this information via syndicated feeds:
- RSS: http://vmgump.apache.org/gump/public/ws-axis2-commons/ws-commons-xmlschema/rss.xml
- Atom: http://vmgump.apache.org/gump/public/ws-axis2-commons/ws-commons-xmlschema/atom.xml

============================== Gump Tracking Only ===
Produced by Gump version 2.3.
Gump Run 12000005082010, vmgump:vmgump-public:12000005082010
Gump E-mail Identifier (unique within run) #41.

*********************************************************** G U M P
[GUMP@vmgump]: Project ws-commons-axiom (in module ws-axis2-commons) failed
To whom it may engage...
        
This is an automated request, but not an unsolicited one. For 
more information please visit http://gump.apache.org/nagged.html, 
and/or contact the folk at general@gump.apache.org.

Project ws-commons-axiom has an issue affecting its community integration.
This issue affects 1 projects,
 and has been outstanding for 41 runs.
The current state of this project is 'Failed', with reason 'Build Failed'.
For reference only, the following projects are affected by this:
    - ws-commons-axiom :  Common stuff for the WS projects.


Full details are available at:
    http://vmgump.apache.org/gump/public/ws-axis2-commons/ws-commons-axiom/index.html

That said, some information snippets are provided here.

The following annotations (debug/informational/warning/error messages) were provided:
 -INFO- Optional dependency axiom-dom prerequisite failed with reason build failed
 -INFO- Optional dependency axiom-impl prerequisite failed with reason build failed
 -INFO- Optional dependency axiom-api failed with reason build failed
 -DEBUG- (Gump generated) Maven2 Settings in: /srv/gump/public/workspace/ws-axis2-commons/axiom/gump_mvn_settings.xml
 -INFO- Failed with reason build failed
 -DEBUG- Maven POM in: /srv/gump/public/workspace/ws-axis2-commons/axiom/pom.xml



The following work was performed:
http://vmgump.apache.org/gump/public/ws-axis2-commons/ws-commons-axiom/gump_work/build_ws-axis2-commons_ws-commons-axiom.html
Work Name: build_ws-axis2-commons_ws-commons-axiom (Type: Build)
Work ended in a state of : Failed
Elapsed: 1 min 12 secs
Command Line: mvn --batch-mode --settings /srv/gump/public/workspace/ws-axis2-commons/axiom/gump_mvn_settings.xml install 
[Working Directory: /srv/gump/public/workspace/ws-axis2-commons/axiom]
---------------------------------------------

Downloading: http://localhost:8192/maven2/org/apache/maven/reporting/maven-reporting-api/2.0/maven-reporting-api-2.0.pom

Downloading: http://localhost:8192/maven2/org/apache/maven/reporting/maven-reporting/2.0/maven-reporting-2.0.pom

Downloading: http://localhost:8192/maven2/org/apache/maven/maven-error-diagnostics/2.0/maven-error-diagnostics-2.0.pom

Downloading: http://localhost:8192/maven2/org/apache/maven/maven-plugin-registry/2.0/maven-plugin-registry-2.0.pom

Downloading: http://localhost:8192/maven2/org/apache/maven/maven-plugin-descriptor/2.0/maven-plugin-descriptor-2.0.pom

Downloading: http://localhost:8192/maven2/org/apache/maven/maven-monitor/2.0/maven-monitor-2.0.pom

Downloading: http://localhost:8192/maven2/org/apache/maven/wagon/wagon-ssh/1.0-alpha-5/wagon-ssh-1.0-alpha-5.pom

Downloading: http://localhost:8192/maven2/com/jcraft/jsch/0.1.23/jsch-0.1.23.pom

Downloading: http://localhost:8192/maven2/oro/oro/2.0.7/oro-2.0.7.jar
Downloading: http://localhost:8192/maven2/org/apache/maven/doxia/doxia-site-renderer/1.0-alpha-8/doxia-site-renderer-1.0-alpha-8.jar
Downloading: http://localhost:8192/maven2/org/apache/maven/reporting/maven-reporting-impl/2.0.4/maven-reporting-impl-2.0.4.jar
Downloading: http://localhost:8192/maven2/org/codehaus/plexus/plexus-utils/1.4/plexus-utils-1.4.jar
75K downloaded  (oro-2.0.7.jar)
Downloading: http://localhost:8192/maven2/commons-cli/commons-cli/1.1/commons-cli-1.1.jar
47K downloaded  (commons-cli-1.1.jar)
Downloading: http://localhost:8192/maven2/org/apache/maven/shared/maven-plugin-testing-harness/1.0-beta-1/maven-plugin-testing-harness-1.0-beta-1.jar
Downloading: http://localhost:8192/maven2/org/apache/rat/apache-rat-core/0.6/apache-rat-core-0.6.jar





Downloading: http://localhost:8192/maven2/org/codehaus/plexus/plexus-i18n/1.0-beta-6/plexus-i18n-1.0-beta-6.jar

Downloading: http://localhost:8192/maven2/org/apache/maven/doxia/doxia-core/1.0-alpha-8/doxia-core-1.0-alpha-8.jar
155K downloaded  (doxia-core-1.0-alpha-8.jar)
Downloading: http://localhost:8192/maven2/org/apache/maven/doxia/doxia-decoration-model/1.0-alpha-8/doxia-decoration-model-1.0-alpha-8.jar
51K downloaded  (doxia-decoration-model-1.0-alpha-8.jar)
[INFO] [apache-rat:check {execution: default}]
[INFO] Exclude: src/test/resources/**
[INFO] ------------------------------------------------------------------------
[ERROR] BUILD FAILURE
[INFO] ------------------------------------------------------------------------
[INFO] Too many unapproved licenses: 1
[INFO] ------------------------------------------------------------------------
[INFO] For more information, run Maven with the -e switch
[INFO] ------------------------------------------------------------------------
[INFO] Total time: 1 minute 11 seconds
[INFO] Finished at: Thu Aug 05 05:32:21 PDT 2010
[INFO] Final Memory: 24M/58M
[INFO] ------------------------------------------------------------------------
---------------------------------------------

To subscribe to this information via syndicated feeds:
- RSS: http://vmgump.apache.org/gump/public/ws-axis2-commons/ws-commons-axiom/rss.xml
- Atom: http://vmgump.apache.org/gump/public/ws-axis2-commons/ws-commons-axiom/atom.xml

============================== Gump Tracking Only ===
Produced by Gump version 2.3.
Gump Run 12000005082010, vmgump:vmgump-public:12000005082010
Gump E-mail Identifier (unique within run) #42.

*********************************************************** G U M P
[GUMP@vmgump]: Project castor-test (in module castor) failed
To whom it may engage...
        
This is an automated request, but not an unsolicited one. For 
more information please visit http://gump.apache.org/nagged.html, 
and/or contact the folk at general@gump.apache.org.

Project castor-test has an issue affecting its community integration.
This issue affects 1 projects,
 and has been outstanding for 109 runs.
The current state of this project is 'Failed', with reason 'Build Failed'.
For reference only, the following projects are affected by this:
    - castor-test :  Java to XML, SQL, LDAP bindings


Full details are available at:
    http://vmgump.apache.org/gump/public/castor/castor-test/index.html

That said, some information snippets are provided here.

The following annotations (debug/informational/warning/error messages) were provided:
 -WARNING- Overriding Maven2 settings: [/srv/gump/public/workspace/castor/gump_mvn_settings.xml]
 -DEBUG- (Gump generated) Maven2 Settings in: /srv/gump/public/workspace/castor/gump_mvn_settings.xml
 -INFO- Failed with reason build failed
 -DEBUG- Maven POM in: /srv/gump/public/workspace/castor/pom.xml



The following work was performed:
http://vmgump.apache.org/gump/public/castor/castor-test/gump_work/build_castor_castor-test.html
Work Name: build_castor_castor-test (Type: Build)
Work ended in a state of : Failed
Elapsed: 21 secs
Command Line: mvn --batch-mode --settings /srv/gump/public/workspace/castor/gump_mvn_settings.xml package 
[Working Directory: /srv/gump/public/workspace/castor]
---------------------------------------------
Tests run: 4, Failures: 0, Errors: 0, Skipped: 0, Time elapsed: 0.013 sec
Running org.castor.xml.JavaNamingTest
[main] - Package name: . is not valid
[main] - Package name: .org is not valid
[main] - Package name: org. is not valid
[main] - Package name: . is not valid
[main] - Package name: .org is not valid
[main] - Package name: org. is not valid
Tests run: 10, Failures: 0, Errors: 0, Skipped: 0, Time elapsed: 0.031 sec
Running org.castor.util.TestBase64Decoder
Tests run: 2, Failures: 0, Errors: 0, Skipped: 0, Time elapsed: 0.008 sec
Running org.exolab.castor.xml.PrimitiveObjectTest
Tests run: 22, Failures: 0, Errors: 0, Skipped: 0, Time elapsed: 0.026 sec
Running org.exolab.castor.xml.Sax2EventFromStaxProducerIntegrationTest
Tests run: 4, Failures: 1, Errors: 0, Skipped: 0, Time elapsed: 0.047 sec <<< FAILURE!
Running org.exolab.castor.xml.validators.IntegerValidatorTest
Tests run: 10, Failures: 0, Errors: 0, Skipped: 0, Time elapsed: 0.029 sec
Running org.castor.xml.XMLPropertiesTest
Tests run: 4, Failures: 0, Errors: 0, Skipped: 0, Time elapsed: 0.01 sec
Running org.castor.util.TestHex
Tests run: 1, Failures: 0, Errors: 0, Skipped: 0, Time elapsed: 0.005 sec
Running org.exolab.castor.xml.TestUnmarshaller
[main] - InternalContext must not be null
[main] - InternalContext must not be null
[main] - InternalContext must not be null
[main] - InternalContext must not be null
Tests run: 19, Failures: 0, Errors: 0, Skipped: 0, Time elapsed: 0.097 sec
Running org.exolab.castor.xml.XMLContextTest
Tests run: 2, Failures: 0, Errors: 0, Skipped: 0, Time elapsed: 0.219 sec

Results :

Failed tests: 
  testPrefixUnbound(org.exolab.castor.xml.Sax2EventFromStaxProducerIntegrationTest)

Tests run: 134, Failures: 1, Errors: 0, Skipped: 0

[INFO] ------------------------------------------------------------------------
[ERROR] BUILD FAILURE
[INFO] ------------------------------------------------------------------------
[INFO] There are test failures.

Please refer to /srv/gump/public/workspace/castor/xml/target/surefire-reports for the individual test results.
[INFO] ------------------------------------------------------------------------
[INFO] For more information, run Maven with the -e switch
[INFO] ------------------------------------------------------------------------
[INFO] Total time: 20 seconds
[INFO] Finished at: Thu Aug 05 05:32:49 PDT 2010
[INFO] Final Memory: 22M/53M
[INFO] ------------------------------------------------------------------------
---------------------------------------------

To subscribe to this information via syndicated feeds:
- RSS: http://vmgump.apache.org/gump/public/castor/castor-test/rss.xml
- Atom: http://vmgump.apache.org/gump/public/castor/castor-test/atom.xml

============================== Gump Tracking Only ===
Produced by Gump version 2.3.
Gump Run 12000005082010, vmgump:vmgump-public:12000005082010
Gump E-mail Identifier (unique within run) #43.

*********************************************************** G U M P
[GUMP@vmgump]: Project jersey-server (in module jersey) failed
To whom it may engage...
        
This is an automated request, but not an unsolicited one. For 
more information please visit http://gump.apache.org/nagged.html, 
and/or contact the folk at general@gump.apache.org.

Project jersey-server has an issue affecting its community integration.
This issue affects 1 projects,
 and has been outstanding for 4 runs.
The current state of this project is 'Failed', with reason 'Build Timed Out'.
For reference only, the following projects are affected by this:
    - jersey-server :  Jersey is the open source JAX-RS (JSR 311) Reference
    Imp...


Full details are available at:
    http://vmgump.apache.org/gump/public/jersey/jersey-server/index.html

That said, some information snippets are provided here.

The following annotations (debug/informational/warning/error messages) were provided:
 -DEBUG- Sole jar output [jersey-server-*[0-9T].jar] identifier set to project name
 -DEBUG- (Gump generated) Maven2 Settings in: /srv/gump/public/workspace/jersey/jersey-server/gump_mvn_settings.xml
 -INFO- Failed with reason build timed out
 -DEBUG- Maven POM in: /srv/gump/public/workspace/jersey/jersey-server/pom.xml
 -INFO- Failed to extract fallback artifacts from Gump Repository



The following work was performed:
http://vmgump.apache.org/gump/public/jersey/jersey-server/gump_work/build_jersey_jersey-server.html
Work Name: build_jersey_jersey-server (Type: Build)
Work ended in a state of : Failed
Elapsed: 60 mins
Command Line: mvn --batch-mode --settings /srv/gump/public/workspace/jersey/jersey-server/gump_mvn_settings.xml install 
[Working Directory: /srv/gump/public/workspace/jersey/jersey-server]
---------------------------------------------
[INFO] Scanning for projects...
[INFO] ------------------------------------------------------------------------
[INFO] Building jersey-server
[INFO]    task-segment: [install]
[INFO] ------------------------------------------------------------------------
Downloading: http://localhost:8192/maven/2/com/sun/tools/xjc/maven2/maven-jaxb-plugin/1.1.1/maven-jaxb-plugin-1.1.1.pom
5K downloaded  (maven-jaxb-plugin-1.1.1.pom)
Downloading: http://localhost:8192/maven/2/com/sun/tools/xjc/maven2/maven-jaxb-plugin/1.1.1/maven-jaxb-plugin-1.1.1.jar
9K downloaded  (maven-jaxb-plugin-1.1.1.jar)
[INFO] [buildnumber:create {execution: default}]
[INFO] Storing buildNumber: 08/05/2010 05:37 AM at timestamp: 1281011832223
[INFO] Executing: /bin/sh -c cd /srv/gump/public/workspace/jersey/jersey-server && svn --non-interactive info
[INFO] Working directory: /srv/gump/public/workspace/jersey/jersey-server
[INFO] Storing buildScmBranch: UNKNOWN_BRANCH
Downloading: http://localhost:8192/maven/2/com/sun/xml/bind/jaxb-impl/2.1.12/jaxb-impl-2.1.12.pom
[INFO] Unable to find resource 'com.sun.xml.bind:jaxb-impl:pom:2.1.12' in repository maven2-repository.dev.java.net (http://download.java.net/maven/2/)
Downloading: http://download.java.net/maven/1/com.sun.xml.bind/poms/jaxb-impl-2.1.12.pom
340b downloaded  (jaxb-impl-2.1.12.pom)
Downloading: http://localhost:8192/maven/2/com/sun/xml/bind/jaxb-xjc/2.1.12/jaxb-xjc-2.1.12.pom
[INFO] Unable to find resource 'com.sun.xml.bind:jaxb-xjc:pom:2.1.12' in repository maven2-repository.dev.java.net (http://download.java.net/maven/2/)
Downloading: http://download.java.net/maven/1/com.sun.xml.bind/poms/jaxb-xjc-2.1.12.pom
345b downloaded  (jaxb-xjc-2.1.12.pom)
Downloading: http://localhost:8192/maven/2/javax/xml/bind/jsr173_api/1.0/jsr173_api-1.0.pom
[INFO] Unable to find resource 'javax.xml.bind:jsr173_api:pom:1.0' in repository maven2-repository.dev.java.net (http://download.java.net/maven/2/)
Downloading: http://download.java.net/maven/1/javax.xml.bind/poms/jsr173_api-1.0.pom
157b downloaded  (jsr173_api-1.0.pom)
[WARNING] *** CHECKSUM FAILED - Checksum failed on download: local = 'a598e31e2cd49ce306a9b1ac1cc449c6f866cd91'; remote = 'b9cd007160a14fe3f2c3fe9e0fbc63399ebb8e76' - RETRYING
Downloading: http://download.java.net/maven/1/javax.xml.bind/poms/jsr173_api-1.0.pom
157b downloaded  (jsr173_api-1.0.pom)
[WARNING] *** CHECKSUM FAILED - Checksum failed on download: local = 'a598e31e2cd49ce306a9b1ac1cc449c6f866cd91'; remote = 'b9cd007160a14fe3f2c3fe9e0fbc63399ebb8e76' - IGNORING
Downloading: http://localhost:8192/maven/2/com/sun/xml/bind/jaxb-impl/2.1.12/jaxb-impl-2.1.12.jar
Downloading: http://localhost:8192/maven/2/javax/xml/bind/jsr173_api/1.0/jsr173_api-1.0.jar
[INFO] Unable to find resource 'javax.xml.bind:jsr173_api:jar:1.0' in repository maven2-repository.dev.java.net (http://download.java.net/maven/2/)
Downloading: http://download.java.net/maven/1/javax.xml.bind/jars/jsr173_api-1.0.jar
[INFO] Unable to find resource 'com.sun.xml.bind:jaxb-impl:jar:2.1.12' in repository maven2-repository.dev.java.net (http://download.java.net/maven/2/)
Downloading: http://download.java.net/maven/1/com.sun.xml.bind/jars/jaxb-impl-2.1.12.jar
48K downloaded  (jsr173_api-1.0.jar)
847K downloaded  (jaxb-impl-2.1.12.jar)
Downloading: http://localhost:8192/maven/2/com/sun/xml/bind/jaxb-xjc/2.1.12/jaxb-xjc-2.1.12.jar
[INFO] Unable to find resource 'com.sun.xml.bind:jaxb-xjc:jar:2.1.12' in repository maven2-repository.dev.java.net (http://download.java.net/maven/2/)
Downloading: http://download.java.net/maven/1/com.sun.xml.bind/jars/jaxb-xjc-2.1.12.jar
---------------------------------------------

To subscribe to this information via syndicated feeds:
- RSS: http://vmgump.apache.org/gump/public/jersey/jersey-server/rss.xml
- Atom: http://vmgump.apache.org/gump/public/jersey/jersey-server/atom.xml

============================== Gump Tracking Only ===
Produced by Gump version 2.3.
Gump Run 12000005082010, vmgump:vmgump-public:12000005082010
Gump E-mail Identifier (unique within run) #44.

*********************************************************** G U M P
[GUMP@vmgump]: Project ws-axis2 (in module ws-axis2) failed
To whom it may engage...
        
This is an automated request, but not an unsolicited one. For 
more information please visit http://gump.apache.org/nagged.html, 
and/or contact the folk at general@gump.apache.org.

Project ws-axis2 has an issue affecting its community integration.
This issue affects 2 projects,
 and has been outstanding for 431 runs.
The current state of this project is 'Failed', with reason 'Build Failed'.
For reference only, the following projects are affected by this:
    - ws-axis2 :  Apache Axis2 SOAP Stack
    - ws-axis2-test :  Apache Axis2 SOAP Stack


Full details are available at:
    http://vmgump.apache.org/gump/public/ws-axis2/ws-axis2/index.html

That said, some information snippets are provided here.

The following annotations (debug/informational/warning/error messages) were provided:
 -DEBUG- Sole jar output [ws-axis2-05082010] identifier set to project name
 -INFO- Optional dependency ws-commons-xmlschema failed with reason build failed
 -INFO- Optional dependency ws-commons-axiom failed with reason build failed
 -DEBUG- (Gump generated) Maven2 Settings in: /srv/gump/public/workspace/ws-axis2/gump_mvn_settings.xml
 -INFO- Failed with reason build failed
 -DEBUG- Maven POM in: /srv/gump/public/workspace/ws-axis2/pom.xml
 -INFO- Failed to extract fallback artifacts from Gump Repository



The following work was performed:
http://vmgump.apache.org/gump/public/ws-axis2/ws-axis2/gump_work/build_ws-axis2_ws-axis2.html
Work Name: build_ws-axis2_ws-axis2 (Type: Build)
Work ended in a state of : Failed
Elapsed: 31 secs
Command Line: mvn --batch-mode -Dmaven.test.skip.exec=true --settings /srv/gump/public/workspace/ws-axis2/gump_mvn_settings.xml package 
[Working Directory: /srv/gump/public/workspace/ws-axis2]
---------------------------------------------
Downloading: http://tomcat.apache.org/dev/dist/m2-repository/org/osgi/org.osgi.core/4.1.0/org.osgi.core-4.1.0.jar
[INFO] Unable to find resource 'org.osgi:org.osgi.core:jar:4.1.0' in repository tomcat-repository (http://tomcat.apache.org/dev/dist/m2-repository)
Downloading: http://repo1.maven.org/eclipse/org/osgi/org.osgi.core/4.1.0/org.osgi.core-4.1.0.jar
Downloading: http://ws.zones.apache.org/repository2/net/sf/kxml/kxml2/2.2.2/kxml2-2.2.2.jar
[INFO] Unable to find resource 'org.osgi:org.osgi.core:jar:4.1.0' in repository eclipse-repo (http://repo1.maven.org/eclipse)
Downloading: http://download.java.net/maven/1/org.osgi/jars/org.osgi.core-4.1.0.jar
[INFO] Unable to find resource 'net.sf.kxml:kxml2:jar:2.2.2' in repository ws-zones (http://ws.zones.apache.org/repository2)
Downloading: http://localhost:8192/maven2/net/sf/kxml/kxml2/2.2.2/kxml2-2.2.2.jar
[INFO] Unable to find resource 'org.osgi:org.osgi.core:jar:4.1.0' in repository java.net (http://download.java.net/maven/1)
Downloading: http://localhost:8192/maven2/org/osgi/org.osgi.core/4.1.0/org.osgi.core-4.1.0.jar
[INFO] Unable to find resource 'org.easymock:easymock:jar:2.4' in repository eclipse-repo (http://repo1.maven.org/eclipse)
Downloading: http://download.java.net/maven/1/org.easymock/jars/easymock-2.4.jar
[INFO] Unable to find resource 'org.easymock:easymock:jar:2.4' in repository java.net (http://download.java.net/maven/1)
Downloading: http://localhost:8192/maven2/org/easymock/easymock/2.4/easymock-2.4.jar



Downloading: http://ws.zones.apache.org/repository2/org/apache/felix/org.osgi.core/1.0.0/org.osgi.core-1.0.0.jar
[INFO] Unable to find resource 'org.apache.felix:org.osgi.core:jar:1.0.0' in repository ws-zones (http://ws.zones.apache.org/repository2)
Downloading: http://localhost:8192/maven2/org/apache/felix/org.osgi.core/1.0.0/org.osgi.core-1.0.0.jar


Downloading: http://ws.zones.apache.org/repository2/org/apache/felix/org.osgi.service.obr/1.0.1/org.osgi.service.obr-1.0.1.jar
[INFO] Unable to find resource 'org.apache.felix:org.osgi.service.obr:jar:1.0.1' in repository ws-zones (http://ws.zones.apache.org/repository2)
Downloading: http://localhost:8192/maven2/org/apache/felix/org.osgi.service.obr/1.0.1/org.osgi.service.obr-1.0.1.jar

[INFO] snapshot org.apache.axis2:axis2-mar-maven-plugin:1.5.2-SNAPSHOT: checking for updates from apache-snapshots
[INFO] snapshot org.apache.axis2:axis2-mar-maven-plugin:1.5.2-SNAPSHOT: checking for updates from apache.snapshots
[INFO] snapshot org.apache.axis2:axis2-mar-maven-plugin:1.5.2-SNAPSHOT: checking for updates from ws-zones
[INFO] snapshot org.apache.axis2:axis2-mar-maven-plugin:1.5.2-SNAPSHOT: checking for updates from apache-ws-snapshots2
Downloading: http://people.apache.org/repo/m2-snapshot-repository/org/apache/axis2/axis2-mar-maven-plugin/1.5.2-SNAPSHOT/axis2-mar-maven-plugin-1.5.2-SNAPSHOT.pom
[INFO] Unable to find resource 'org.apache.axis2:axis2-mar-maven-plugin:pom:1.5.2-SNAPSHOT' in repository apache-snapshots (http://people.apache.org/repo/m2-snapshot-repository)
Downloading: http://localhost:8192/repo/m2-snapshot-repository/org/apache/axis2/axis2-mar-maven-plugin/1.5.2-SNAPSHOT/axis2-mar-maven-plugin-1.5.2-SNAPSHOT.pom
4K downloaded  (axis2-mar-maven-plugin-1.5.2-SNAPSHOT.pom)
Downloading: http://people.apache.org/repo/m2-snapshot-repository/org/apache/axis2/axis2-mar-maven-plugin/1.5.2-SNAPSHOT/axis2-mar-maven-plugin-1.5.2-SNAPSHOT.jar
[INFO] Unable to find resource 'org.apache.axis2:axis2-mar-maven-plugin:maven-plugin:1.5.2-SNAPSHOT' in repository apache-snapshots (http://people.apache.org/repo/m2-snapshot-repository)
Downloading: http://localhost:8192/repo/m2-snapshot-repository/org/apache/axis2/axis2-mar-maven-plugin/1.5.2-SNAPSHOT/axis2-mar-maven-plugin-1.5.2-SNAPSHOT.jar
22K downloaded  (axis2-mar-maven-plugin-1.5.2-SNAPSHOT.jar)
[INFO] ------------------------------------------------------------------------
[ERROR] BUILD ERROR
[INFO] ------------------------------------------------------------------------
[INFO] Internal error in the plugin manager getting plugin 'org.apache.axis2:axis2-mar-maven-plugin': Plugin 'org.apache.axis2:axis2-mar-maven-plugin:1.5.2-SNAPSHOT' has an invalid descriptor:
1) Plugin's descriptor contains the wrong version: SNAPSHOT
[INFO] ------------------------------------------------------------------------
[INFO] For more information, run Maven with the -e switch
[INFO] ------------------------------------------------------------------------
[INFO] Total time: 29 seconds
[INFO] Finished at: Thu Aug 05 06:37:57 PDT 2010
[INFO] Final Memory: 13M/32M
[INFO] ------------------------------------------------------------------------
---------------------------------------------

To subscribe to this information via syndicated feeds:
- RSS: http://vmgump.apache.org/gump/public/ws-axis2/ws-axis2/rss.xml
- Atom: http://vmgump.apache.org/gump/public/ws-axis2/ws-axis2/atom.xml

============================== Gump Tracking Only ===
Produced by Gump version 2.3.
Gump Run 12000005082010, vmgump:vmgump-public:12000005082010
Gump E-mail Identifier (unique within run) #45.

*********************************************************** G U M P
[GUMP@vmgump]: Project htmlunit (in module htmlunit) failed
To whom it may engage...
        
This is an automated request, but not an unsolicited one. For 
more information please visit http://gump.apache.org/nagged.html, 
and/or contact the folk at general@gump.apache.org.

Project htmlunit has an issue affecting its community integration.
This issue affects 1 projects,
 and has been outstanding for 85 runs.
The current state of this project is 'Failed', with reason 'Build Failed'.
For reference only, the following projects are affected by this:
    - htmlunit :  A tool for testing web based applications


Full details are available at:
    http://vmgump.apache.org/gump/public/htmlunit/htmlunit/index.html

That said, some information snippets are provided here.

The following annotations (debug/informational/warning/error messages) were provided:
 -DEBUG- Sole jar output [htmlunit-*[0-9T].jar] identifier set to project name
 -INFO- Optional dependency gsbase failed with reason build failed
 -INFO- Optional dependency apache-mime4j-reactor failed with reason build failed
 -DEBUG- (Gump generated) Maven2 Settings in: /srv/gump/public/workspace/htmlunit/gump_mvn_settings.xml
 -INFO- Failed with reason build failed
 -DEBUG- Maven POM in: /srv/gump/public/workspace/htmlunit/pom.xml
 -INFO- Failed to extract fallback artifacts from Gump Repository



The following work was performed:
http://vmgump.apache.org/gump/public/htmlunit/htmlunit/gump_work/build_htmlunit_htmlunit.html
Work Name: build_htmlunit_htmlunit (Type: Build)
Work ended in a state of : Failed
Elapsed: 45 secs
Command Line: mvn --batch-mode --settings /srv/gump/public/workspace/htmlunit/gump_mvn_settings.xml package 
[Working Directory: /srv/gump/public/workspace/htmlunit]
---------------------------------------------

Downloading: http://localhost:8192/maven2/org/seleniumhq/selenium/selenium-remote-client/2.0a5/selenium-remote-client-2.0a5.pom

Downloading: http://localhost:8192/maven2/org/seleniumhq/selenium/selenium-remote-common/2.0a5/selenium-remote-common-2.0a5.pom

Downloading: http://localhost:8192/maven2/com/google/collections/google-collections/1.0/google-collections-1.0.pom

Downloading: http://localhost:8192/maven2/com/google/google/1/google-1.pom

Downloading: http://localhost:8192/maven2/net/sourceforge/htmlunit/htmlunit-core-js/2.8/htmlunit-core-js-2.8.jar
Downloading: http://localhost:8192/maven2/net/sourceforge/cssparser/cssparser/0.9.5/cssparser-0.9.5.jar
Downloading: http://localhost:8192/maven2/org/apache/httpcomponents/httpclient/4.0.1/httpclient-4.0.1.jar
Downloading: http://localhost:8192/maven2/net/sourceforge/nekohtml/nekohtml/1.9.14/nekohtml-1.9.14.jar
Downloading: http://localhost:8192/maven2/org/w3c/css/sac/1.3/sac-1.3.jar
322K downloaded  (httpclient-4.0.1.jar)
Downloading: http://localhost:8192/maven2/org/apache/httpcomponents/httpcore/4.0.1/httpcore-4.0.1.jar
175K downloaded  (httpcore-4.0.1.jar)
Downloading: http://localhost:8192/maven2/org/apache/httpcomponents/httpmime/4.0.1/httpmime-4.0.1.jar
25K downloaded  (httpmime-4.0.1.jar)




[INFO] [compiler:compile {execution: default-compile}]
[INFO] Compiling 443 source files to /srv/gump/public/workspace/htmlunit/target/classes
[INFO] -------------------------------------------------------------
[ERROR] COMPILATION ERROR : 
[INFO] -------------------------------------------------------------
[ERROR] /srv/gump/public/workspace/htmlunit/src/main/java/com/gargoylesoftware/htmlunit/HttpWebConnection.java:[339,65] incompatible types
found   : org.apache.http.entity.mime.FormBodyPart
required: org.apache.james.mime4j.message.BodyPart

[INFO] 1error
[INFO] -------------------------------------------------------------
[INFO] ------------------------------------------------------------------------
[ERROR] BUILD FAILURE
[INFO] ------------------------------------------------------------------------
[INFO] Compilation failure
/srv/gump/public/workspace/htmlunit/src/main/java/com/gargoylesoftware/htmlunit/HttpWebConnection.java:[339,65] incompatible types
found   : org.apache.http.entity.mime.FormBodyPart
required: org.apache.james.mime4j.message.BodyPart


[INFO] ------------------------------------------------------------------------
[INFO] For more information, run Maven with the -e switch
[INFO] ------------------------------------------------------------------------
[INFO] Total time: 44 seconds
[INFO] Finished at: Thu Aug 05 07:04:08 PDT 2010
[INFO] Final Memory: 21M/68M
[INFO] ------------------------------------------------------------------------
---------------------------------------------

To subscribe to this information via syndicated feeds:
- RSS: http://vmgump.apache.org/gump/public/htmlunit/htmlunit/rss.xml
- Atom: http://vmgump.apache.org/gump/public/htmlunit/htmlunit/atom.xml

============================== Gump Tracking Only ===
Produced by Gump version 2.3.
Gump Run 12000005082010, vmgump:vmgump-public:12000005082010
Gump E-mail Identifier (unique within run) #48.

*********************************************************** G U M P
[GUMP@vmgump]: Project james-imap-test (in module james-imap) failed
To whom it may engage...
        
This is an automated request, but not an unsolicited one. For 
more information please visit http://gump.apache.org/nagged.html, 
and/or contact the folk at general@gump.apache.org.

Project james-imap-test has an issue affecting its community integration.
This issue affects 1 projects,
 and has been outstanding for 10 runs.
The current state of this project is 'Failed', with reason 'Build Failed'.
For reference only, the following projects are affected by this:
    - james-imap-test :  A library providing a flexible codec for IMAP, command proce...


Full details are available at:
    http://vmgump.apache.org/gump/public/james-imap/james-imap-test/index.html

That said, some information snippets are provided here.

The following annotations (debug/informational/warning/error messages) were provided:
 -WARNING- Overriding Maven2 settings: [/srv/gump/public/workspace/james-imap/gump_mvn_settings.xml]
 -DEBUG- (Gump generated) Maven2 Settings in: /srv/gump/public/workspace/james-imap/gump_mvn_settings.xml
 -INFO- Failed with reason build failed
 -DEBUG- Maven POM in: /srv/gump/public/workspace/james-imap/pom.xml



The following work was performed:
http://vmgump.apache.org/gump/public/james-imap/james-imap-test/gump_work/build_james-imap_james-imap-test.html
Work Name: build_james-imap_james-imap-test (Type: Build)
Work ended in a state of : Failed
Elapsed: 10 mins 42 secs
Command Line: mvn --batch-mode --settings /srv/gump/public/workspace/james-imap/gump_mvn_settings.xml test 
[Working Directory: /srv/gump/public/workspace/james-imap]
---------------------------------------------
	at org.junit.runners.BlockJUnit4ClassRunner.createTest(BlockJUnit4ClassRunner.java:209)
	at org.junit.runners.BlockJUnit4ClassRunner$1.runReflectiveCall(BlockJUnit4ClassRunner.java:258)
	at org.junit.internal.runners.model.ReflectiveCallable.run(ReflectiveCallable.java:15)
	at org.junit.runners.BlockJUnit4ClassRunner.methodBlock(BlockJUnit4ClassRunner.java:255)
	at org.junit.runners.BlockJUnit4ClassRunner.runNotIgnored(BlockJUnit4ClassRunner.java:79)
	at org.junit.runners.BlockJUnit4ClassRunner.runChild(BlockJUnit4ClassRunner.java:71)
	at org.junit.runners.BlockJUnit4ClassRunner.runChild(BlockJUnit4ClassRunner.java:49)
	at org.junit.runners.ParentRunner$3.run(ParentRunner.java:246)
	at org.junit.runners.ParentRunner$1.schedule(ParentRunner.java:56)
	at org.junit.runners.ParentRunner.runChildren(ParentRunner.java:244)
	at org.junit.runners.ParentRunner.access$000(ParentRunner.java:46)
	at org.junit.runners.ParentRunner$2.evaluate(ParentRunner.java:237)
	at org.junit.runners.ParentRunner.run(ParentRunner.java:289)
	at org.apache.maven.surefire.junit4.JUnit4TestSet.execute(JUnit4TestSet.java:62)
	at org.apache.maven.surefire.suite.AbstractDirectoryTestSuite.executeTestSet(AbstractDirectoryTestSuite.java:140)
	at org.apache.maven.surefire.suite.AbstractDirectoryTestSuite.execute(AbstractDirectoryTestSuite.java:165)
	at org.apache.maven.surefire.Surefire.run(Surefire.java:107)
	at sun.reflect.NativeMethodAccessorImpl.invoke0(Native Method)
	at sun.reflect.NativeMethodAccessorImpl.invoke(NativeMethodAccessorImpl.java:39)
	at sun.reflect.DelegatingMethodAccessorImpl.invoke(DelegatingMethodAccessorImpl.java:25)
	at java.lang.reflect.Method.invoke(Method.java:597)
	at org.apache.maven.surefire.booter.SurefireBooter.runSuitesInProcess(SurefireBooter.java:289)
	at org.apache.maven.surefire.booter.SurefireBooter.main(SurefireBooter.java:1005)
Tests run: 6, Failures: 0, Errors: 6, Skipped: 0, Time elapsed: 1.469 sec <<< FAILURE!

Results :

Tests in error: 
  testSearchAtomsUS(org.apache.james.imap.functional.jcr.SearchTest)
  testSearchAtomsITALY(org.apache.james.imap.functional.jcr.SearchTest)
  testSearchAtomsKOREA(org.apache.james.imap.functional.jcr.SearchTest)
  testSearchCombinationsUS(org.apache.james.imap.functional.jcr.SearchTest)
  testSearchCombinationsITALY(org.apache.james.imap.functional.jcr.SearchTest)
  testSearchCombinationsKOREA(org.apache.james.imap.functional.jcr.SearchTest)

Tests run: 1167, Failures: 0, Errors: 293, Skipped: 0

[INFO] ------------------------------------------------------------------------
[ERROR] BUILD FAILURE
[INFO] ------------------------------------------------------------------------
[INFO] There are test failures.

Please refer to /srv/gump/public/workspace/james-imap/deployment/target/surefire-reports for the individual test results.
[INFO] ------------------------------------------------------------------------
[INFO] For more information, run Maven with the -e switch
[INFO] ------------------------------------------------------------------------
[INFO] Total time: 10 minutes 40 seconds
[INFO] Finished at: Thu Aug 05 07:16:17 PDT 2010
[INFO] Final Memory: 27M/66M
[INFO] ------------------------------------------------------------------------
---------------------------------------------

To subscribe to this information via syndicated feeds:
- RSS: http://vmgump.apache.org/gump/public/james-imap/james-imap-test/rss.xml
- Atom: http://vmgump.apache.org/gump/public/james-imap/james-imap-test/atom.xml

============================== Gump Tracking Only ===
Produced by Gump version 2.3.
Gump Run 12000005082010, vmgump:vmgump-public:12000005082010
Gump E-mail Identifier (unique within run) #49.

*********************************************************** G U M P
[GUMP@vmgump]: Project portals-bridges-velocity (in module portals-bridges) failed
To whom it may engage...
        
This is an automated request, but not an unsolicited one. For 
more information please visit http://gump.apache.org/nagged.html, 
and/or contact the folk at general@gump.apache.org.

Project portals-bridges-velocity has an issue affecting its community integration.
This issue affects 1 projects,
 and has been outstanding for 14 runs.
The current state of this project is 'Failed', with reason 'Build Failed'.
For reference only, the following projects are affected by this:
    - portals-bridges-velocity :  Support for JSR168 compliant Portlet development


Full details are available at:
    http://vmgump.apache.org/gump/public/portals-bridges/portals-bridges-velocity/index.html

That said, some information snippets are provided here.

The following annotations (debug/informational/warning/error messages) were provided:
 -DEBUG- Sole jar output [portals-bridges-velocity-*[0-9T].jar] identifier set to project name
 -DEBUG- (Gump generated) Maven2 Settings in: /srv/gump/public/workspace/portals-bridges/bridges-velocity/trunk/gump_mvn_settings.xml
 -INFO- Failed with reason build failed
 -DEBUG- Maven POM in: /srv/gump/public/workspace/portals-bridges/bridges-velocity/trunk/pom.xml
 -INFO- Failed to extract fallback artifacts from Gump Repository



The following work was performed:
http://vmgump.apache.org/gump/public/portals-bridges/portals-bridges-velocity/gump_work/build_portals-bridges_portals-bridges-velocity.html
Work Name: build_portals-bridges_portals-bridges-velocity (Type: Build)
Work ended in a state of : Failed
Elapsed: 8 secs
Command Line: mvn --batch-mode --settings /srv/gump/public/workspace/portals-bridges/bridges-velocity/trunk/gump_mvn_settings.xml install 
[Working Directory: /srv/gump/public/workspace/portals-bridges/bridges-velocity/trunk]
---------------------------------------------
[INFO] Scanning for projects...
[INFO] ------------------------------------------------------------------------
[INFO] Building Apache Portals Bridges Velocity Bridge
[INFO]    task-segment: [install]
[INFO] ------------------------------------------------------------------------
[INFO] Setting property: classpath.resource.loader.class => 'org.codehaus.plexus.velocity.ContextClassLoaderResourceLoader'.
[INFO] Setting property: velocimacro.messages.on => 'false'.
[INFO] Setting property: resource.loader => 'classpath'.
[INFO] Setting property: resource.manager.logwhenfound => 'false'.
[INFO] [remote-resources:process {execution: default}]
Downloading: http://localhost:8192/maven2/velocity-tools/velocity-tools/1.3/velocity-tools-1.3.pom
[INFO] Unable to find resource 'velocity-tools:velocity-tools:pom:1.3' in repository central (http://repo1.maven.org/maven2)
Downloading: http://localhost:8192/maven2/org/apache/portals/bridges/portals-bridges-common/2.0/portals-bridges-common-2.0.pom

Downloading: http://localhost:8192/maven2/velocity-tools/velocity-tools/1.3/velocity-tools-1.3.jar
Downloading: http://localhost:8192/maven2/org/apache/portals/bridges/portals-bridges-common/2.0/portals-bridges-common-2.0.jar
21K downloaded  (portals-bridges-common-2.0.jar)
338K downloaded  (velocity-tools-1.3.jar)
[INFO] [resources:resources {execution: default-resources}]
[INFO] Using 'UTF-8' encoding to copy filtered resources.
[INFO] skip non existing resourceDirectory /srv/gump/public/workspace/portals-bridges/bridges-velocity/trunk/src/main/resources
[INFO] Copying 3 resources
[INFO] [compiler:compile {execution: default-compile}]
[INFO] Compiling 3 source files to /srv/gump/public/workspace/portals-bridges/bridges-velocity/trunk/target/classes
[INFO] ------------------------------------------------------------------------
[ERROR] BUILD FAILURE
[INFO] ------------------------------------------------------------------------
[INFO] Compilation failure

/srv/gump/public/workspace/portals-bridges/bridges-velocity/trunk/src/main/java/org/apache/portals/bridges/velocity/BridgesVelocityViewServlet.java:[58,23] handleRequest(javax.servlet.http.HttpServletRequest,javax.servlet.http.HttpServletResponse,org.apache.velocity.context.Context) in org.apache.portals.bridges.velocity.BridgesVelocityViewServlet cannot override handleRequest(javax.servlet.http.HttpServletRequest,javax.servlet.http.HttpServletResponse,org.apache.velocity.context.Context) in org.apache.velocity.tools.view.VelocityViewServlet; overridden method does not throw java.lang.Exception

/srv/gump/public/workspace/portals-bridges/bridges-velocity/trunk/src/main/java/org/apache/portals/bridges/velocity/BridgesVelocityViewServlet.java:[92,19] mergeTemplate(org.apache.velocity.Template,org.apache.velocity.context.Context,javax.servlet.http.HttpServletResponse) in org.apache.portals.bridges.velocity.BridgesVelocityViewServlet cannot override mergeTemplate(org.apache.velocity.Template,org.apache.velocity.context.Context,javax.servlet.http.HttpServletResponse) in org.apache.velocity.tools.view.VelocityViewServlet; overridden method does not throw java.lang.Exception


[INFO] ------------------------------------------------------------------------
[INFO] For more information, run Maven with the -e switch
[INFO] ------------------------------------------------------------------------
[INFO] Total time: 6 seconds
[INFO] Finished at: Thu Aug 05 07:16:53 PDT 2010
[INFO] Final Memory: 17M/41M
[INFO] ------------------------------------------------------------------------
---------------------------------------------

To subscribe to this information via syndicated feeds:
- RSS: http://vmgump.apache.org/gump/public/portals-bridges/portals-bridges-velocity/rss.xml
- Atom: http://vmgump.apache.org/gump/public/portals-bridges/portals-bridges-velocity/atom.xml

============================== Gump Tracking Only ===
Produced by Gump version 2.3.
Gump Run 12000005082010, vmgump:vmgump-public:12000005082010
Gump E-mail Identifier (unique within run) #50.

*********************************************************** G U M P
[GUMP@vmgump]: Project portals-pluto-portal-1.0 (in module portals-pluto-1.0) failed
To whom it may engage...
        
This is an automated request, but not an unsolicited one. For 
more information please visit http://gump.apache.org/nagged.html, 
and/or contact the folk at general@gump.apache.org.

Project portals-pluto-portal-1.0 has an issue affecting its community integration.
This issue affects 1 projects.
The current state of this project is 'Failed', with reason 'Build Failed'.
For reference only, the following projects are affected by this:
    - portals-pluto-portal-1.0 :  JSR168 Container


Full details are available at:
    http://vmgump.apache.org/gump/public/portals-pluto-1.0/portals-pluto-portal-1.0/index.html

That said, some information snippets are provided here.

The following annotations (debug/informational/warning/error messages) were provided:
 -DEBUG- Dependency on ant exists, no need to add for property env.ANT_HOME.
 -INFO- Failed with reason build failed
 -INFO- Failed to extract fallback artifacts from Gump Repository



The following work was performed:
http://vmgump.apache.org/gump/public/portals-pluto-1.0/portals-pluto-portal-1.0/gump_work/build_portals-pluto-1.0_portals-pluto-portal-1.0.html
Work Name: build_portals-pluto-1.0_portals-pluto-portal-1.0 (Type: Build)
Work ended in a state of : Failed
Elapsed: 4 secs
Command Line: /usr/lib/jvm/java-6-sun/bin/java -Djava.awt.headless=true -Xbootclasspath/p:/srv/gump/public/workspace/xml-commons/java/external/build/xml-apis.jar:/srv/gump/public/workspace/xml-xerces2/build/xercesImpl.jar org.apache.tools.ant.Main -Dgump.merge=/srv/gump/public/gump/work/merge.xml -Dbuild.sysclasspath=only -Denv.ANT_HOME=/srv/gump/public/workspace/ant/dist -Dversion=05082010 -Dfinal.portal.name=pluto-portal-impl-05082010 all 
[Working Directory: /srv/gump/public/workspace/portals-pluto-1.0]
CLASSPATH: /usr/lib/jvm/java-6-sun/lib/tools.jar:/srv/gump/public/workspace/portals-pluto-1.0/build/ant/lib/ForeachTask.jar:/srv/gump/public/workspace/ant/dist/lib/ant.jar:/srv/gump/public/workspace/ant/dist/lib/ant-launcher.jar:/srv/gump/public/workspace/ant/dist/lib/ant-jmf.jar:/srv/gump/public/workspace/ant/dist/lib/ant-junit.jar:/srv/gump/public/workspace/ant/dist/lib/ant-swing.jar:/srv/gump/public/workspace/ant/dist/lib/ant-apache-resolver.jar:/srv/gump/public/workspace/ant/dist/lib/ant-apache-xalan2.jar:/srv/gump/packages/junit3.8.1/junit.jar:/srv/gump/public/workspace/xml-commons/java/build/resolver.jar:/srv/gump/public/workspace/castor/core/target/castor-core-1.3.2-SNAPSHOT.jar:/srv/gump/public/workspace/castor/xml/target/castor-xml-1.3.2-SNAPSHOT.jar:/srv/gump/public/workspace/castor/codegen/target/castor-codegen-1.3.2-SNAPSHOT.jar:/srv/gump/public/workspace/castor/schema/target/castor-xml-schema-1.3.2-SNAPSHOT.jar:/srv/gump/public/workspace/apache-commons/fileupload
 /target/commons-fileupload-05082010.jar:/srv/gump/public/workspace/apache-commons/logging/target/commons-logging-05082010.jar:/srv/gump/public/workspace/apache-commons/logging/target/commons-logging-api-05082010.jar:/srv/gump/public/workspace/junit/dist/junit-05082010.jar:/srv/gump/public/workspace/jakarta-regexp/build/jakarta-regexp-05082010.jar:/srv/gump/public/workspace/jakarta-servletapi-5/jsr154/dist/lib/servlet-api.jar:/srv/gump/public/workspace/jakarta-servletapi-5/jsr152/dist/lib/jsp-api.jar:/srv/gump/public/workspace/portals-pluto-1.0/api/target/portlet-api-1.0.jar:/srv/gump/public/workspace/portals-pluto-1.0/container/target/pluto-1.0.jar:/srv/gump/public/workspace/portals-pluto-1.0/descriptors/target/pluto-descriptors-1.0.jar:/srv/gump/public/workspace/xml-commons/java/external/build/xml-apis-ext.jar
---------------------------------------------

compile-tests:

internal-test:

test:

jar:

portal:

init:
    [mkdir] Created dir: /srv/gump/public/workspace/portals-pluto-1.0/portal/target/lib

get-deps:

compile:
    [mkdir] Created dir: /srv/gump/public/workspace/portals-pluto-1.0/portal/target/classes
    [javac] Compiling 149 source files to /srv/gump/public/workspace/portals-pluto-1.0/portal/target/classes
    [javac] /srv/gump/public/workspace/portals-pluto-1.0/portal/src/java/org/apache/pluto/portalImpl/Deploy.java:62: warning: [deprecation] org.apache.xml.serialize.OutputFormat in org.apache.xml.serialize has been deprecated
    [javac] import org.apache.xml.serialize.OutputFormat;
    [javac]                                ^
    [javac] /srv/gump/public/workspace/portals-pluto-1.0/portal/src/java/org/apache/pluto/portalImpl/Deploy.java:63: warning: [deprecation] org.apache.xml.serialize.XMLSerializer in org.apache.xml.serialize has been deprecated
    [javac] import org.apache.xml.serialize.XMLSerializer;
    [javac]                                ^
    [javac] /srv/gump/public/workspace/portals-pluto-1.0/portal/src/java/org/apache/pluto/portalImpl/core/PortalURL.java:179: warning: [deprecation] encode(java.lang.String) in java.net.URLEncoder has been deprecated
    [javac]         value = URLEncoder.encode(value);
    [javac]                           ^
    [javac] /srv/gump/public/workspace/portals-pluto-1.0/portal/src/java/org/apache/pluto/portalImpl/services/portletdefinitionregistry/PortletDefinitionRegistryServiceContextImpl.java:113: exception java.io.IOException is never thrown in body of corresponding try statement
    [javac]         } catch (IOException e) {
    [javac]           ^
    [javac] /srv/gump/public/workspace/portals-pluto-1.0/portal/src/java/org/apache/pluto/portalImpl/services/portletdefinitionregistry/PortletDefinitionRegistryServiceContextImpl.java:115: exception org.exolab.castor.mapping.MappingException is never thrown in body of corresponding try statement
    [javac]         } catch (MappingException e) {
    [javac]           ^
    [javac] /srv/gump/public/workspace/portals-pluto-1.0/portal/src/java/org/apache/pluto/portalImpl/services/portletdefinitionregistry/PortletDefinitionRegistryServiceFileImpl.java:233: warning: [deprecation] toURL() in java.io.File has been deprecated
    [javac]             source.setSystemId(portletXml.toURL().toExternalForm());
    [javac]                                          ^
    [javac] /srv/gump/public/workspace/portals-pluto-1.0/portal/src/java/org/apache/pluto/portlet/admin/services/DeployWarService.java:165: warning: [deprecation] org.apache.pluto.portalImpl.Deploy in org.apache.pluto.portalImpl has been deprecated
    [javac] 		            org.apache.pluto.portalImpl.Deploy.main(args);
    [javac] 		                                       ^
    [javac] Note: Some input files use unchecked or unsafe operations.
    [javac] Note: Recompile with -Xlint:unchecked for details.
    [javac] 2 errors
    [javac] 5 warnings

BUILD FAILED
/srv/gump/public/workspace/portals-pluto-1.0/build.xml:51: The following error occurred while executing this line:
/srv/gump/public/workspace/portals-pluto-1.0/portal/build.xml:50: Compile failed; see the compiler error output for details.

Total time: 3 seconds
---------------------------------------------

To subscribe to this information via syndicated feeds:
- RSS: http://vmgump.apache.org/gump/public/portals-pluto-1.0/portals-pluto-portal-1.0/rss.xml
- Atom: http://vmgump.apache.org/gump/public/portals-pluto-1.0/portals-pluto-portal-1.0/atom.xml

============================== Gump Tracking Only ===
Produced by Gump version 2.3.
Gump Run 12000005082010, vmgump:vmgump-public:12000005082010
Gump E-mail Identifier (unique within run) #51.

*********************************************************** G U M P
[GUMP@vmgump]: Project tapestry (in module tapestry) failed
To whom it may engage...
        
This is an automated request, but not an unsolicited one. For 
more information please visit http://gump.apache.org/nagged.html, 
and/or contact the folk at general@gump.apache.org.

Project tapestry has an issue affecting its community integration.
This issue affects 1 projects.
The current state of this project is 'Failed', with reason 'Build Failed'.
For reference only, the following projects are affected by this:
    - tapestry :  Component-based web application framework organized around i...


Full details are available at:
    http://vmgump.apache.org/gump/public/tapestry/tapestry/index.html

That said, some information snippets are provided here.

The following annotations (debug/informational/warning/error messages) were provided:
 -DEBUG- (Gump generated) Maven2 Settings in: /srv/gump/public/workspace/tapestry/gump_mvn_settings.xml
 -INFO- Failed with reason build failed
 -DEBUG- Maven POM in: /srv/gump/public/workspace/tapestry/pom.xml
 -INFO- Failed to extract fallback artifacts from Gump Repository



The following work was performed:
http://vmgump.apache.org/gump/public/tapestry/tapestry/gump_work/build_tapestry_tapestry.html
Work Name: build_tapestry_tapestry (Type: Build)
Work ended in a state of : Failed
Elapsed: 13 secs
Command Line: mvn --batch-mode -DskipTests=true --settings /srv/gump/public/workspace/tapestry/gump_mvn_settings.xml package 
[Working Directory: /srv/gump/public/workspace/tapestry]
---------------------------------------------
urls[11] = file:/srv/gump/public/workspace/mvnlocalrepo/shared/org/mortbay/jetty/jetty/6.0.0beta12/jetty-6.0.0beta12.jar
urls[12] = file:/srv/gump/public/workspace/mvnlocalrepo/shared/org/mortbay/jetty/servlet-api-2.5/6.0.0beta12/servlet-api-2.5-6.0.0beta12.jar
[FATAL ERROR] Container realm = plexus.core
urls[0] = file:/opt/maven2/lib/maven-2.2.1-uber.jar
urls[1] = file:/srv/gump/public/workspace/mvnlocalrepo/shared/org/apache/maven/archetype/archetype-packaging/2.0-alpha-5/archetype-packaging-2.0-alpha-5.jar
urls[2] = file:/srv/gump/public/workspace/mvnlocalrepo/shared/org/codehaus/plexus/plexus-utils/1.1/plexus-utils-1.1.jar
[INFO] ------------------------------------------------------------------------
[ERROR] FATAL ERROR
[INFO] ------------------------------------------------------------------------
[INFO] org/codehaus/plexus/util/xml/XmlStreamReader
org.codehaus.plexus.util.xml.XmlStreamReader
[INFO] ------------------------------------------------------------------------
[INFO] Trace
java.lang.NoClassDefFoundError: org/codehaus/plexus/util/xml/XmlStreamReader
	at org.apache.maven.plugins.site.SiteDescriptorAttachMojo.execute(SiteDescriptorAttachMojo.java:86)
	at org.apache.maven.plugin.DefaultPluginManager.executeMojo(DefaultPluginManager.java:490)
	at org.apache.maven.lifecycle.DefaultLifecycleExecutor.executeGoals(DefaultLifecycleExecutor.java:694)
	at org.apache.maven.lifecycle.DefaultLifecycleExecutor.executeGoalWithLifecycle(DefaultLifecycleExecutor.java:556)
	at org.apache.maven.lifecycle.DefaultLifecycleExecutor.executeGoal(DefaultLifecycleExecutor.java:535)
	at org.apache.maven.lifecycle.DefaultLifecycleExecutor.executeGoalAndHandleFailures(DefaultLifecycleExecutor.java:387)
	at org.apache.maven.lifecycle.DefaultLifecycleExecutor.executeTaskSegments(DefaultLifecycleExecutor.java:348)
	at org.apache.maven.lifecycle.DefaultLifecycleExecutor.execute(DefaultLifecycleExecutor.java:180)
	at org.apache.maven.DefaultMaven.doExecute(DefaultMaven.java:328)
	at org.apache.maven.DefaultMaven.execute(DefaultMaven.java:138)
	at org.apache.maven.cli.MavenCli.main(MavenCli.java:362)
	at org.apache.maven.cli.compat.CompatibleMain.main(CompatibleMain.java:60)
	at sun.reflect.NativeMethodAccessorImpl.invoke0(Native Method)
	at sun.reflect.NativeMethodAccessorImpl.invoke(NativeMethodAccessorImpl.java:39)
	at sun.reflect.DelegatingMethodAccessorImpl.invoke(DelegatingMethodAccessorImpl.java:25)
	at java.lang.reflect.Method.invoke(Method.java:597)
	at org.codehaus.classworlds.Launcher.launchEnhanced(Launcher.java:315)
	at org.codehaus.classworlds.Launcher.launch(Launcher.java:255)
	at org.codehaus.classworlds.Launcher.mainWithExitCode(Launcher.java:430)
	at org.codehaus.classworlds.Launcher.main(Launcher.java:375)
Caused by: java.lang.ClassNotFoundException: org.codehaus.plexus.util.xml.XmlStreamReader
	at java.net.URLClassLoader$1.run(URLClassLoader.java:202)
	at java.security.AccessController.doPrivileged(Native Method)
	at java.net.URLClassLoader.findClass(URLClassLoader.java:190)
	at java.lang.ClassLoader.loadClass(ClassLoader.java:307)
	at org.codehaus.classworlds.RealmClassLoader.loadClassDirect(RealmClassLoader.java:195)
	at org.codehaus.classworlds.DefaultClassRealm.loadClass(DefaultClassRealm.java:255)
	at org.codehaus.classworlds.DefaultClassRealm.loadClass(DefaultClassRealm.java:274)
	at org.codehaus.classworlds.RealmClassLoader.loadClass(RealmClassLoader.java:214)
	at java.lang.ClassLoader.loadClass(ClassLoader.java:248)
	... 20 more
[INFO] ------------------------------------------------------------------------
[INFO] Total time: 11 seconds
[INFO] Finished at: Thu Aug 05 07:24:10 PDT 2010
[INFO] Final Memory: 11M/26M
[INFO] ------------------------------------------------------------------------
---------------------------------------------

To subscribe to this information via syndicated feeds:
- RSS: http://vmgump.apache.org/gump/public/tapestry/tapestry/rss.xml
- Atom: http://vmgump.apache.org/gump/public/tapestry/tapestry/atom.xml

============================== Gump Tracking Only ===
Produced by Gump version 2.3.
Gump Run 12000005082010, vmgump:vmgump-public:12000005082010
Gump E-mail Identifier (unique within run) #52.

*********************************************************** G U M P
[GUMP@vmgump]: Module strutstestcase success, but with warnings.
To whom it may engage...
        
This is an automated request, but not an unsolicited one. For 
more information please visit http://gump.apache.org/nagged.html, 
and/or contact the folk at general@gump.apache.org.

Module strutstestcase contains errors.
The current state of this module is 'Success'.

Full details are available at:
    http://vmgump.apache.org/gump/public/strutstestcase/index.html

That said, some information snippets are provided here.

The following annotations (debug/informational/warning/error messages) were provided:
 -ERROR- *** Failed to update from source control.Stale contents ***



The following work was performed:
http://vmgump.apache.org/gump/public/strutstestcase/gump_work/update_strutstestcase.html
Work Name: update_strutstestcase (Type: Update)
Work ended in a state of : Failed
Elapsed: 12 secs
Command Line: cvs -q -z3 -d :pserver:anonymous@strutstestcase.cvs.sourceforge.net:/cvsroot/strutstestcase update -P -d 
[Working Directory: /srv/gump/public/workspace/cvs/strutstestcase]
---------------------------------------------
Fatal error, aborting.
anoncvs_strutstestcase: no such system user
---------------------------------------------

To subscribe to this information via syndicated feeds:
- RSS: http://vmgump.apache.org/gump/public/strutstestcase/rss.xml
- Atom: http://vmgump.apache.org/gump/public/strutstestcase/atom.xml

============================== Gump Tracking Only ===
Produced by Gump version 2.3.
Gump Run 12000005082010, vmgump:vmgump-public:12000005082010
Gump E-mail Identifier (unique within run) #60.

*********************************************************** G U M P
[GUMP@vmgump]: Project cocoon22-flowscript-impl (in module cocoon) failed
To whom it may engage...
        
This is an automated request, but not an unsolicited one. For 
more information please visit http://gump.apache.org/nagged.html, 
and/or contact the folk at general@gump.apache.org.

Project cocoon22-flowscript-impl has an issue affecting its community integration.
This issue affects 1 projects,
 and has been outstanding for 36 runs.
The current state of this project is 'Failed', with reason 'Build Failed'.
For reference only, the following projects are affected by this:
    - cocoon22-flowscript-impl :  Java XML Framework


Full details are available at:
    http://vmgump.apache.org/gump/public/cocoon/cocoon22-flowscript-impl/index.html

That said, some information snippets are provided here.

The following annotations (debug/informational/warning/error messages) were provided:
 -DEBUG- (Gump generated) Maven2 Settings in: /srv/gump/public/workspace/cocoon/blocks/cocoon-flowscript/cocoon-flowscript-impl/gump_mvn_settings.xml
 -INFO- Failed with reason build failed
 -DEBUG- Maven POM in: /srv/gump/public/workspace/cocoon/blocks/cocoon-flowscript/cocoon-flowscript-impl/pom.xml
 -INFO- Failed to extract fallback artifacts from Gump Repository



The following work was performed:
http://vmgump.apache.org/gump/public/cocoon/cocoon22-flowscript-impl/gump_work/build_cocoon_cocoon22-flowscript-impl.html
Work Name: build_cocoon_cocoon22-flowscript-impl (Type: Build)
Work ended in a state of : Failed
Elapsed: 11 secs
Command Line: mvn --batch-mode --settings /srv/gump/public/workspace/cocoon/blocks/cocoon-flowscript/cocoon-flowscript-impl/gump_mvn_settings.xml install 
[Working Directory: /srv/gump/public/workspace/cocoon/blocks/cocoon-flowscript/cocoon-flowscript-impl]
---------------------------------------------
/srv/gump/public/workspace/cocoon/blocks/cocoon-flowscript/cocoon-flowscript-impl/src/main/java/org/apache/cocoon/components/flow/javascript/fom/FOM_WebContinuation.java:[32,43] package org.mozilla.javascript.continuations does not exist

/srv/gump/public/workspace/cocoon/blocks/cocoon-flowscript/cocoon-flowscript-impl/src/main/java/org/apache/cocoon/components/flow/javascript/fom/FOM_WebContinuation.java:[135,11] cannot find symbol
symbol  : class Continuation
location: class org.apache.cocoon.components.flow.javascript.fom.FOM_WebContinuation

/srv/gump/public/workspace/cocoon/blocks/cocoon-flowscript/cocoon-flowscript-impl/src/main/java/org/apache/cocoon/components/flow/javascript/fom/FOM_Cocoon.java:[63,43] package org.mozilla.javascript.continuations does not exist

/srv/gump/public/workspace/cocoon/blocks/cocoon-flowscript/cocoon-flowscript-impl/src/main/java/org/apache/cocoon/components/flow/javascript/fom/FOM_JavaScriptInterpreter.java:[72,43] package org.mozilla.javascript.continuations does not exist

/srv/gump/public/workspace/cocoon/blocks/cocoon-flowscript/cocoon-flowscript-impl/src/main/java/org/apache/cocoon/components/flow/javascript/fom/FOM_Cocoon.java:[801,51] cannot find symbol
symbol  : class Continuation
location: class org.apache.cocoon.components.flow.javascript.fom.FOM_Cocoon

/srv/gump/public/workspace/cocoon/blocks/cocoon-flowscript/cocoon-flowscript-impl/src/main/java/org/apache/cocoon/components/flow/javascript/fom/FOM_WebContinuation.java:[77,8] cannot find symbol
symbol  : class Continuation
location: class org.apache.cocoon.components.flow.javascript.fom.FOM_WebContinuation

/srv/gump/public/workspace/cocoon/blocks/cocoon-flowscript/cocoon-flowscript-impl/src/main/java/org/apache/cocoon/components/flow/javascript/fom/FOM_WebContinuation.java:[77,26] cannot find symbol
symbol  : class Continuation
location: class org.apache.cocoon.components.flow.javascript.fom.FOM_WebContinuation

/srv/gump/public/workspace/cocoon/blocks/cocoon-flowscript/cocoon-flowscript-impl/src/main/java/org/apache/cocoon/components/flow/javascript/fom/FOM_WebContinuation.java:[136,16] cannot find symbol
symbol  : class Continuation
location: class org.apache.cocoon.components.flow.javascript.fom.FOM_WebContinuation

/srv/gump/public/workspace/cocoon/blocks/cocoon-flowscript/cocoon-flowscript-impl/src/main/java/org/apache/cocoon/components/flow/javascript/fom/FOM_Cocoon.java:[787,33] cannot find symbol
symbol  : class Continuation
location: class org.apache.cocoon.components.flow.javascript.fom.FOM_Cocoon

/srv/gump/public/workspace/cocoon/blocks/cocoon-flowscript/cocoon-flowscript-impl/src/main/java/org/apache/cocoon/components/flow/javascript/fom/FOM_JavaScriptInterpreter.java:[669,8] cannot find symbol
symbol  : class Continuation
location: class org.apache.cocoon.components.flow.javascript.fom.FOM_JavaScriptInterpreter

/srv/gump/public/workspace/cocoon/blocks/cocoon-flowscript/cocoon-flowscript-impl/src/main/java/org/apache/cocoon/components/flow/javascript/fom/FOM_JavaScriptInterpreter.java:[669,26] cannot find symbol
symbol  : class Continuation
location: class org.apache.cocoon.components.flow.javascript.fom.FOM_JavaScriptInterpreter

/srv/gump/public/workspace/cocoon/blocks/cocoon-flowscript/cocoon-flowscript-impl/src/main/java/org/apache/cocoon/components/flow/javascript/LocationTrackingDebugger.java:[114,12] org.apache.cocoon.components.flow.javascript.LocationTrackingDebugger.StackTrackingFrame is not abstract and does not override abstract method onDebuggerStatement(org.mozilla.javascript.Context) in org.mozilla.javascript.debug.DebugFrame

/srv/gump/public/workspace/cocoon/blocks/cocoon-flowscript/cocoon-flowscript-impl/src/main/java/org/apache/cocoon/components/flow/javascript/ScriptablePropertyPointer.java:[163,19] escape(java.lang.String) in org.apache.cocoon.components.flow.javascript.ScriptablePropertyPointer cannot override escape(java.lang.String) in org.apache.commons.jxpath.ri.model.NodePointer; attempting to assign weaker access privileges; was protected


[INFO] ------------------------------------------------------------------------
[INFO] For more information, run Maven with the -e switch
[INFO] ------------------------------------------------------------------------
[INFO] Total time: 9 seconds
[INFO] Finished at: Thu Aug 05 10:21:12 PDT 2010
[INFO] Final Memory: 27M/66M
[INFO] ------------------------------------------------------------------------
---------------------------------------------

To subscribe to this information via syndicated feeds:
- RSS: http://vmgump.apache.org/gump/public/cocoon/cocoon22-flowscript-impl/rss.xml
- Atom: http://vmgump.apache.org/gump/public/cocoon/cocoon22-flowscript-impl/atom.xml

============================== Gump Tracking Only ===
Produced by Gump version 2.3.
Gump Run 12000005082010, vmgump:vmgump-public:12000005082010
Gump E-mail Identifier (unique within run) #61.

*********************************************************** G U M P
[GUMP@vmgump]: Project portals-pluto-trunk-test (in module portals-pluto-trunk) failed
To whom it may engage...
        
This is an automated request, but not an unsolicited one. For 
more information please visit http://gump.apache.org/nagged.html, 
and/or contact the folk at general@gump.apache.org.

Project portals-pluto-trunk-test has an issue affecting its community integration.
This issue affects 1 projects,
 and has been outstanding for 14 runs.
The current state of this project is 'Failed', with reason 'Build Failed'.
For reference only, the following projects are affected by this:
    - portals-pluto-trunk-test :  JSR168 Container


Full details are available at:
    http://vmgump.apache.org/gump/public/portals-pluto-trunk/portals-pluto-trunk-test/index.html

That said, some information snippets are provided here.

The following annotations (debug/informational/warning/error messages) were provided:
 -WARNING- Overriding Maven2 settings: [/srv/gump/public/workspace/portals-pluto-trunk/gump_mvn_settings.xml]
 -DEBUG- (Gump generated) Maven2 Settings in: /srv/gump/public/workspace/portals-pluto-trunk/gump_mvn_settings.xml
 -INFO- Failed with reason build failed
 -DEBUG- Maven POM in: /srv/gump/public/workspace/portals-pluto-trunk/pom.xml



The following work was performed:
http://vmgump.apache.org/gump/public/portals-pluto-trunk/portals-pluto-trunk-test/gump_work/build_portals-pluto-trunk_portals-pluto-trunk-test.html
Work Name: build_portals-pluto-trunk_portals-pluto-trunk-test (Type: Build)
Work ended in a state of : Failed
Elapsed: 25 secs
Command Line: mvn --batch-mode --settings /srv/gump/public/workspace/portals-pluto-trunk/gump_mvn_settings.xml package 
[Working Directory: /srv/gump/public/workspace/portals-pluto-trunk]
---------------------------------------------
[ERROR] FATAL ERROR
[INFO] ------------------------------------------------------------------------
[INFO] org/xmlpull/v1/XmlPullParserFactory
org.xmlpull.v1.XmlPullParserFactory
[INFO] ------------------------------------------------------------------------
[INFO] Trace
java.lang.NoClassDefFoundError: org/xmlpull/v1/XmlPullParserFactory
	at com.thoughtworks.xstream.io.xml.XppDriver.createParser(XppDriver.java:57)
	at com.thoughtworks.xstream.io.xml.AbstractXppDriver.createReader(AbstractXppDriver.java:56)
	at com.thoughtworks.xstream.XStream.fromXML(XStream.java:876)
	at org.apache.maven.plugin.war.util.WebappStructureSerializer.fromXml(WebappStructureSerializer.java:73)
	at org.apache.maven.plugin.war.AbstractWarMojo.buildWebapp(AbstractWarMojo.java:423)
	at org.apache.maven.plugin.war.AbstractWarMojo.buildExplodedWebapp(AbstractWarMojo.java:394)
	at org.apache.maven.plugin.war.WarMojo.performPackaging(WarMojo.java:195)
	at org.apache.maven.plugin.war.WarMojo.execute(WarMojo.java:157)
	at org.apache.maven.plugin.DefaultPluginManager.executeMojo(DefaultPluginManager.java:490)
	at org.apache.maven.lifecycle.DefaultLifecycleExecutor.executeGoals(DefaultLifecycleExecutor.java:694)
	at org.apache.maven.lifecycle.DefaultLifecycleExecutor.executeGoalWithLifecycle(DefaultLifecycleExecutor.java:556)
	at org.apache.maven.lifecycle.DefaultLifecycleExecutor.executeGoal(DefaultLifecycleExecutor.java:535)
	at org.apache.maven.lifecycle.DefaultLifecycleExecutor.executeGoalAndHandleFailures(DefaultLifecycleExecutor.java:387)
	at org.apache.maven.lifecycle.DefaultLifecycleExecutor.executeTaskSegments(DefaultLifecycleExecutor.java:348)
	at org.apache.maven.lifecycle.DefaultLifecycleExecutor.execute(DefaultLifecycleExecutor.java:180)
	at org.apache.maven.DefaultMaven.doExecute(DefaultMaven.java:328)
	at org.apache.maven.DefaultMaven.execute(DefaultMaven.java:138)
	at org.apache.maven.cli.MavenCli.main(MavenCli.java:362)
	at org.apache.maven.cli.compat.CompatibleMain.main(CompatibleMain.java:60)
	at sun.reflect.NativeMethodAccessorImpl.invoke0(Native Method)
	at sun.reflect.NativeMethodAccessorImpl.invoke(NativeMethodAccessorImpl.java:39)
	at sun.reflect.DelegatingMethodAccessorImpl.invoke(DelegatingMethodAccessorImpl.java:25)
	at java.lang.reflect.Method.invoke(Method.java:597)
	at org.codehaus.classworlds.Launcher.launchEnhanced(Launcher.java:315)
	at org.codehaus.classworlds.Launcher.launch(Launcher.java:255)
	at org.codehaus.classworlds.Launcher.mainWithExitCode(Launcher.java:430)
	at org.codehaus.classworlds.Launcher.main(Launcher.java:375)
Caused by: java.lang.ClassNotFoundException: org.xmlpull.v1.XmlPullParserFactory
	at java.net.URLClassLoader$1.run(URLClassLoader.java:202)
	at java.security.AccessController.doPrivileged(Native Method)
	at java.net.URLClassLoader.findClass(URLClassLoader.java:190)
	at java.lang.ClassLoader.loadClass(ClassLoader.java:307)
	at org.codehaus.classworlds.RealmClassLoader.loadClassDirect(RealmClassLoader.java:195)
	at org.codehaus.classworlds.DefaultClassRealm.loadClass(DefaultClassRealm.java:255)
	at org.codehaus.classworlds.DefaultClassRealm.loadClass(DefaultClassRealm.java:274)
	at org.codehaus.classworlds.RealmClassLoader.loadClass(RealmClassLoader.java:214)
	at java.lang.ClassLoader.loadClass(ClassLoader.java:248)
	... 27 more
[INFO] ------------------------------------------------------------------------
[INFO] Total time: 24 seconds
[INFO] Finished at: Thu Aug 05 10:21:56 PDT 2010
[INFO] Final Memory: 27M/66M
[INFO] ------------------------------------------------------------------------
---------------------------------------------

To subscribe to this information via syndicated feeds:
- RSS: http://vmgump.apache.org/gump/public/portals-pluto-trunk/portals-pluto-trunk-test/rss.xml
- Atom: http://vmgump.apache.org/gump/public/portals-pluto-trunk/portals-pluto-trunk-test/atom.xml

============================== Gump Tracking Only ===
Produced by Gump version 2.3.
Gump Run 12000005082010, vmgump:vmgump-public:12000005082010
Gump E-mail Identifier (unique within run) #62.

*********************************************************** G U M P
[GUMP@vmgump]: Project cocoon22-reactor (in module cocoon) failed
To whom it may engage...
        
This is an automated request, but not an unsolicited one. For 
more information please visit http://gump.apache.org/nagged.html, 
and/or contact the folk at general@gump.apache.org.

Project cocoon22-reactor has an issue affecting its community integration.
This issue affects 1 projects,
 and has been outstanding for 47 runs.
The current state of this project is 'Failed', with reason 'Build Failed'.
For reference only, the following projects are affected by this:
    - cocoon22-reactor :  Java XML Framework


Full details are available at:
    http://vmgump.apache.org/gump/public/cocoon/cocoon22-reactor/index.html

That said, some information snippets are provided here.

The following annotations (debug/informational/warning/error messages) were provided:
 -INFO- Optional dependency htmlunit failed with reason build failed
 -INFO- Optional dependency cocoon22-flowscript-impl failed with reason build failed
 -DEBUG- (Gump generated) Maven2 Settings in: /srv/gump/public/workspace/cocoon/gump_mvn_settings.xml
 -INFO- Failed with reason build failed
 -DEBUG- Maven POM in: /srv/gump/public/workspace/cocoon/pom.xml



The following work was performed:
http://vmgump.apache.org/gump/public/cocoon/cocoon22-reactor/gump_work/build_cocoon_cocoon22-reactor.html
Work Name: build_cocoon_cocoon22-reactor (Type: Build)
Work ended in a state of : Failed
Elapsed: 55 secs
Command Line: mvn --batch-mode --settings /srv/gump/public/workspace/cocoon/gump_mvn_settings.xml package 
[Working Directory: /srv/gump/public/workspace/cocoon]
---------------------------------------------
8) daisy:daisy-htmlcleaner:jar:1.5-dev

  Try downloading the file manually from the project website.

  Then, install it using the command: 
      mvn install:install-file -DgroupId=daisy -DartifactId=daisy-htmlcleaner -Dversion=1.5-dev -Dpackaging=jar -Dfile=/path/to/file

  Alternatively, if you host your own repository you can deploy the file there: 
      mvn deploy:deploy-file -DgroupId=daisy -DartifactId=daisy-htmlcleaner -Dversion=1.5-dev -Dpackaging=jar -Dfile=/path/to/file -Durl=[url] -DrepositoryId=[id]

  Path to dependency: 
  	1) org.apache.cocoon:cocoon-sitemaptags2daisy-plugin:maven-plugin:1.0.0-SNAPSHOT
  	2) daisy:daisy-htmlcleaner:jar:1.5-dev

9) daisy:daisy-util:jar:1.5-dev

  Try downloading the file manually from the project website.

  Then, install it using the command: 
      mvn install:install-file -DgroupId=daisy -DartifactId=daisy-util -Dversion=1.5-dev -Dpackaging=jar -Dfile=/path/to/file

  Alternatively, if you host your own repository you can deploy the file there: 
      mvn deploy:deploy-file -DgroupId=daisy -DartifactId=daisy-util -Dversion=1.5-dev -Dpackaging=jar -Dfile=/path/to/file -Durl=[url] -DrepositoryId=[id]

  Path to dependency: 
  	1) org.apache.cocoon:cocoon-sitemaptags2daisy-plugin:maven-plugin:1.0.0-SNAPSHOT
  	2) daisy:daisy-util:jar:1.5-dev

----------
9 required artifacts are missing.

for artifact: 
  org.apache.cocoon:cocoon-sitemaptags2daisy-plugin:maven-plugin:1.0.0-SNAPSHOT

from the specified remote repositories:
  gump-central (http://localhost:8192/maven2),
  maven-snapshot (http://snapshots.maven.codehaus.org/maven2/),
  cocoondev (http://cocoondev.org/repository),
  gump-apache.snapshots (http://localhost:8192/repo/m2-snapshot-repository),
  gkossakowski-maven2 (http://people.apache.org/~gkossakowski/maven2/repository)



[INFO] ------------------------------------------------------------------------
[INFO] For more information, run Maven with the -e switch
[INFO] ------------------------------------------------------------------------
[INFO] Total time: 53 seconds
[INFO] Finished at: Thu Aug 05 10:25:54 PDT 2010
[INFO] Final Memory: 56M/135M
[INFO] ------------------------------------------------------------------------
---------------------------------------------

To subscribe to this information via syndicated feeds:
- RSS: http://vmgump.apache.org/gump/public/cocoon/cocoon22-reactor/rss.xml
- Atom: http://vmgump.apache.org/gump/public/cocoon/cocoon22-reactor/atom.xml

============================== Gump Tracking Only ===
Produced by Gump version 2.3.
Gump Run 12000005082010, vmgump:vmgump-public:12000005082010
Gump E-mail Identifier (unique within run) #63.

*********************************************************** G U M P
[GUMP@vmgump]: Module lenya success, but with warnings.
To whom it may engage...
        
This is an automated request, but not an unsolicited one. For 
more information please visit http://gump.apache.org/nagged.html, 
and/or contact the folk at general@gump.apache.org.

Module lenya contains errors.
The current state of this module is 'Success'.

Full details are available at:
    http://vmgump.apache.org/gump/public/lenya/index.html

That said, some information snippets are provided here.

The following annotations (debug/informational/warning/error messages) were provided:
 -ERROR- *** Failed to update from source control.Stale contents ***



The following work was performed:
http://vmgump.apache.org/gump/public/lenya/gump_work/update_lenya.html
Work Name: update_lenya (Type: Update)
Work ended in a state of : Failed
Elapsed: 6 secs
Command Line: svn --quiet update --non-interactive lenya 
[Working Directory: /srv/gump/public/workspace/cvs]
---------------------------------------------
svn: Failed to add directory 'lenya/externals': an unversioned directory of the same name already exists
---------------------------------------------

To subscribe to this information via syndicated feeds:
- RSS: http://vmgump.apache.org/gump/public/lenya/rss.xml
- Atom: http://vmgump.apache.org/gump/public/lenya/atom.xml

============================== Gump Tracking Only ===
Produced by Gump version 2.3.
Gump Run 12000005082010, vmgump:vmgump-public:12000005082010
Gump E-mail Identifier (unique within run) #64.

*********************************************************** G U M P
[GUMP@vmgump]: Project lenya (in module lenya) failed
To whom it may engage...
        
This is an automated request, but not an unsolicited one. For 
more information please visit http://gump.apache.org/nagged.html, 
and/or contact the folk at general@gump.apache.org.

Project lenya has an issue affecting its community integration.
This issue affects 1 projects,
 and has been outstanding for 55 runs.
The current state of this project is 'Failed', with reason 'Build Failed'.
For reference only, the following projects are affected by this:
    - lenya :  Content Management System


Full details are available at:
    http://vmgump.apache.org/gump/public/lenya/lenya/index.html

That said, some information snippets are provided here.

The following annotations (debug/informational/warning/error messages) were provided:
 -INFO- Optional dependency cocoon22-reactor failed with reason build failed
 -DEBUG- (Gump generated) Maven2 Settings in: /srv/gump/public/workspace/lenya/gump_mvn_settings.xml
 -INFO- Failed with reason build failed
 -DEBUG- Maven POM in: /srv/gump/public/workspace/lenya/pom.xml



The following work was performed:
http://vmgump.apache.org/gump/public/lenya/lenya/gump_work/build_lenya_lenya.html
Work Name: build_lenya_lenya (Type: Build)
Work ended in a state of : Failed
Elapsed: 2 mins 43 secs
Command Line: mvn --batch-mode --settings /srv/gump/public/workspace/lenya/gump_mvn_settings.xml package 
[Working Directory: /srv/gump/public/workspace/lenya]
---------------------------------------------
Downloading: http://localhost:8192/repo/m2-snapshot-repository/org/apache/cocoon/cocoon-core/2.2.1-SNAPSHOT/cocoon-core-2.2.1-SNAPSHOT-tests.jar
158K downloaded  (cocoon-core-2.2.1-SNAPSHOT-tests.jar)
Downloading: http://download.java.net/maven/1/org.apache.cocoon/jars/cocoon-sitemap-impl-1.1.0-SNAPSHOT-tests.jar
[INFO] Unable to find resource 'org.apache.cocoon:cocoon-sitemap-impl:test-jar:tests:1.1.0-SNAPSHOT' in repository java.net (http://download.java.net/maven/1)
Downloading: http://download.java.net/maven/2/org/apache/cocoon/cocoon-sitemap-impl/1.1.0-SNAPSHOT/cocoon-sitemap-impl-1.1.0-SNAPSHOT-tests.jar
[INFO] Unable to find resource 'org.apache.cocoon:cocoon-sitemap-impl:test-jar:tests:1.1.0-SNAPSHOT' in repository java.net.2 (http://download.java.net/maven/2)
Downloading: http://localhost:8192/repo/m2-snapshot-repository/org/apache/cocoon/cocoon-sitemap-impl/1.1.0-SNAPSHOT/cocoon-sitemap-impl-1.1.0-SNAPSHOT-tests.jar
24K downloaded  (cocoon-sitemap-impl-1.1.0-SNAPSHOT-tests.jar)
[INFO] ------------------------------------------------------------------------
[ERROR] BUILD ERROR
[INFO] ------------------------------------------------------------------------
[INFO] Failed to resolve artifact.

Missing:
----------
1) org.apache.cocoon:cocoon-flowscript-impl:jar:1.1.0-SNAPSHOT

  Try downloading the file manually from the project website.

  Then, install it using the command: 
      mvn install:install-file -DgroupId=org.apache.cocoon -DartifactId=cocoon-flowscript-impl -Dversion=1.1.0-SNAPSHOT -Dpackaging=jar -Dfile=/path/to/file

  Alternatively, if you host your own repository you can deploy the file there: 
      mvn deploy:deploy-file -DgroupId=org.apache.cocoon -DartifactId=cocoon-flowscript-impl -Dversion=1.1.0-SNAPSHOT -Dpackaging=jar -Dfile=/path/to/file -Durl=[url] -DrepositoryId=[id]

  Path to dependency: 
  	1) org.apache.lenya:lenya-core-api:jar:2.2.0-SNAPSHOT
  	2) org.apache.cocoon:cocoon-flowscript-impl:jar:1.1.0-SNAPSHOT

----------
1 required artifact is missing.

for artifact: 
  org.apache.lenya:lenya-core-api:jar:2.2.0-SNAPSHOT

from the specified remote repositories:
  gump-central (http://localhost:8192/maven2),
  java.net (http://download.java.net/maven/1),
  java.net.2 (http://download.java.net/maven/2),
  gump-apache.snapshots (http://localhost:8192/repo/m2-snapshot-repository)



[INFO] ------------------------------------------------------------------------
[INFO] For more information, run Maven with the -e switch
[INFO] ------------------------------------------------------------------------
[INFO] Total time: 2 minutes 42 seconds
[INFO] Finished at: Thu Aug 05 10:29:06 PDT 2010
[INFO] Final Memory: 17M/42M
[INFO] ------------------------------------------------------------------------
---------------------------------------------

To subscribe to this information via syndicated feeds:
- RSS: http://vmgump.apache.org/gump/public/lenya/lenya/rss.xml
- Atom: http://vmgump.apache.org/gump/public/lenya/lenya/atom.xml

============================== Gump Tracking Only ===
Produced by Gump version 2.3.
Gump Run 12000005082010, vmgump:vmgump-public:12000005082010
Gump E-mail Identifier (unique within run) #65.

*********************************************************** G U M P
[GUMP@vmgump]: Project apacheds-server-annotations-test (in module apacheds) failed
To whom it may engage...
        
This is an automated request, but not an unsolicited one. For 
more information please visit http://gump.apache.org/nagged.html, 
and/or contact the folk at general@gump.apache.org.

Project apacheds-server-annotations-test has an issue affecting its community integration.
This issue affects 1 projects,
 and has been outstanding for 8 runs.
The current state of this project is 'Failed', with reason 'Build Failed'.
For reference only, the following projects are affected by this:
    - apacheds-server-annotations-test :  Apache Directory Server


Full details are available at:
    http://vmgump.apache.org/gump/public/apacheds/apacheds-server-annotations-test/index.html

That said, some information snippets are provided here.

The following annotations (debug/informational/warning/error messages) were provided:
 -WARNING- Overriding Maven2 settings: [/srv/gump/public/workspace/apacheds/server-annotations/gump_mvn_settings.xml]
 -DEBUG- (Gump generated) Maven2 Settings in: /srv/gump/public/workspace/apacheds/server-annotations/gump_mvn_settings.xml
 -INFO- Failed with reason build failed
 -DEBUG- Maven POM in: /srv/gump/public/workspace/apacheds/server-annotations/pom.xml



The following work was performed:
http://vmgump.apache.org/gump/public/apacheds/apacheds-server-annotations-test/gump_work/build_apacheds_apacheds-server-annotations-test.html
Work Name: build_apacheds_apacheds-server-annotations-test (Type: Build)
Work ended in a state of : Failed
Elapsed: 48 secs
Command Line: mvn --batch-mode --settings /srv/gump/public/workspace/apacheds/server-annotations/gump_mvn_settings.xml package 
[Working Directory: /srv/gump/public/workspace/apacheds/server-annotations]
---------------------------------------------
[INFO] Setting property: classpath.resource.loader.class => 'org.codehaus.plexus.velocity.ContextClassLoaderResourceLoader'.
[INFO] Setting property: velocimacro.messages.on => 'false'.
[INFO] Setting property: resource.loader => 'classpath'.
[INFO] Setting property: resource.manager.logwhenfound => 'false'.
[INFO] [remote-resources:process {execution: default}]
Downloading: http://localhost:8192/repo/m2-snapshot-repository/org/apache/directory/server/apacheds-protocol-ldap/1.5.8-SNAPSHOT/apacheds-protocol-ldap-1.5.8-SNAPSHOT.pom
[INFO] Unable to find resource 'org.apache.directory.server:apacheds-protocol-ldap:pom:1.5.8-SNAPSHOT' in repository apache.snapshots (https://repository.apache.org/content/repositories/snapshots/)
[INFO] [resources:resources {execution: default-resources}]
[INFO] Using 'UTF-8' encoding to copy filtered resources.
[INFO] skip non existing resourceDirectory /srv/gump/public/workspace/apacheds/server-annotations/src/main/resources
[INFO] Copying 3 resources
[INFO] [compiler:compile {execution: default-compile}]
[INFO] Nothing to compile - all classes are up to date
[INFO] [resources:testResources {execution: default-testResources}]
[INFO] Using 'UTF-8' encoding to copy filtered resources.
[INFO] Copying 1 resource
[INFO] Copying 3 resources
[INFO] [compiler:testCompile {execution: default-testCompile}]
[INFO] Nothing to compile - all classes are up to date
[INFO] [surefire:test {execution: default-test}]
[INFO] Surefire report directory: /srv/gump/public/workspace/apacheds/server-annotations/target/surefire-reports

-------------------------------------------------------
 T E S T S
-------------------------------------------------------
Running org.apache.directory.server.factory.DirectoryServiceAnnotationTest
Tests run: 4, Failures: 0, Errors: 1, Skipped: 0, Time elapsed: 31.841 sec <<< FAILURE!
Running org.apache.directory.server.factory.CreateKdcServerAnnotationTest
Tests run: 1, Failures: 0, Errors: 0, Skipped: 0, Time elapsed: 3.113 sec

Results :

Tests in error: 
  testCreateLdapServer(org.apache.directory.server.factory.DirectoryServiceAnnotationTest)

Tests run: 5, Failures: 0, Errors: 1, Skipped: 0

[INFO] ------------------------------------------------------------------------
[ERROR] BUILD FAILURE
[INFO] ------------------------------------------------------------------------
[INFO] There are test failures.

Please refer to /srv/gump/public/workspace/apacheds/server-annotations/target/surefire-reports for the individual test results.
[INFO] ------------------------------------------------------------------------
[INFO] For more information, run Maven with the -e switch
[INFO] ------------------------------------------------------------------------
[INFO] Total time: 46 seconds
[INFO] Finished at: Thu Aug 05 10:36:00 PDT 2010
[INFO] Final Memory: 26M/63M
[INFO] ------------------------------------------------------------------------
---------------------------------------------

To subscribe to this information via syndicated feeds:
- RSS: http://vmgump.apache.org/gump/public/apacheds/apacheds-server-annotations-test/rss.xml
- Atom: http://vmgump.apache.org/gump/public/apacheds/apacheds-server-annotations-test/atom.xml

============================== Gump Tracking Only ===
Produced by Gump version 2.3.
Gump Run 12000005082010, vmgump:vmgump-public:12000005082010
Gump E-mail Identifier (unique within run) #66.

*********************************************************** G U M P
[GUMP@vmgump]: Project apacheds-server-integ-test (in module apacheds) failed
To whom it may engage...
        
This is an automated request, but not an unsolicited one. For 
more information please visit http://gump.apache.org/nagged.html, 
and/or contact the folk at general@gump.apache.org.

Project apacheds-server-integ-test has an issue affecting its community integration.
This issue affects 1 projects,
 and has been outstanding for 8 runs.
The current state of this project is 'Failed', with reason 'Build Failed'.
For reference only, the following projects are affected by this:
    - apacheds-server-integ-test :  Apache Directory Server


Full details are available at:
    http://vmgump.apache.org/gump/public/apacheds/apacheds-server-integ-test/index.html

That said, some information snippets are provided here.

The following annotations (debug/informational/warning/error messages) were provided:
 -WARNING- Overriding Maven2 settings: [/srv/gump/public/workspace/apacheds/server-integ/gump_mvn_settings.xml]
 -DEBUG- (Gump generated) Maven2 Settings in: /srv/gump/public/workspace/apacheds/server-integ/gump_mvn_settings.xml
 -INFO- Failed with reason build failed
 -DEBUG- Maven POM in: /srv/gump/public/workspace/apacheds/server-integ/pom.xml



The following work was performed:
http://vmgump.apache.org/gump/public/apacheds/apacheds-server-integ-test/gump_work/build_apacheds_apacheds-server-integ-test.html
Work Name: build_apacheds_apacheds-server-integ-test (Type: Build)
Work ended in a state of : Failed
Elapsed: 15 mins 14 secs
Command Line: mvn --batch-mode --settings /srv/gump/public/workspace/apacheds/server-integ/gump_mvn_settings.xml package 
[Working Directory: /srv/gump/public/workspace/apacheds/server-integ]
---------------------------------------------
[INFO] Scanning for projects...
[INFO] ------------------------------------------------------------------------
[INFO] Building ApacheDS Server Integration
[INFO]    task-segment: [package]
[INFO] ------------------------------------------------------------------------
[INFO] Setting property: classpath.resource.loader.class => 'org.codehaus.plexus.velocity.ContextClassLoaderResourceLoader'.
[INFO] Setting property: velocimacro.messages.on => 'false'.
[INFO] Setting property: resource.loader => 'classpath'.
[INFO] Setting property: resource.manager.logwhenfound => 'false'.
[INFO] [remote-resources:process {execution: default}]
Downloading: http://localhost:8192/repo/m2-snapshot-repository/org/apache/directory/server/apacheds-protocol-ldap/1.5.8-SNAPSHOT/apacheds-protocol-ldap-1.5.8-SNAPSHOT.pom
[INFO] Unable to find resource 'org.apache.directory.server:apacheds-protocol-ldap:pom:1.5.8-SNAPSHOT' in repository apache.snapshots (https://repository.apache.org/content/repositories/snapshots/)
[INFO] [resources:resources {execution: default-resources}]
[INFO] Using 'UTF-8' encoding to copy filtered resources.
[INFO] Copying 0 resource
[INFO] Copying 3 resources
[INFO] [compiler:compile {execution: default-compile}]
[INFO] Nothing to compile - all classes are up to date
[INFO] [resources:testResources {execution: default-testResources}]
[INFO] Using 'UTF-8' encoding to copy filtered resources.
[INFO] Copying 6 resources
[INFO] Copying 3 resources
[INFO] [compiler:testCompile {execution: default-testCompile}]
[INFO] Nothing to compile - all classes are up to date
[INFO] [surefire:test {execution: default-test}]
[INFO] Surefire report directory: /srv/gump/public/workspace/apacheds/server-integ/target/surefire-reports

-------------------------------------------------------
 T E S T S
-------------------------------------------------------
Running org.apache.directory.server.suites.StockServerISuite
killed.
[INFO] ------------------------------------------------------------------------
[ERROR] BUILD ERROR
[INFO] ------------------------------------------------------------------------
[INFO] Error while executing forked tests.; nested exception is org.apache.maven.surefire.booter.shade.org.codehaus.plexus.util.cli.CommandLineTimeOutException: Error while executing external command, process killed.

Process timeout out after 900 seconds
[INFO] ------------------------------------------------------------------------
[INFO] For more information, run Maven with the -e switch
[INFO] ------------------------------------------------------------------------
[INFO] Total time: 15 minutes 11 seconds
[INFO] Finished at: Thu Aug 05 11:01:10 PDT 2010
[INFO] Final Memory: 27M/65M
[INFO] ------------------------------------------------------------------------
---------------------------------------------

To subscribe to this information via syndicated feeds:
- RSS: http://vmgump.apache.org/gump/public/apacheds/apacheds-server-integ-test/rss.xml
- Atom: http://vmgump.apache.org/gump/public/apacheds/apacheds-server-integ-test/atom.xml

============================== Gump Tracking Only ===
Produced by Gump version 2.3.
Gump Run 12000005082010, vmgump:vmgump-public:12000005082010
Gump E-mail Identifier (unique within run) #67.

*********************************************************** G U M P
[GUMP@vmgump]: Project activemq-jaas (in module activemq) failed
To whom it may engage...
        
This is an automated request, but not an unsolicited one. For 
more information please visit http://gump.apache.org/nagged.html, 
and/or contact the folk at general@gump.apache.org.

Project activemq-jaas has an issue affecting its community integration.
This issue affects 3 projects,
 and has been outstanding for 8 runs.
The current state of this project is 'Failed', with reason 'Build Failed'.
For reference only, the following projects are affected by this:
    - activemq-core :  ActiveMQ :: Core
    - activemq-jaas :  ActiveMQ :: JAAS
    - activemq-jaas-test :  ActiveMQ message broker and enterprise integration patterns ...


Full details are available at:
    http://vmgump.apache.org/gump/public/activemq/activemq-jaas/index.html

That said, some information snippets are provided here.

The following annotations (debug/informational/warning/error messages) were provided:
 -DEBUG- Sole jar output [activemq-jaas-5.4-SNAPSHOT.jar] identifier set to project name
 -DEBUG- (Gump generated) Maven2 Settings in: /srv/gump/public/workspace/activemq/activemq-jaas/gump_mvn_settings.xml
 -INFO- Failed with reason build failed
 -DEBUG- Maven POM in: /srv/gump/public/workspace/activemq/activemq-jaas/pom.xml
 -INFO- Failed to extract fallback artifacts from Gump Repository



The following work was performed:
http://vmgump.apache.org/gump/public/activemq/activemq-jaas/gump_work/build_activemq_activemq-jaas.html
Work Name: build_activemq_activemq-jaas (Type: Build)
Work ended in a state of : Failed
Elapsed: 47 secs
Command Line: mvn --batch-mode -Dmaven.test.skip.exec=true --settings /srv/gump/public/workspace/activemq/activemq-jaas/gump_mvn_settings.xml install 
[Working Directory: /srv/gump/public/workspace/activemq/activemq-jaas]
---------------------------------------------
[INFO] [remote-resources:process {execution: default}]
[INFO] [resources:resources {execution: default-resources}]
[INFO] Using 'UTF-8' encoding to copy filtered resources.
[INFO] skip non existing resourceDirectory /srv/gump/public/workspace/activemq/activemq-jaas/src/main/resources
[INFO] Copying 3 resources
[INFO] [compiler:compile {execution: default-compile}]
[INFO] Compiling 11 source files to /srv/gump/public/workspace/activemq/activemq-jaas/target/classes
[INFO] [resources:testResources {execution: default-testResources}]
[INFO] Using 'UTF-8' encoding to copy filtered resources.
[INFO] Copying 4 resources
[INFO] Copying 3 resources
[INFO] [compiler:testCompile {execution: default-testCompile}]
[INFO] Compiling 7 source files to /srv/gump/public/workspace/activemq/activemq-jaas/target/test-classes
[INFO] ------------------------------------------------------------------------
[ERROR] BUILD FAILURE
[INFO] ------------------------------------------------------------------------
[INFO] Compilation failure

/srv/gump/public/workspace/activemq/activemq-jaas/src/test/java/org/apache/activemq/jaas/LDAPLoginModuleTest.java:[39,45] cannot find symbol
symbol  : class Level
location: package org.apache.directory.server.core.integ

/srv/gump/public/workspace/activemq/activemq-jaas/src/test/java/org/apache/activemq/jaas/LDAPLoginModuleTest.java:[40,57] package org.apache.directory.server.core.integ.annotations does not exist

/srv/gump/public/workspace/activemq/activemq-jaas/src/test/java/org/apache/activemq/jaas/LDAPLoginModuleTest.java:[41,57] package org.apache.directory.server.core.integ.annotations does not exist

/srv/gump/public/workspace/activemq/activemq-jaas/src/test/java/org/apache/activemq/jaas/LDAPLoginModuleTest.java:[42,40] cannot find symbol
symbol  : class SiRunner
location: package org.apache.directory.server.integ

/srv/gump/public/workspace/activemq/activemq-jaas/src/test/java/org/apache/activemq/jaas/LDAPLoginModuleTest.java:[49,1] cannot find symbol
symbol: class CleanupLevel
@CleanupLevel ( Level.CLASS )

/srv/gump/public/workspace/activemq/activemq-jaas/src/test/java/org/apache/activemq/jaas/LDAPLoginModuleTest.java:[50,1] cannot find symbol
symbol: class ApplyLdifs
@ApplyLdifs( {

/srv/gump/public/workspace/activemq/activemq-jaas/src/test/java/org/apache/activemq/jaas/LDAPLoginModuleTest.java:[48,11] cannot find symbol
symbol: class SiRunner
@RunWith ( SiRunner.class ) 


[INFO] ------------------------------------------------------------------------
[INFO] For more information, run Maven with the -e switch
[INFO] ------------------------------------------------------------------------
[INFO] Total time: 45 seconds
[INFO] Finished at: Thu Aug 05 11:01:59 PDT 2010
[INFO] Final Memory: 33M/79M
[INFO] ------------------------------------------------------------------------
---------------------------------------------

To subscribe to this information via syndicated feeds:
- RSS: http://vmgump.apache.org/gump/public/activemq/activemq-jaas/rss.xml
- Atom: http://vmgump.apache.org/gump/public/activemq/activemq-jaas/atom.xml

============================== Gump Tracking Only ===
Produced by Gump version 2.3.
Gump Run 12000005082010, vmgump:vmgump-public:12000005082010
Gump E-mail Identifier (unique within run) #68.

*********************************************************** G U M P
[GUMP@vmgump]: Project james-server-test (in module james-server) failed
To whom it may engage...
        
This is an automated request, but not an unsolicited one. For 
more information please visit http://gump.apache.org/nagged.html, 
and/or contact the folk at general@gump.apache.org.

Project james-server-test has an issue affecting its community integration.
This issue affects 1 projects,
 and has been outstanding for 22 runs.
The current state of this project is 'Failed', with reason 'Build Failed'.
For reference only, the following projects are affected by this:
    - james-server-test :  James Server


Full details are available at:
    http://vmgump.apache.org/gump/public/james-server/james-server-test/index.html

That said, some information snippets are provided here.

The following annotations (debug/informational/warning/error messages) were provided:
 -WARNING- Overriding Maven2 settings: [/srv/gump/public/workspace/james-server/gump_mvn_settings.xml]
 -DEBUG- (Gump generated) Maven2 Settings in: /srv/gump/public/workspace/james-server/gump_mvn_settings.xml
 -INFO- Failed with reason build failed
 -DEBUG- Maven POM in: /srv/gump/public/workspace/james-server/pom.xml



The following work was performed:
http://vmgump.apache.org/gump/public/james-server/james-server-test/gump_work/build_james-server_james-server-test.html
Work Name: build_james-server_james-server-test (Type: Build)
Work ended in a state of : Failed
Elapsed: 24 secs
Command Line: mvn --batch-mode --settings /srv/gump/public/workspace/james-server/gump_mvn_settings.xml test 
[Working Directory: /srv/gump/public/workspace/james-server]
---------------------------------------------
Content-Type: text/plain; charset=us-ascii
Content-Transfer-Encoding: 7bit

test bodySubject: test
MIME-Version: 1.0
Content-Type: text/plain; charset=us-ascii
Content-Transfer-Encoding: 7bit

test body@SLTests run: 16, Failures: 1, Errors: 0, Skipped: 0, Time elapsed: 3.143 sec <<< FAILURE!
Running org.apache.james.core.MimeMessageWrapperTest
Message-ID: <23910357.271281031970157.JavaMail.gump@vmgump>
MIME-Version: 1.0
Content-Type: text/plain; charset=us-ascii
Content-Transfer-Encoding: 7bit
Subject: foo
Content-Transfer-Encoding2: plain

bar
Subject: test
MIME-Version: 1.0
Content-Type: text/plain; charset=us-ascii
Content-Transfer-Encoding: 7bit

test body@SLTests run: 16, Failures: 1, Errors: 0, Skipped: 0, Time elapsed: 0.773 sec <<< FAILURE!

Results :

Failed tests: 
  testMultipartMessageChanges(org.apache.james.core.MimeMessageFromSharedStreamTest)
  testMultipartMessageChanges(org.apache.james.core.MimeMessageFromStreamTest)
  testMultipartMessageChanges(org.apache.james.core.MimeMessageTest)
  testMultipartMessageChanges(org.apache.james.core.MimeMessageFromMimeMessageTest)
  testMultipartMessageChanges(org.apache.james.core.MimeMessageCopyOnWriteProxyTest)
  testMultipartMessageChanges(org.apache.james.core.MimeMessageWrapperTest)

Tests run: 76, Failures: 6, Errors: 0, Skipped: 0

[INFO] ------------------------------------------------------------------------
[ERROR] BUILD FAILURE
[INFO] ------------------------------------------------------------------------
[INFO] There are test failures.

Please refer to /srv/gump/public/workspace/james-server/core-library/target/surefire-reports for the individual test results.
[INFO] ------------------------------------------------------------------------
[INFO] For more information, run Maven with the -e switch
[INFO] ------------------------------------------------------------------------
[INFO] Total time: 23 seconds
[INFO] Finished at: Thu Aug 05 11:12:50 PDT 2010
[INFO] Final Memory: 23M/55M
[INFO] ------------------------------------------------------------------------
---------------------------------------------

To subscribe to this information via syndicated feeds:
- RSS: http://vmgump.apache.org/gump/public/james-server/james-server-test/rss.xml
- Atom: http://vmgump.apache.org/gump/public/james-server/james-server-test/atom.xml

============================== Gump Tracking Only ===
Produced by Gump version 2.3.
Gump Run 12000005082010, vmgump:vmgump-public:12000005082010
Gump E-mail Identifier (unique within run) #69.


--
Apache Gump
http://gump.apache.org/ [Instance: vmgump]

---------------------------------------------------------------------
To unsubscribe, e-mail: general-unsubscribe@gump.apache.org
For additional commands, e-mail: general-help@gump.apache.org


Mime
View raw message