gump-general mailing list archives

Site index · List index
Message view « Date » · « Thread »
Top « Date » · « Thread »
From g...@vmgump.apache.org
Subject BATCH: All dressed up, with nowhere to go...
Date Sun, 25 Jul 2010 06:15:37 GMT
Dear Gumpmeisters,
            
The following 1 notifys should have been sent

*********************************************************** G U M P
[GUMP@vmgump]: Project jetty-client-test (in module jetty) failed
*********************************************************** G U M P
[GUMP@vmgump]: Project jetty-client-test (in module jetty) failed
To whom it may engage...
        
This is an automated request, but not an unsolicited one. For 
more information please visit http://gump.apache.org/nagged.html, 
and/or contact the folk at general@gump.apache.org.

Project jetty-client-test has an issue affecting its community integration.
This issue affects 1 projects.
The current state of this project is 'Failed', with reason 'Build Failed'.
For reference only, the following projects are affected by this:
    - jetty-client-test :  Java HTTP Servlet Server


Full details are available at:
    http://vmgump.apache.org/gump/public/jetty/jetty-client-test/index.html

That said, some information snippets are provided here.

The following annotations (debug/informational/warning/error messages) were provided:
 -WARNING- Overriding Maven2 settings: [/srv/gump/public/workspace/jetty/jetty-client/gump_mvn_settings.xml]
 -DEBUG- (Gump generated) Maven2 Settings in: /srv/gump/public/workspace/jetty/jetty-client/gump_mvn_settings.xml
 -INFO- Failed with reason build failed
 -DEBUG- Maven POM in: /srv/gump/public/workspace/jetty/jetty-client/pom.xml



The following work was performed:
http://vmgump.apache.org/gump/public/jetty/jetty-client-test/gump_work/build_jetty_jetty-client-test.html
Work Name: build_jetty_jetty-client-test (Type: Build)
Work ended in a state of : Failed
Elapsed: 1 min 39 secs
Command Line: mvn --batch-mode --settings /srv/gump/public/workspace/jetty/jetty-client/gump_mvn_settings.xml
test 
[Working Directory: /srv/gump/public/workspace/jetty/jetty-client]
---------------------------------------------
2010-07-25 02:55:37.501:INFO::jetty-7.2.0-SNAPSHOT
2010-07-25 02:55:37.505:INFO::Started SelectChannelConnector@0.0.0.0:57738
2010-07-25 02:55:37.615:INFO::jetty-7.2.0-SNAPSHOT
2010-07-25 02:55:37.618:INFO::Started SelectChannelConnector@0.0.0.0:60364
2010-07-25 02:55:37.623:WARN::/?action=throw: javax.servlet.ServletException
2010-07-25 02:55:37.733:INFO::jetty-7.2.0-SNAPSHOT
2010-07-25 02:55:37.736:INFO::Started SelectChannelConnector@0.0.0.0:38200
Tests run: 11, Failures: 0, Errors: 0, Skipped: 0, Time elapsed: 2.418 sec
Running org.eclipse.jetty.client.SslSecuredContentExchangeTest
2010-07-25 02:55:38.902:INFO::jetty-7.2.0-SNAPSHOT
2010-07-25 02:55:38.910:INFO::Started SslSelectChannelConnector@0.0.0.0:40874
2010-07-25 02:55:39.121:WARN::javax.net.ssl.SSLException: illegal change cipher spec msg,
state = 6
2010-07-25 02:55:39.246:INFO::jetty-7.2.0-SNAPSHOT
2010-07-25 02:55:39.254:INFO::Started SslSelectChannelConnector@0.0.0.0:49657
2010-07-25 02:55:39.464:INFO::jetty-7.2.0-SNAPSHOT
2010-07-25 02:55:39.474:INFO::Started SslSelectChannelConnector@0.0.0.0:44199
2010-07-25 02:55:39.633:INFO::jetty-7.2.0-SNAPSHOT
2010-07-25 02:55:39.641:INFO::Started SslSelectChannelConnector@0.0.0.0:60499
Tests run: 4, Failures: 0, Errors: 0, Skipped: 0, Time elapsed: 0.916 sec
Running org.eclipse.jetty.client.ContentExchangeTest
2010-07-25 02:55:39.817:INFO::jetty-7.2.0-SNAPSHOT
2010-07-25 02:55:39.853:INFO::Started SelectChannelConnector@0.0.0.0:41965
2010-07-25 02:55:39.983:INFO::jetty-7.2.0-SNAPSHOT
2010-07-25 02:55:39.987:INFO::Started SelectChannelConnector@0.0.0.0:53972
2010-07-25 02:55:40.103:INFO::jetty-7.2.0-SNAPSHOT
2010-07-25 02:55:40.125:INFO::Started SelectChannelConnector@0.0.0.0:40370
2010-07-25 02:55:40.267:INFO::jetty-7.2.0-SNAPSHOT
2010-07-25 02:55:40.270:INFO::Started SelectChannelConnector@0.0.0.0:42388
Tests run: 4, Failures: 0, Errors: 0, Skipped: 0, Time elapsed: 0.566 sec

Results :

Failed tests: 
  testShutdownWithExchange(org.eclipse.jetty.client.SslHttpExchangeTest)

Tests run: 148, Failures: 1, Errors: 0, Skipped: 0

[INFO] ------------------------------------------------------------------------
[ERROR] BUILD FAILURE
[INFO] ------------------------------------------------------------------------
[INFO] There are test failures.

Please refer to /srv/gump/public/workspace/jetty/jetty-client/target/surefire-reports for
the individual test results.
[INFO] ------------------------------------------------------------------------
[INFO] For more information, run Maven with the -e switch
[INFO] ------------------------------------------------------------------------
[INFO] Total time: 1 minute 37 seconds
[INFO] Finished at: Sun Jul 25 02:55:40 PDT 2010
[INFO] Final Memory: 25M/61M
[INFO] ------------------------------------------------------------------------
---------------------------------------------

To subscribe to this information via syndicated feeds:
- RSS: http://vmgump.apache.org/gump/public/jetty/jetty-client-test/rss.xml
- Atom: http://vmgump.apache.org/gump/public/jetty/jetty-client-test/atom.xml

============================== Gump Tracking Only ===
Produced by Gump version 2.3.
Gump Run 07000824072010, vmgump:vmgump-public:07000824072010
Gump E-mail Identifier (unique within run) #3.


--
Apache Gump
http://gump.apache.org/ [Instance: vmgump]

---------------------------------------------------------------------
To unsubscribe, e-mail: general-unsubscribe@gump.apache.org
For additional commands, e-mail: general-help@gump.apache.org


Mime
View raw message