gump-general mailing list archives

Site index · List index
Message view « Date » · « Thread »
Top « Date » · « Thread »
From g...@vmgump.apache.org
Subject BATCH: All dressed up, with nowhere to go...
Date Wed, 14 Jul 2010 04:51:28 GMT
Dear Gumpmeisters,
            
The following 2 notifys should have been sent

*********************************************************** G U M P
[GUMP@vmgump]: Project james-imap-test (in module james-imap) failed
[GUMP@vmgump]: Project apacheds-protocol-ldap (in module apacheds) failed
*********************************************************** G U M P
[GUMP@vmgump]: Project james-imap-test (in module james-imap) failed
To whom it may engage...
        
This is an automated request, but not an unsolicited one. For 
more information please visit http://gump.apache.org/nagged.html, 
and/or contact the folk at general@gump.apache.org.

Project james-imap-test has an issue affecting its community integration.
This issue affects 1 projects.
The current state of this project is 'Failed', with reason 'Build Failed'.
For reference only, the following projects are affected by this:
    - james-imap-test :  A library providing a flexible codec for IMAP, command proce...


Full details are available at:
    http://vmgump.apache.org/gump/public/james-imap/james-imap-test/index.html

That said, some information snippets are provided here.

The following annotations (debug/informational/warning/error messages) were provided:
 -WARNING- Overriding Maven2 settings: [/srv/gump/public/workspace/james-imap/gump_mvn_settings.xml]
 -DEBUG- (Gump generated) Maven2 Settings in: /srv/gump/public/workspace/james-imap/gump_mvn_settings.xml
 -INFO- Failed with reason build failed
 -DEBUG- Maven POM in: /srv/gump/public/workspace/james-imap/pom.xml



The following work was performed:
http://vmgump.apache.org/gump/public/james-imap/james-imap-test/gump_work/build_james-imap_james-imap-test.html
Work Name: build_james-imap_james-imap-test (Type: Build)
Work ended in a state of : Failed
Elapsed: 13 mins 10 secs
Command Line: mvn --batch-mode --settings /srv/gump/public/workspace/james-imap/gump_mvn_settings.xml
test 
[Working Directory: /srv/gump/public/workspace/james-imap]
---------------------------------------------
3324  WARN   [main] openjpa.Runtime - Supplied user parameters "[nameParam]" do not match
expected parameters "[]" for the prepared query "PreparedQuery: [SELECT mailbox FROM Mailbox
mailbox WHERE mailbox.name LIKE :nameParam] --> [SELECT t0.mailboxId, t0.lastUid, t0.name,
t0.uidValidity FROM Mailbox t0 WHERE (t0.name LIKE ? ESCAPE '\')]". 
3360  WARN   [main] openjpa.Runtime - Supplied user parameters "[nameParam]" do not match
expected parameters "[]" for the prepared query "PreparedQuery: [SELECT mailbox FROM Mailbox
mailbox WHERE mailbox.name LIKE :nameParam] --> [SELECT t0.mailboxId, t0.lastUid, t0.name,
t0.uidValidity FROM Mailbox t0 WHERE (t0.name LIKE ? ESCAPE '\')]". 
3472  WARN   [main] openjpa.Runtime - Supplied user parameters "[nameParam]" do not match
expected parameters "[]" for the prepared query "PreparedQuery: [SELECT mailbox FROM Mailbox
mailbox WHERE mailbox.name LIKE :nameParam] --> [SELECT t0.mailboxId, t0.lastUid, t0.name,
t0.uidValidity FROM Mailbox t0 WHERE (t0.name LIKE ? ESCAPE '\')]". 
3492  WARN   [main] openjpa.Runtime - Supplied user parameters "[nameParam]" do not match
expected parameters "[]" for the prepared query "PreparedQuery: [SELECT mailbox FROM Mailbox
mailbox WHERE mailbox.name LIKE :nameParam] --> [SELECT t0.mailboxId, t0.lastUid, t0.name,
t0.uidValidity FROM Mailbox t0 WHERE (t0.name LIKE ? ESCAPE '\')]". 
3599  WARN   [main] openjpa.Runtime - Supplied user parameters "[nameParam]" do not match
expected parameters "[]" for the prepared query "PreparedQuery: [SELECT mailbox FROM Mailbox
mailbox WHERE mailbox.name LIKE :nameParam] --> [SELECT t0.mailboxId, t0.lastUid, t0.name,
t0.uidValidity FROM Mailbox t0 WHERE (t0.name LIKE ? ESCAPE '\')]". 
3627  WARN   [main] openjpa.Runtime - Supplied user parameters "[nameParam]" do not match
expected parameters "[]" for the prepared query "PreparedQuery: [SELECT mailbox FROM Mailbox
mailbox WHERE mailbox.name LIKE :nameParam] --> [SELECT t0.mailboxId, t0.lastUid, t0.name,
t0.uidValidity FROM Mailbox t0 WHERE (t0.name LIKE ? ESCAPE '\')]". 
3797  WARN   [main] openjpa.Runtime - Supplied user parameters "[nameParam]" do not match
expected parameters "[]" for the prepared query "PreparedQuery: [SELECT mailbox FROM Mailbox
mailbox WHERE mailbox.name LIKE :nameParam] --> [SELECT t0.mailboxId, t0.lastUid, t0.name,
t0.uidValidity FROM Mailbox t0 WHERE (t0.name LIKE ? ESCAPE '\')]". 
3817  WARN   [main] openjpa.Runtime - Supplied user parameters "[nameParam]" do not match
expected parameters "[]" for the prepared query "PreparedQuery: [SELECT mailbox FROM Mailbox
mailbox WHERE mailbox.name LIKE :nameParam] --> [SELECT t0.mailboxId, t0.lastUid, t0.name,
t0.uidValidity FROM Mailbox t0 WHERE (t0.name LIKE ? ESCAPE '\')]". 
3968  WARN   [main] openjpa.Runtime - Supplied user parameters "[nameParam]" do not match
expected parameters "[]" for the prepared query "PreparedQuery: [SELECT mailbox FROM Mailbox
mailbox WHERE mailbox.name LIKE :nameParam] --> [SELECT t0.mailboxId, t0.lastUid, t0.name,
t0.uidValidity FROM Mailbox t0 WHERE (t0.name LIKE ? ESCAPE '\')]". 
4006  WARN   [main] openjpa.Runtime - Supplied user parameters "[nameParam]" do not match
expected parameters "[]" for the prepared query "PreparedQuery: [SELECT mailbox FROM Mailbox
mailbox WHERE mailbox.name LIKE :nameParam] --> [SELECT t0.mailboxId, t0.lastUid, t0.name,
t0.uidValidity FROM Mailbox t0 WHERE (t0.name LIKE ? ESCAPE '\')]". 
Tests run: 6, Failures: 0, Errors: 0, Skipped: 0, Time elapsed: 4.421 sec
Running org.apache.james.imap.functional.jpa.EventTest
Tests run: 3, Failures: 0, Errors: 0, Skipped: 0, Time elapsed: 5.051 sec
Running org.apache.james.imap.functional.torque.EventTest
Tests run: 3, Failures: 0, Errors: 0, Skipped: 0, Time elapsed: 15.25 sec
Running org.apache.james.imap.functional.jcr.ConcurrentSessionsTest
Tests run: 21, Failures: 0, Errors: 21, Skipped: 0, Time elapsed: 0.662 sec <<< FAILURE!
Running org.apache.james.imap.functional.inmemory.FetchHeadersTest
Tests run: 6, Failures: 0, Errors: 0, Skipped: 0, Time elapsed: 1.263 sec
Running org.apache.james.imap.functional.jcr.JCRStressTest
[Fatal Error] workspace.xml:1:1: Premature end of file.
Tests run: 2, Failures: 0, Errors: 2, Skipped: 0, Time elapsed: 0.349 sec <<< FAILURE!
Running org.apache.james.imap.functional.jcr.SearchTest
Tests run: 6, Failures: 0, Errors: 6, Skipped: 0, Time elapsed: 0.456 sec <<< FAILURE!

Results :

Tests in error: 
  testSearchAtomsUS(org.apache.james.imap.functional.jcr.SearchTest)
  testSearchAtomsITALY(org.apache.james.imap.functional.jcr.SearchTest)
  testSearchAtomsKOREA(org.apache.james.imap.functional.jcr.SearchTest)
  testSearchCombinationsUS(org.apache.james.imap.functional.jcr.SearchTest)
  testSearchCombinationsITALY(org.apache.james.imap.functional.jcr.SearchTest)
  testSearchCombinationsKOREA(org.apache.james.imap.functional.jcr.SearchTest)

Tests run: 1167, Failures: 0, Errors: 293, Skipped: 0

[INFO] ------------------------------------------------------------------------
[ERROR] BUILD FAILURE
[INFO] ------------------------------------------------------------------------
[INFO] There are test failures.

Please refer to /srv/gump/public/workspace/james-imap/deployment/target/surefire-reports for
the individual test results.
[INFO] ------------------------------------------------------------------------
[INFO] For more information, run Maven with the -e switch
[INFO] ------------------------------------------------------------------------
[INFO] Total time: 13 minutes 8 seconds
[INFO] Finished at: Wed Jul 14 02:37:51 PDT 2010
[INFO] Final Memory: 30M/55M
[INFO] ------------------------------------------------------------------------
---------------------------------------------

To subscribe to this information via syndicated feeds:
- RSS: http://vmgump.apache.org/gump/public/james-imap/james-imap-test/rss.xml
- Atom: http://vmgump.apache.org/gump/public/james-imap/james-imap-test/atom.xml

============================== Gump Tracking Only ===
Produced by Gump version 2.3.
Gump Run 20001613072010, vmgump:vmgump-public:20001613072010
Gump E-mail Identifier (unique within run) #1.

*********************************************************** G U M P
[GUMP@vmgump]: Project apacheds-protocol-ldap (in module apacheds) failed
To whom it may engage...
        
This is an automated request, but not an unsolicited one. For 
more information please visit http://gump.apache.org/nagged.html, 
and/or contact the folk at general@gump.apache.org.

Project apacheds-protocol-ldap has an issue affecting its community integration.
This issue affects 11 projects.
The current state of this project is 'Failed', with reason 'Build Failed'.
For reference only, the following projects are affected by this:
    - apacheds-all :  Apache Directory Server
    - apacheds-core-integ :  Apache Directory Server
    - apacheds-core-integ-test :  Apache Directory Server
    - apacheds-protocol-ldap :  Apache Directory Server
    - apacheds-server-annotations :  Apache Directory Server
    - apacheds-server-annotations-test :  Apache Directory Server
    - apacheds-server-integ :  Apache Directory Server
    - apacheds-server-integ-test :  Apache Directory Server
    - apacheds-server-jndi :  Apache Directory Server
    - apacheds-server-tools :  Apache Directory Server
    - apacheds-test-framework :  Apache Directory Server


Full details are available at:
    http://vmgump.apache.org/gump/public/apacheds/apacheds-protocol-ldap/index.html

That said, some information snippets are provided here.

The following annotations (debug/informational/warning/error messages) were provided:
 -DEBUG- Sole jar output [apacheds-protocol-ldap-*[0-9T].jar] identifier set to project name
 -DEBUG- (Gump generated) Maven2 Settings in: /srv/gump/public/workspace/apacheds/protocol-ldap/gump_mvn_settings.xml
 -INFO- Failed with reason build failed
 -DEBUG- Maven POM in: /srv/gump/public/workspace/apacheds/protocol-ldap/pom.xml
 -INFO- Failed to extract fallback artifacts from Gump Repository



The following work was performed:
http://vmgump.apache.org/gump/public/apacheds/apacheds-protocol-ldap/gump_work/build_apacheds_apacheds-protocol-ldap.html
Work Name: build_apacheds_apacheds-protocol-ldap (Type: Build)
Work ended in a state of : Failed
Elapsed: 3 mins 32 secs
Command Line: mvn --batch-mode --settings /srv/gump/public/workspace/apacheds/protocol-ldap/gump_mvn_settings.xml
install 
[Working Directory: /srv/gump/public/workspace/apacheds/protocol-ldap]
---------------------------------------------
location: class org.apache.directory.server.ldap.LdapServer

/srv/gump/public/workspace/apacheds/protocol-ldap/src/main/java/org/apache/directory/server/ldap/handlers/bind/ntlm/NtlmSaslServer.java:[160,66]
cannot find symbol
symbol  : method getDirectoryService()
location: class org.apache.directory.server.ldap.LdapServer

/srv/gump/public/workspace/apacheds/protocol-ldap/src/main/java/org/apache/directory/server/ldap/handlers/bind/gssapi/GssapiMechanismHandler.java:[70,66]
cannot find symbol
symbol  : method getDirectoryService()
location: class org.apache.directory.server.ldap.LdapServer

/srv/gump/public/workspace/apacheds/protocol-ldap/src/main/java/org/apache/directory/server/ldap/handlers/bind/gssapi/GssapiMechanismHandler.java:[137,16]
cannot find symbol
symbol  : class ServiceConfigurationException
location: class org.apache.directory.server.ldap.handlers.bind.gssapi.GssapiMechanismHandler

/srv/gump/public/workspace/apacheds/protocol-ldap/src/main/java/org/apache/directory/server/ldap/handlers/bind/gssapi/GssapiMechanismHandler.java:[139,85]
cannot find symbol
symbol  : method getSearchBaseDn()
location: class org.apache.directory.server.ldap.LdapServer

/srv/gump/public/workspace/apacheds/protocol-ldap/src/main/java/org/apache/directory/server/ldap/handlers/bind/gssapi/GssapiMechanismHandler.java:[140,22]
cannot find symbol
symbol  : class ServiceConfigurationException
location: class org.apache.directory.server.ldap.handlers.bind.gssapi.GssapiMechanismHandler

/srv/gump/public/workspace/apacheds/protocol-ldap/src/main/java/org/apache/directory/server/ldap/handlers/bind/gssapi/GssapiMechanismHandler.java:[145,85]
cannot find symbol
symbol  : method getSearchBaseDn()
location: class org.apache.directory.server.ldap.LdapServer

/srv/gump/public/workspace/apacheds/protocol-ldap/src/main/java/org/apache/directory/server/ldap/handlers/bind/gssapi/GssapiMechanismHandler.java:[146,22]
cannot find symbol
symbol  : class ServiceConfigurationException
location: class org.apache.directory.server.ldap.handlers.bind.gssapi.GssapiMechanismHandler

/srv/gump/public/workspace/apacheds/protocol-ldap/src/main/java/org/apache/directory/server/ldap/handlers/bind/gssapi/GssapiMechanismHandler.java:[170,45]
cannot find symbol
symbol  : method getDirectoryService()
location: class org.apache.directory.server.ldap.LdapServer

/srv/gump/public/workspace/apacheds/protocol-ldap/src/main/java/org/apache/directory/server/ldap/handlers/bind/gssapi/GssapiMechanismHandler.java:[171,93]
cannot find symbol
symbol  : method getSearchBaseDn()
location: class org.apache.directory.server.ldap.LdapServer

/srv/gump/public/workspace/apacheds/protocol-ldap/src/main/java/org/apache/directory/server/ldap/handlers/bind/SimpleMechanismHandler.java:[69,66]
cannot find symbol
symbol  : method getDirectoryService()
location: class org.apache.directory.server.ldap.LdapServer


[INFO] ------------------------------------------------------------------------
[INFO] For more information, run Maven with the -e switch
[INFO] ------------------------------------------------------------------------
[INFO] Total time: 3 minutes 30 seconds
[INFO] Finished at: Wed Jul 14 04:15:32 PDT 2010
[INFO] Final Memory: 27M/60M
[INFO] ------------------------------------------------------------------------
---------------------------------------------

To subscribe to this information via syndicated feeds:
- RSS: http://vmgump.apache.org/gump/public/apacheds/apacheds-protocol-ldap/rss.xml
- Atom: http://vmgump.apache.org/gump/public/apacheds/apacheds-protocol-ldap/atom.xml

============================== Gump Tracking Only ===
Produced by Gump version 2.3.
Gump Run 20001613072010, vmgump:vmgump-public:20001613072010
Gump E-mail Identifier (unique within run) #2.


--
Apache Gump
http://gump.apache.org/ [Instance: vmgump]

---------------------------------------------------------------------
To unsubscribe, e-mail: general-unsubscribe@gump.apache.org
For additional commands, e-mail: general-help@gump.apache.org


Mime
View raw message