gump-general mailing list archives

Site index · List index
Message view « Date » · « Thread »
Top « Date » · « Thread »
From g...@vmgump.apache.org
Subject BATCH: All dressed up, with nowhere to go...
Date Fri, 25 Jun 2010 21:28:49 GMT
Dear Gumpmeisters,
            
The following 5 notifys should have been sent

*********************************************************** G U M P
[GUMP@vmgump]: Project cocoon-sax (in module cocoon3) failed
[GUMP@vmgump]: Project muse (in module muse) failed
[GUMP@vmgump]: Project tapestry-test (in module tapestry) failed
[GUMP@vmgump]: Project cocoon22 (in module cocoon) failed
[GUMP@vmgump]: Project cocoon3-reactor (in module cocoon3) failed
*********************************************************** G U M P
[GUMP@vmgump]: Project cocoon-sax (in module cocoon3) failed
To whom it may engage...
        
This is an automated request, but not an unsolicited one. For 
more information please visit http://gump.apache.org/nagged.html, 
and/or contact the folk at general@gump.apache.org.

Project cocoon-sax has an issue affecting its community integration.
This issue affects 11 projects.
The current state of this project is 'Failed', with reason 'Build Failed'.
For reference only, the following projects are affected by this:
    - cocoon-all :  Java XML Framework
    - cocoon-controller :  Java XML Framework
    - cocoon-optional :  Java XML Framework
    - cocoon-profiling :  Java XML Framework
    - cocoon-rest :  Java XML Framework
    - cocoon-sax :  Java XML Framework
    - cocoon-servlet :  Java XML Framework
    - cocoon-sitemap :  Java XML Framework
    - cocoon-stax :  Java XML Framework
    - cocoon-stringtemplate :  Java XML Framework
    - cocoon-wicket :  Java XML Framework


Full details are available at:
    http://vmgump.apache.org/gump/public/cocoon3/cocoon-sax/index.html

That said, some information snippets are provided here.

The following annotations (debug/informational/warning/error messages) were provided:
 -DEBUG- Sole output [cocoon-sax-*[0-9T].jar] identifier set to project name
 -DEBUG- (Gump generated) Maven2 Settings in: /srv/gump/public/workspace/cocoon3/cocoon-sax/gump_mvn_settings.xml
 -INFO- Failed with reason build failed
 -DEBUG- Maven POM in: /srv/gump/public/workspace/cocoon3/cocoon-sax/pom.xml
 -INFO- Failed to extract fallback artifacts from Gump Repository



The following work was performed:
http://vmgump.apache.org/gump/public/cocoon3/cocoon-sax/gump_work/build_cocoon3_cocoon-sax.html
Work Name: build_cocoon3_cocoon-sax (Type: Build)
Work ended in a state of : Failed
Elapsed: 1 min 33 secs
Command Line: mvn --batch-mode --settings /srv/gump/public/workspace/cocoon3/cocoon-sax/gump_mvn_settings.xml
install 
[Working Directory: /srv/gump/public/workspace/cocoon3/cocoon-sax]
CLASSPATH: /usr/lib/jvm/java-6-sun/lib/tools.jar:/srv/gump/public/workspace/cocoon3/parent/pom.xml:/srv/gump/public/workspace/jakarta-bcel/target/bcel-5.3-SNAPSHOT.jar:/srv/gump/public/workspace/cocoon3/cocoon-pipeline/target/cocoon-pipeline-3.0.0-alpha-3-SNAPSHOT.jar:/srv/gump/public/workspace/apache-commons/logging/target/commons-logging-25062010.jar:/srv/gump/public/workspace/apache-commons/logging/target/commons-logging-api-25062010.jar:/srv/gump/public/workspace/apache-commons/validator/dist/commons-validator-25062010.jar:/srv/gump/public/workspace/junit/dist/junit-25062010.jar:/srv/gump/public/workspace/xml-commons/java/external/build/xml-apis-ext.jar:/srv/gump/public/workspace/xmlunit/build/java/lib/xmlunit-sumo-25062010.jar
---------------------------------------------
[INFO] Unable to find resource 'org.apache.maven.wagon:wagon-ssh:pom:1.0-alpha-6' in repository
maven2-repository.dev.java.net (http://download.java.net/maven/2/)
Downloading: http://localhost:8192/maven2/org/apache/maven/wagon/wagon-ssh/1.0-alpha-6/wagon-ssh-1.0-alpha-6.pom

Downloading: http://localhost:8192/maven/2/com/jcraft/jsch/0.1.24/jsch-0.1.24.pom
[INFO] Unable to find resource 'com.jcraft:jsch:pom:0.1.24' in repository maven2-repository.dev.java.net
(http://download.java.net/maven/2/)
Downloading: http://localhost:8192/maven2/com/jcraft/jsch/0.1.24/jsch-0.1.24.pom

[INFO] [build-helper:add-source {execution: add-source}]
[INFO] Source directory: /srv/gump/public/workspace/cocoon3/cocoon-sax/target/generated-sources/javacc
added.
[INFO] Setting property: classpath.resource.loader.class => 'org.codehaus.plexus.velocity.ContextClassLoaderResourceLoader'.
[INFO] Setting property: velocimacro.messages.on => 'false'.
[INFO] Setting property: resource.loader => 'classpath'.
[INFO] Setting property: resource.manager.logwhenfound => 'false'.
[INFO] [remote-resources:process {execution: default}]
[INFO] [resources:resources {execution: default-resources}]
[INFO] Using 'UTF-8' encoding to copy filtered resources.
[INFO] skip non existing resourceDirectory /srv/gump/public/workspace/cocoon3/cocoon-sax/src/main/resources
[INFO] Copying 3 resources
[INFO] [compiler:compile {execution: default-compile}]
[INFO] Compiling 41 source files to /srv/gump/public/workspace/cocoon3/cocoon-sax/target/classes
[INFO] [resources:testResources {execution: default-testResources}]
[INFO] Using 'UTF-8' encoding to copy filtered resources.
[INFO] Copying 14 resources
[INFO] Copying 3 resources
[INFO] [compiler:testCompile {execution: default-testCompile}]
[INFO] Compiling 9 source files to /srv/gump/public/workspace/cocoon3/cocoon-sax/target/test-classes
[INFO] [exec:exec {execution: default}]
[INFO] Exception in thread "main" java.lang.NoClassDefFoundError: java_cup/runtime/Scanner
[INFO] 	at org.apache.xalan.xsltc.compiler.XSLTC.<init>(XSLTC.java:141)
[INFO] 	at org.apache.xalan.xsltc.cmdline.Compile.main(Compile.java:70)
[INFO] Caused by: java.lang.ClassNotFoundException: java_cup.runtime.Scanner
[INFO] 	at java.net.URLClassLoader$1.run(URLClassLoader.java:200)
[INFO] 	at java.security.AccessController.doPrivileged(Native Method)
[INFO] 	at java.net.URLClassLoader.findClass(URLClassLoader.java:188)
[INFO] 	at java.lang.ClassLoader.loadClass(ClassLoader.java:306)
[INFO] 	at sun.misc.Launcher$AppClassLoader.loadClass(Launcher.java:276)
[INFO] 	at java.lang.ClassLoader.loadClass(ClassLoader.java:251)
[INFO] 	at java.lang.ClassLoader.loadClassInternal(ClassLoader.java:319)
[INFO] 	... 2 more
[INFO] ------------------------------------------------------------------------
[ERROR] BUILD ERROR
[INFO] ------------------------------------------------------------------------
[INFO] Result of /bin/sh -c cd /srv/gump/public/workspace/cocoon3/cocoon-sax && java
-classpath /srv/gump/public/workspace/cocoon3/cocoon-sax/target/test-classes:/srv/gump/public/workspace/cocoon3/cocoon-sax/target/classes:/srv/gump/public/workspace/mvnlocalrepo/cocoon3/org/apache/cocoon/pipeline/cocoon-pipeline/3.0.0-alpha-3-SNAPSHOT/cocoon-pipeline-3.0.0-alpha-3-SNAPSHOT.jar:/srv/gump/public/workspace/mvnlocalrepo/cocoon3/commons-logging/commons-logging/1.1.1/commons-logging-1.1.1.jar:/srv/gump/public/workspace/mvnlocalrepo/cocoon3/org/apache/cocoon/cocoon-xml/2.0.2/cocoon-xml-2.0.2.jar:/srv/gump/public/workspace/mvnlocalrepo/cocoon3/junit/junit/4.4/junit-4.4.jar:/srv/gump/public/workspace/mvnlocalrepo/cocoon3/xmlunit/xmlunit/1.3/xmlunit-1.3.jar:/srv/gump/public/workspace/mvnlocalrepo/cocoon3/xerces/xercesImpl/2.9.1/xercesImpl-2.9.1.jar:/srv/gump/public/workspace/mvnlocalrepo/cocoon3/xml-apis/xml-apis/1.3.02/xml-apis-1.3.02.jar:/srv/gump/public/workspace/mvnlocalrepo/cocoon
 3/xalan/xalan/2.7.1/xalan-2.7.1.jar:/srv/gump/public/workspace/mvnlocalrepo/cocoon3/xalan/serializer/2.7.1/serializer-2.7.1.jar:/srv/gump/public/workspace/mvnlocalrepo/cocoon3/org/apache/bcel/bcel/5.2/bcel-5.2.jar:/srv/gump/public/workspace/mvnlocalrepo/cocoon3/jakarta-regexp/jakarta-regexp/1.4/jakarta-regexp-1.4.jar
org.apache.xalan.xsltc.cmdline.Compile -d target/test-classes -p org.apache.cocoon.sax -o
CompiledXslt src/test/resources/test.xslt execution is: '1'.
[INFO] ------------------------------------------------------------------------
[INFO] For more information, run Maven with the -e switch
[INFO] ------------------------------------------------------------------------
[INFO] Total time: 1 minute 31 seconds
[INFO] Finished at: Fri Jun 25 12:16:04 PDT 2010
[INFO] Final Memory: 32M/57M
[INFO] ------------------------------------------------------------------------
---------------------------------------------

To subscribe to this information via syndicated feeds:
- RSS: http://vmgump.apache.org/gump/public/cocoon3/cocoon-sax/rss.xml
- Atom: http://vmgump.apache.org/gump/public/cocoon3/cocoon-sax/atom.xml

============================== Gump Tracking Only ===
Produced by Gump version 2.3.
Gump Run 11000825062010, vmgump:vmgump-public:11000825062010
Gump E-mail Identifier (unique within run) #1.

*********************************************************** G U M P
[GUMP@vmgump]: Project muse (in module muse) failed
To whom it may engage...
        
This is an automated request, but not an unsolicited one. For 
more information please visit http://gump.apache.org/nagged.html, 
and/or contact the folk at general@gump.apache.org.

Project muse has an issue affecting its community integration.
This issue affects 1 projects.
The current state of this project is 'Failed', with reason 'Build Failed'.
For reference only, the following projects are affected by this:
    - muse :  Java-based implementation of the WS-ResourceFramework
  (WSR...


Full details are available at:
    http://vmgump.apache.org/gump/public/muse/muse/index.html

That said, some information snippets are provided here.

The following annotations (debug/informational/warning/error messages) were provided:
 -DEBUG- Sole output [muse-25062010.jar] identifier set to project name
 -DEBUG- Dependency on commonj exists, no need to add for property maven.jar.commonj-twm-api.
 -DEBUG- Dependency on xml-xmlbeans-v1 exists, no need to add for property maven.jar.xmlbeans-jsr173-api.
 -DEBUG- Dependency on velocity-engine exists, no need to add for property maven.jar.velocity.
 -DEBUG- (Gump generated) Maven Properties in: /srv/gump/public/workspace/muse/build.properties
 -INFO- Failed with reason build failed
 -INFO- Failed to extract fallback artifacts from Gump Repository



The following work was performed:
http://vmgump.apache.org/gump/public/muse/muse/gump_work/build_muse_muse.html
Work Name: build_muse_muse (Type: Build)
Work ended in a state of : Failed
Elapsed: 4 secs
Command Line: maven --offline jar 
[Working Directory: /srv/gump/public/workspace/muse]
CLASSPATH: /usr/lib/jvm/java-6-sun/lib/tools.jar:/srv/gump/public/workspace/muse/target/classes:/srv/gump/public/workspace/ws-addressing/target/addressing-25062010.jar:/srv/gump/public/workspace/ant/dist/lib/ant-jmf.jar:/srv/gump/public/workspace/ant/dist/lib/ant-swing.jar:/srv/gump/public/workspace/ant/dist/lib/ant-apache-resolver.jar:/srv/gump/public/workspace/ant/dist/lib/ant-apache-xalan2.jar:/srv/gump/public/workspace/ant/dist/lib/ant-junit.jar:/srv/gump/public/workspace/ant/dist/lib/ant-launcher.jar:/srv/gump/public/workspace/ant/dist/lib/ant.jar:/srv/gump/packages/commonj/commonj-twm.jar:/srv/gump/public/workspace/apache-commons/cli/target/commons-cli-25062010.jar:/srv/gump/public/workspace/apache-commons/discovery/dist/commons-discovery.jar:/srv/gump/public/workspace/apache-commons/digester/dist/commons-digester.jar:/srv/gump/public/workspace/httpcomponents/oac.hc3x/dist/commons-httpclient.jar:/srv/gump/public/workspace/apache-commons/io/target/commons-io-2.0-SNAPSHOT
 .jar:/srv/gump/public/workspace/apache-commons/lang/target/commons-lang-3.0-SNAPSHOT.jar:/srv/gump/public/workspace/apache-commons/logging/target/commons-logging-25062010.jar:/srv/gump/public/workspace/apache-commons/logging/target/commons-logging-api-25062010.jar:/srv/gump/packages/dougLea/concurrent.jar:/srv/gump/public/workspace/jakarta-servletapi/dist/lib/servlet.jar:/srv/gump/public/workspace/jaxen/target/jaxen-25062010.jar:/srv/gump/public/workspace/velocity-engine/bin/velocity-25062010.jar:/srv/gump/public/workspace/ws-axis/build/lib/axis.jar:/srv/gump/public/workspace/ws-axis/build/lib/saaj.jar:/srv/gump/public/workspace/ws-axis/build/lib/axis-ant.jar:/srv/gump/public/workspace/ws-axis/build/lib/jaxrpc.jar:/srv/gump/public/workspace/wsdl4j/build/lib/qname.jar:/srv/gump/public/workspace/wsdl4j/build/lib/wsdl4j.jar:/srv/gump/public/workspace/xml-xmlbeans/build/lib/xbean_xpath.jar:/srv/gump/public/workspace/xml-xmlbeans/build/lib/xmlpublic.jar:/srv/gump/public/workspace
 /xml-xmlbeans/build/lib/xbean.jar
---------------------------------------------
 __  __
|  \/  |__ _Apache__ ___
| |\/| / _` \ V / -_) ' \  ~ intelligent projects ~
|_|  |_\__,_|\_/\___|_||_|  v. 1.0.2

build:start:

java:prepare-filesystem:
    [mkdir] Created dir: /srv/gump/public/workspace/muse/target/classes

java:compile:
    [echo] Compiling to /srv/gump/public/workspace/muse/target/classes
    [echo] No java source files to compile.
resources or todir was null

java:jar-resources:

test:prepare-filesystem:
    [mkdir] Created dir: /srv/gump/public/workspace/muse/target/test-classes
    [mkdir] Created dir: /srv/gump/public/workspace/muse/target/test-reports

test:test-resources:

test:compile:
    [echo] No test source files to compile.

test:test:
    [echo] No tests to run.

BUILD FAILED
File...... /home/gump/.maven/cache/maven-jar-plugin-1.6.1/plugin.jelly
Element... ant:fail
Line...... 53
Column.... 19
You must define currentVersion in your POM.
Total time: 4 seconds
Finished at: Fri Jun 25 13:38:10 PDT 2010

---------------------------------------------

To subscribe to this information via syndicated feeds:
- RSS: http://vmgump.apache.org/gump/public/muse/muse/rss.xml
- Atom: http://vmgump.apache.org/gump/public/muse/muse/atom.xml

============================== Gump Tracking Only ===
Produced by Gump version 2.3.
Gump Run 11000825062010, vmgump:vmgump-public:11000825062010
Gump E-mail Identifier (unique within run) #2.

*********************************************************** G U M P
[GUMP@vmgump]: Project tapestry-test (in module tapestry) failed
To whom it may engage...
        
This is an automated request, but not an unsolicited one. For 
more information please visit http://gump.apache.org/nagged.html, 
and/or contact the folk at general@gump.apache.org.

Project tapestry-test has an issue affecting its community integration.
This issue affects 1 projects.
The current state of this project is 'Failed', with reason 'Build Failed'.
For reference only, the following projects are affected by this:
    - tapestry-test :  Component-based web application framework organized around i...


Full details are available at:
    http://vmgump.apache.org/gump/public/tapestry/tapestry-test/index.html

That said, some information snippets are provided here.

The following annotations (debug/informational/warning/error messages) were provided:
 -WARNING- Overriding Maven2 settings: [/srv/gump/public/workspace/tapestry/gump_mvn_settings.xml]
 -DEBUG- (Gump generated) Maven2 Settings in: /srv/gump/public/workspace/tapestry/gump_mvn_settings.xml
 -INFO- Failed with reason build failed
 -DEBUG- Maven POM in: /srv/gump/public/workspace/tapestry/pom.xml



The following work was performed:
http://vmgump.apache.org/gump/public/tapestry/tapestry-test/gump_work/build_tapestry_tapestry-test.html
Work Name: build_tapestry_tapestry-test (Type: Build)
Work ended in a state of : Failed
Elapsed: 35 secs
Command Line: mvn --batch-mode --settings /srv/gump/public/workspace/tapestry/gump_mvn_settings.xml
package 
[Working Directory: /srv/gump/public/workspace/tapestry]
CLASSPATH: /usr/lib/jvm/java-6-sun/lib/tools.jar:/srv/gump/public/workspace/tapestry/tapestry-upload/target/tapestry-upload-5.2.0-SNAPSHOT.jar:/srv/gump/public/workspace/tapestry/tapestry-beanvalidator/target/tapestry-beanvalidator-5.2.0-SNAPSHOT.jar:/srv/gump/public/workspace/tapestry/tapestry-hibernate/target/tapestry-hibernate-5.2.0-SNAPSHOT.jar:/srv/gump/public/workspace/tapestry/tapestry-component-report/target/tapestry-component-report-5.2.0-SNAPSHOT.jar:/srv/gump/public/workspace/tapestry/tapestry-test/target/tapestry-test-5.2.0-SNAPSHOT.jar:/srv/gump/public/workspace/tapestry/quickstart/target/quickstart-5.2.0-SNAPSHOT.jar:/srv/gump/public/workspace/tapestry/tapestry-func/target/tapestry-func-5.2.0-SNAPSHOT.jar:/srv/gump/public/workspace/tapestry/tapestry-ioc/target/tapestry-ioc-5.2.0-SNAPSHOT.jar:/srv/gump/public/workspace/tapestry/tapestry-core/target/tapestry-core-5.2.0-SNAPSHOT.jar:/srv/gump/public/workspace/tapestry/tapestry-annotations/target/tapestry5-annotatio
 ns-5.2.0-SNAPSHOT.jar:/srv/gump/public/workspace/tapestry/tapestry-hibernate-core/target/tapestry-hibernate-core-5.2.0-SNAPSHOT.jar:/srv/gump/public/workspace/tapestry/tapestry-spring/target/tapestry-spring-5.2.0-SNAPSHOT.jar
---------------------------------------------
	at org.apache.maven.surefire.testng.TestNGXmlTestSuite.execute(TestNGXmlTestSuite.java:92)
	at org.apache.maven.surefire.Surefire.run(Surefire.java:177)
	at org.apache.maven.surefire.booter.SurefireBooter.runSuitesInProcess(SurefireBooter.java:345)
	at org.apache.maven.surefire.booter.SurefireBooter.main(SurefireBooter.java:1009)
... Removed 26 stack frames
SKIPPED CONFIGURATION: @AfterMethod cleanupTestMethod
SKIPPED CONFIGURATION: @BeforeMethod indicateTestMethodName
SKIPPED CONFIGURATION: @AfterMethod cleanupTestMethod
SKIPPED CONFIGURATION: @AfterClass cleanup
SKIPPED CONFIGURATION: @AfterTest cleanup
SKIPPED: invalid_assertion
SKIPPED: sanity_check

===============================================
    SeleniumLauncher and SeleniumTestBase
    Tests run: 2, Failures: 0, Skips: 2
    Configuration Failures: 2, Skips: 5
===============================================


===============================================
Tapestry Test
Total tests run: 2, Failures: 0, Skips: 2
Configuration Failures: 2, Skips: 5
===============================================

[org.testng.internal.PoolService] Shutting down poolservice org.testng.internal.PoolService@54f9f1
terminated:false
Tests run: 9, Failures: 2, Errors: 0, Skipped: 7, Time elapsed: 20.433 sec <<< FAILURE!

Results :

Failed tests: 
  startup(org.apache.tapestry5.test.SeleniumLauncher)
  indicateTestMethodName(org.apache.tapestry5.test.SanityCheckTestSuite)

Tests run: 9, Failures: 2, Errors: 0, Skipped: 7

[INFO] ------------------------------------------------------------------------
[ERROR] BUILD FAILURE
[INFO] ------------------------------------------------------------------------
[INFO] There are test failures.

Please refer to /srv/gump/public/workspace/tapestry/tapestry-test/target/surefire-reports
for the individual test results.
[INFO] ------------------------------------------------------------------------
[INFO] For more information, run Maven with the -e switch
[INFO] ------------------------------------------------------------------------
[INFO] Total time: 33 seconds
[INFO] Finished at: Fri Jun 25 18:06:55 PDT 2010
[INFO] Final Memory: 18M/33M
[INFO] ------------------------------------------------------------------------
---------------------------------------------

To subscribe to this information via syndicated feeds:
- RSS: http://vmgump.apache.org/gump/public/tapestry/tapestry-test/rss.xml
- Atom: http://vmgump.apache.org/gump/public/tapestry/tapestry-test/atom.xml

============================== Gump Tracking Only ===
Produced by Gump version 2.3.
Gump Run 11000825062010, vmgump:vmgump-public:11000825062010
Gump E-mail Identifier (unique within run) #3.

*********************************************************** G U M P
[GUMP@vmgump]: Project cocoon22 (in module cocoon) failed
To whom it may engage...
        
This is an automated request, but not an unsolicited one. For 
more information please visit http://gump.apache.org/nagged.html, 
and/or contact the folk at general@gump.apache.org.

Project cocoon22 has an issue affecting its community integration.
This issue affects 1 projects.
The current state of this project is 'Failed', with reason 'Build Failed'.
For reference only, the following projects are affected by this:
    - cocoon22 :  Java XML Framework


Full details are available at:
    http://vmgump.apache.org/gump/public/cocoon/cocoon22/index.html

That said, some information snippets are provided here.

The following annotations (debug/informational/warning/error messages) were provided:
 -INFO- Optional dependency htmlunit failed with reason build failed
 -DEBUG- (Gump generated) Maven2 Settings in: /srv/gump/public/workspace/cocoon/gump_mvn_settings.xml
 -INFO- Failed with reason build failed
 -DEBUG- Maven POM in: /srv/gump/public/workspace/cocoon/pom.xml



The following work was performed:
http://vmgump.apache.org/gump/public/cocoon/cocoon22/gump_work/build_cocoon_cocoon22.html
Work Name: build_cocoon_cocoon22 (Type: Build)
Work ended in a state of : Failed
Elapsed: 32 mins 56 secs
Command Line: mvn --batch-mode --settings /srv/gump/public/workspace/cocoon/gump_mvn_settings.xml
package 
[Working Directory: /srv/gump/public/workspace/cocoon]
CLASSPATH: /usr/lib/jvm/java-6-sun/lib/tools.jar:/srv/gump/public/workspace/junit/dist/junit-25062010.jar:/srv/gump/public/workspace/apache-commons/lang/target/commons-lang-3.0-SNAPSHOT.jar:/srv/gump/public/workspace/ant/dist/lib/ant-jmf.jar:/srv/gump/public/workspace/ant/dist/lib/ant-swing.jar:/srv/gump/public/workspace/ant/dist/lib/ant-apache-resolver.jar:/srv/gump/public/workspace/ant/dist/lib/ant-apache-xalan2.jar:/srv/gump/public/workspace/ant/dist/lib/ant-junit.jar:/srv/gump/public/workspace/ant/dist/lib/ant-launcher.jar:/srv/gump/public/workspace/ant/dist/lib/ant.jar:/srv/gump/public/workspace/aopalliance/build/aopalliance.jar:/srv/gump/packages/bsh-2.0b4/bsh-commands-2.0b4.jar:/srv/gump/packages/bsh-2.0b4/bsh-classpath-2.0b4.jar:/srv/gump/packages/bsh-2.0b4/bsh-core-2.0b4.jar:/srv/gump/packages/bsh-2.0b4/bsh-bsf-2.0b4.jar:/srv/gump/packages/bsh-2.0b4/bsh-2.0b4.jar:/srv/gump/packages/bsh-2.0b4/bsh-reflect-2.0b4.jar:/srv/gump/packages/bsh-2.0b4/bsh-util-2.0b4.jar:/srv/g
 ump/public/workspace/apache-commons/beanutils/dist/commons-beanutils-25062010.jar:/srv/gump/public/workspace/apache-commons/codec/dist/commons-codec-25062010.jar:/srv/gump/public/workspace/commons-collections-3.x/target/commons-collections-3.3-SNAPSHOT.jar:/srv/gump/public/workspace/apache-commons/configuration/target/commons-configuration-1.7-SNAPSHOT.jar:/srv/gump/public/workspace/apache-commons/digester/dist/commons-digester.jar:/srv/gump/public/workspace/httpcomponents/oac.hc3x/dist/commons-httpclient.jar:/srv/gump/public/workspace/apache-commons/io/target/commons-io-2.0-SNAPSHOT.jar:/srv/gump/public/workspace/apache-commons/jexl/target/commons-jexl-2.1-SNAPSHOT.jar:/srv/gump/public/workspace/apache-commons/jxpath/dist/commons-jxpath.jar:/srv/gump/public/workspace/apache-commons/logging/target/commons-logging-25062010.jar:/srv/gump/public/workspace/apache-commons/logging/target/commons-logging-api-25062010.jar:/srv/gump/public/workspace/apache-commons/validator/dist/comm
 ons-validator-25062010.jar:/srv/gump/packages/dougLea/concurrent.jar:/srv/gump/public/workspace/dom4j/build/dom4j.jar:/srv/gump/public/workspace/excalibur/components/datasource/target/excalibur-datasource-2.2.3-SNAPSHOT.jar:/srv/gump/public/workspace/excalibur/components/pool/instrumented/target/excalibur-pool-instrumented-2.2.3-SNAPSHOT.jar:/srv/gump/public/workspace/hsqldb/lib/hsqldb.jar:/srv/gump/public/workspace/htmlunit/target/htmlunit-*[0-9T].jar:/srv/gump/public/workspace/jakarta-oro/jakarta-oro-25062010.jar:/srv/gump/public/workspace/jakarta-regexp/build/jakarta-regexp-25062010.jar:/srv/gump/public/workspace/jaxen/target/jaxen-25062010.jar:/srv/gump/public/workspace/jdom/build/jdom.jar:/srv/gump/public/workspace/jmock/build/dist/jmock-core-25062010.jar:/srv/gump/public/workspace/jmock/build/dist/jmock-cglib-25062010.jar:/srv/gump/packages/jtidy/jtidy-r938.jar:/srv/gump/public/workspace/logging-log4j-12/dist/lib/log4j-25062010.jar:/srv/gump/packages/nekohtml-0.9.5/nek
 ohtml.jar:/srv/gump/public/workspace/rhino/build/rhino_25062010/js.jar:/srv/gump/public/workspace/velocity-engine/bin/velocity-25062010.jar:/srv/gump/public/workspace/velocity-engine/bin/velocity-25062010-dep.jar:/srv/gump/public/workspace/xml-commons/java/external/build/xml-apis-ext.jar:/srv/gump/public/workspace/xml-commons/java/external/build/xml-apis.jar:/srv/gump/public/workspace/xml-batik/batik-25062010/lib/batik-util.jar:/srv/gump/public/workspace/xml-batik/batik-25062010/lib/batik-swing.jar:/srv/gump/public/workspace/xml-batik/batik-25062010/lib/batik-css.jar:/srv/gump/public/workspace/xml-batik/batik-25062010/lib/batik-bridge.jar:/srv/gump/public/workspace/xml-batik/batik-25062010/lib/batik-xml.jar:/srv/gump/public/workspace/xml-batik/batik-25062010/lib/batik-svg-dom.jar:/srv/gump/public/workspace/xml-batik/batik-25062010/lib/batik-awt-util.jar:/srv/gump/public/workspace/xml-batik/batik-25062010/lib/batik-transcoder.jar:/srv/gump/public/workspace/xml-batik/batik-250
 62010/lib/batik-gui-util.jar:/srv/gump/public/workspace/xml-batik/batik-25062010/lib/batik-dom.jar:/srv/gump/public/workspace/xml-batik/batik-25062010/lib/batik-ext.jar:/srv/gump/public/workspace/xml-batik/batik-25062010/lib/batik-script.jar:/srv/gump/public/workspace/xml-batik/batik-25062010/lib/batik-svggen.jar:/srv/gump/public/workspace/xml-batik/batik-25062010/lib/batik-parser.jar:/srv/gump/public/workspace/xml-batik/batik-25062010/lib/batik-extension.jar:/srv/gump/public/workspace/xml-batik/batik-25062010/lib/batik-gvt.jar:/srv/gump/public/workspace/xml-fop/build/fop.jar:/srv/gump/public/workspace/xml-commons/java/build/resolver.jar:/srv/gump/public/workspace/xml-xerces2/build/xercesImpl.jar:/srv/gump/public/workspace/xmlunit/build/java/lib/xmlunit-sumo-25062010.jar:/srv/gump/public/workspace/xom/build/xom-25062010.jar
---------------------------------------------
[INFO] snapshot org.apache.cocoon:cocoon-configuration-api:1.0.3-SNAPSHOT: checking for updates
from gkossakowski-maven2
Downloading: http://localhost:8192/maven2/commons-jexl/commons-jexl/1.0/commons-jexl-1.0.jar
[INFO] snapshot org.apache.cocoon:cocoon-configuration-api:1.0.3-SNAPSHOT: checking for updates
from apache.snapshots
141K downloaded  (commons-jexl-1.0.jar)
Downloading: http://people.apache.org/~gkossakowski/maven2/repository/org/apache/cocoon/cocoon-configuration-api/1.0.3-SNAPSHOT/cocoon-configuration-api-1.0.3-SNAPSHOT.jar
[INFO] Unable to find resource 'org.apache.cocoon:cocoon-configuration-api:jar:1.0.3-SNAPSHOT'
in repository gkossakowski-maven2 (http://people.apache.org/~gkossakowski/maven2/repository)
Downloading: http://localhost:8192/repo/m2-snapshot-repository/org/apache/cocoon/cocoon-configuration-api/1.0.3-SNAPSHOT/cocoon-configuration-api-1.0.3-SNAPSHOT.jar
[INFO] Unable to find resource 'org.apache.cocoon:cocoon-configuration-api:jar:1.0.3-SNAPSHOT'
in repository apache.snapshots (http://people.apache.org/repo/m2-snapshot-repository)
[INFO] ------------------------------------------------------------------------
[ERROR] BUILD ERROR
[INFO] ------------------------------------------------------------------------
[INFO] Failed to resolve artifact.

Missing:
----------
1) org.apache.cocoon:cocoon-configuration-api:jar:1.0.3-SNAPSHOT

  Try downloading the file manually from the project website.

  Then, install it using the command: 
      mvn install:install-file -DgroupId=org.apache.cocoon -DartifactId=cocoon-configuration-api
-Dversion=1.0.3-SNAPSHOT -Dpackaging=jar -Dfile=/path/to/file

  Alternatively, if you host your own repository you can deploy the file there: 
      mvn deploy:deploy-file -DgroupId=org.apache.cocoon -DartifactId=cocoon-configuration-api
-Dversion=1.0.3-SNAPSHOT -Dpackaging=jar -Dfile=/path/to/file -Durl=[url] -DrepositoryId=[id]

  Path to dependency: 
  	1) org.apache.cocoon:cocoon-expression-language-impl:jar:1.1.0-SNAPSHOT
  	2) org.apache.cocoon:cocoon-spring-configurator:jar:2.2.0-SNAPSHOT
  	3) org.apache.cocoon:cocoon-configuration-api:jar:1.0.3-SNAPSHOT

----------
1 required artifact is missing.

for artifact: 
  org.apache.cocoon:cocoon-expression-language-impl:jar:1.1.0-SNAPSHOT

from the specified remote repositories:
  gump-central (http://localhost:8192/maven2),
  gump-apache.snapshots (http://localhost:8192/repo/m2-snapshot-repository),
  gkossakowski-maven2 (http://people.apache.org/~gkossakowski/maven2/repository)



[INFO] ------------------------------------------------------------------------
[INFO] For more information, run Maven with the -e switch
[INFO] ------------------------------------------------------------------------
[INFO] Total time: 32 minutes 54 seconds
[INFO] Finished at: Fri Jun 25 19:56:13 PDT 2010
[INFO] Final Memory: 65M/159M
[INFO] ------------------------------------------------------------------------
---------------------------------------------

To subscribe to this information via syndicated feeds:
- RSS: http://vmgump.apache.org/gump/public/cocoon/cocoon22/rss.xml
- Atom: http://vmgump.apache.org/gump/public/cocoon/cocoon22/atom.xml

============================== Gump Tracking Only ===
Produced by Gump version 2.3.
Gump Run 11000825062010, vmgump:vmgump-public:11000825062010
Gump E-mail Identifier (unique within run) #4.

*********************************************************** G U M P
[GUMP@vmgump]: Project cocoon3-reactor (in module cocoon3) failed
To whom it may engage...
        
This is an automated request, but not an unsolicited one. For 
more information please visit http://gump.apache.org/nagged.html, 
and/or contact the folk at general@gump.apache.org.

Project cocoon3-reactor has an issue affecting its community integration.
This issue affects 1 projects.
The current state of this project is 'Failed', with reason 'Build Failed'.
For reference only, the following projects are affected by this:
    - cocoon3-reactor :  Java XML Framework


Full details are available at:
    http://vmgump.apache.org/gump/public/cocoon3/cocoon3-reactor/index.html

That said, some information snippets are provided here.

The following annotations (debug/informational/warning/error messages) were provided:
 -INFO- Optional dependency cocoon-all prerequisite failed with reason build failed
 -DEBUG- (Gump generated) Maven2 Settings in: /srv/gump/public/workspace/cocoon3/gump_mvn_settings.xml
 -INFO- Failed with reason build failed
 -DEBUG- Maven POM in: /srv/gump/public/workspace/cocoon3/pom.xml



The following work was performed:
http://vmgump.apache.org/gump/public/cocoon3/cocoon3-reactor/gump_work/build_cocoon3_cocoon3-reactor.html
Work Name: build_cocoon3_cocoon3-reactor (Type: Build)
Work ended in a state of : Failed
Elapsed: 50 secs
Command Line: mvn --batch-mode --settings /srv/gump/public/workspace/cocoon3/gump_mvn_settings.xml
package 
[Working Directory: /srv/gump/public/workspace/cocoon3]
CLASSPATH: /usr/lib/jvm/java-6-sun/lib/tools.jar:/srv/gump/public/workspace/cocoon3/cocoon-all/target/cocoon-all-*[0-9T].jar
---------------------------------------------
[WARNING] Removing: jar from forked lifecycle, to prevent recursive invocation.
[INFO] [enforcer:enforce {execution: enforce-maven}]
[INFO] [source:jar {execution: attach-sources}]
[INFO] Building jar: /srv/gump/public/workspace/cocoon3/cocoon-pipeline/target/cocoon-pipeline-3.0.0-alpha-3-SNAPSHOT-sources.jar
[INFO] ------------------------------------------------------------------------
[INFO] Building Apache Cocoon 3: SAX
[INFO]    task-segment: [package]
[INFO] ------------------------------------------------------------------------
[INFO] [enforcer:enforce {execution: enforce-maven}]
[INFO] [javacc:javacc {execution: javacc}]
[INFO] Skipping - all parsers are up to date
[INFO] [build-helper:add-source {execution: add-source}]
[INFO] Source directory: /srv/gump/public/workspace/cocoon3/cocoon-sax/target/generated-sources/javacc
added.
[INFO] [remote-resources:process {execution: default}]
[INFO] [resources:resources {execution: default-resources}]
[INFO] Using 'UTF-8' encoding to copy filtered resources.
[INFO] skip non existing resourceDirectory /srv/gump/public/workspace/cocoon3/cocoon-sax/src/main/resources
[INFO] Copying 3 resources
[INFO] [compiler:compile {execution: default-compile}]
[INFO] Nothing to compile - all classes are up to date
[INFO] [resources:testResources {execution: default-testResources}]
[INFO] Using 'UTF-8' encoding to copy filtered resources.
[INFO] Copying 14 resources
[INFO] Copying 3 resources
[INFO] [compiler:testCompile {execution: default-testCompile}]
[INFO] Nothing to compile - all classes are up to date
[INFO] [exec:exec {execution: default}]
[INFO] Exception in thread "main" java.lang.NoClassDefFoundError: java_cup/runtime/Scanner
[INFO] 	at org.apache.xalan.xsltc.compiler.XSLTC.<init>(XSLTC.java:141)
[INFO] 	at org.apache.xalan.xsltc.cmdline.Compile.main(Compile.java:70)
[INFO] Caused by: java.lang.ClassNotFoundException: java_cup.runtime.Scanner
[INFO] 	at java.net.URLClassLoader$1.run(URLClassLoader.java:200)
[INFO] 	at java.security.AccessController.doPrivileged(Native Method)
[INFO] 	at java.net.URLClassLoader.findClass(URLClassLoader.java:188)
[INFO] 	at java.lang.ClassLoader.loadClass(ClassLoader.java:306)
[INFO] 	at sun.misc.Launcher$AppClassLoader.loadClass(Launcher.java:276)
[INFO] 	at java.lang.ClassLoader.loadClass(ClassLoader.java:251)
[INFO] 	at java.lang.ClassLoader.loadClassInternal(ClassLoader.java:319)
[INFO] 	... 2 more
[INFO] ------------------------------------------------------------------------
[ERROR] BUILD ERROR
[INFO] ------------------------------------------------------------------------
[INFO] Result of /bin/sh -c cd /srv/gump/public/workspace/cocoon3/cocoon-sax && java
-classpath /srv/gump/public/workspace/cocoon3/cocoon-sax/target/test-classes:/srv/gump/public/workspace/cocoon3/cocoon-sax/target/classes:/srv/gump/public/workspace/cocoon3/cocoon-pipeline/target/cocoon-pipeline-3.0.0-alpha-3-SNAPSHOT.jar:/srv/gump/public/workspace/mvnlocalrepo/cocoon3/commons-logging/commons-logging/1.1.1/commons-logging-1.1.1.jar:/srv/gump/public/workspace/mvnlocalrepo/cocoon3/org/apache/cocoon/cocoon-xml/2.0.2/cocoon-xml-2.0.2.jar:/srv/gump/public/workspace/mvnlocalrepo/cocoon3/junit/junit/4.4/junit-4.4.jar:/srv/gump/public/workspace/mvnlocalrepo/cocoon3/xmlunit/xmlunit/1.3/xmlunit-1.3.jar:/srv/gump/public/workspace/mvnlocalrepo/cocoon3/xerces/xercesImpl/2.9.1/xercesImpl-2.9.1.jar:/srv/gump/public/workspace/mvnlocalrepo/cocoon3/xml-apis/xml-apis/1.3.02/xml-apis-1.3.02.jar:/srv/gump/public/workspace/mvnlocalrepo/cocoon3/xalan/xalan/2.7.1/xalan-2.7.1.jar:/srv/gump/public/wor
 kspace/mvnlocalrepo/cocoon3/xalan/serializer/2.7.1/serializer-2.7.1.jar:/srv/gump/public/workspace/mvnlocalrepo/cocoon3/org/apache/bcel/bcel/5.2/bcel-5.2.jar:/srv/gump/public/workspace/mvnlocalrepo/cocoon3/jakarta-regexp/jakarta-regexp/1.4/jakarta-regexp-1.4.jar
org.apache.xalan.xsltc.cmdline.Compile -d target/test-classes -p org.apache.cocoon.sax -o
CompiledXslt src/test/resources/test.xslt execution is: '1'.
[INFO] ------------------------------------------------------------------------
[INFO] For more information, run Maven with the -e switch
[INFO] ------------------------------------------------------------------------
[INFO] Total time: 48 seconds
[INFO] Finished at: Fri Jun 25 20:17:14 PDT 2010
[INFO] Final Memory: 32M/58M
[INFO] ------------------------------------------------------------------------
---------------------------------------------

To subscribe to this information via syndicated feeds:
- RSS: http://vmgump.apache.org/gump/public/cocoon3/cocoon3-reactor/rss.xml
- Atom: http://vmgump.apache.org/gump/public/cocoon3/cocoon3-reactor/atom.xml

============================== Gump Tracking Only ===
Produced by Gump version 2.3.
Gump Run 11000825062010, vmgump:vmgump-public:11000825062010
Gump E-mail Identifier (unique within run) #5.


--
Apache Gump
http://gump.apache.org/ [Instance: vmgump]

---------------------------------------------------------------------
To unsubscribe, e-mail: general-unsubscribe@gump.apache.org
For additional commands, e-mail: general-help@gump.apache.org


Mime
View raw message