gump-general mailing list archives

Site index · List index
Message view « Date » · « Thread »
Top « Date » · « Thread »
From g...@vmgump.apache.org
Subject BATCH: All dressed up, with nowhere to go...
Date Fri, 18 Jun 2010 03:06:46 GMT
Dear Gumpmeisters,
            
The following 3 notifys should have been sent

*********************************************************** G U M P
[GUMP@vmgump]: Project camel-core-test (in module camel) failed
[GUMP@vmgump]: Project apacheds-all (in module apacheds) failed
[GUMP@vmgump]: Project apacheds-server-integ-test (in module apacheds) failed
*********************************************************** G U M P
[GUMP@vmgump]: Project camel-core-test (in module camel) failed
To whom it may engage...
        
This is an automated request, but not an unsolicited one. For 
more information please visit http://gump.apache.org/nagged.html, 
and/or contact the folk at general@gump.apache.org.

Project camel-core-test has an issue affecting its community integration.
This issue affects 1 projects.
The current state of this project is 'Failed', with reason 'Build Failed'.
For reference only, the following projects are affected by this:
    - camel-core-test :  Integration framework based on known Enterprise Integration
...


Full details are available at:
    http://vmgump.apache.org/gump/public/camel/camel-core-test/index.html

That said, some information snippets are provided here.

The following annotations (debug/informational/warning/error messages) were provided:
 -WARNING- Overriding Maven2 settings: [/srv/gump/public/workspace/camel/camel-core/gump_mvn_settings.xml]
 -DEBUG- (Gump generated) Maven2 Settings in: /srv/gump/public/workspace/camel/camel-core/gump_mvn_settings.xml
 -INFO- Failed with reason build failed
 -DEBUG- Maven POM in: /srv/gump/public/workspace/camel/camel-core/pom.xml



The following work was performed:
http://vmgump.apache.org/gump/public/camel/camel-core-test/gump_work/build_camel_camel-core-test.html
Work Name: build_camel_camel-core-test (Type: Build)
Work ended in a state of : Failed
Elapsed: 58 mins 31 secs
Command Line: mvn --batch-mode --settings /srv/gump/public/workspace/camel/camel-core/gump_mvn_settings.xml
package 
[Working Directory: /srv/gump/public/workspace/camel/camel-core]
CLASSPATH: /usr/lib/jvm/java-6-sun/lib/tools.jar:/srv/gump/public/workspace/camel/camel-core/target/camel-core-2.4-SNAPSHOT.jar
---------------------------------------------
Running org.apache.camel.impl.ShutdownGracefulNoAutoStartedRoutesTest
Tests run: 1, Failures: 0, Errors: 0, Skipped: 0, Time elapsed: 0.751 sec
Running org.apache.camel.converter.jaxp.XmlConverterTest
Tests run: 37, Failures: 0, Errors: 0, Skipped: 0, Time elapsed: 2.938 sec
Running org.apache.camel.processor.aggregator.AggregateSimplePredicateEagerTest
Tests run: 1, Failures: 0, Errors: 0, Skipped: 0, Time elapsed: 0.791 sec
Running org.apache.camel.processor.enricher.EnricherRefTest
Tests run: 1, Failures: 0, Errors: 0, Skipped: 0, Time elapsed: 1.157 sec
Running org.apache.camel.component.file.FileConsumerMoveExpressionTest
Tests run: 5, Failures: 0, Errors: 0, Skipped: 0, Time elapsed: 7.048 sec
Running org.apache.camel.converter.ObjectConverterTest
Tests run: 8, Failures: 0, Errors: 0, Skipped: 0, Time elapsed: 0.187 sec
Running org.apache.camel.impl.DefaultComponentValidateURITest
Tests run: 6, Failures: 0, Errors: 0, Skipped: 0, Time elapsed: 1.028 sec
Running org.apache.camel.component.bean.BeanParameterInfoTest
Tests run: 1, Failures: 0, Errors: 0, Skipped: 0, Time elapsed: 0.617 sec
Running org.apache.camel.component.file.FromFileMulticastToFilesTest
Tests run: 2, Failures: 0, Errors: 0, Skipped: 0, Time elapsed: 2.949 sec
Running org.apache.camel.converter.InstanceFallbackConverterTest
Tests run: 4, Failures: 0, Errors: 0, Skipped: 0, Time elapsed: 0.805 sec
Running org.apache.camel.processor.intercept.InterceptFromWhenWithChoiceTest
Tests run: 3, Failures: 0, Errors: 0, Skipped: 0, Time elapsed: 0.92 sec
Running org.apache.camel.component.file.FileConsumerMoveAndMoveFailureTest
Tests run: 1, Failures: 0, Errors: 0, Skipped: 0, Time elapsed: 1.831 sec
Running org.apache.camel.processor.OnCompletionRouteScopeOverrideGlobalScopeTest
Tests run: 2, Failures: 0, Errors: 0, Skipped: 0, Time elapsed: 0.949 sec
Running org.apache.camel.converter.ObjectHelperTest
Tests run: 9, Failures: 0, Errors: 0, Skipped: 0, Time elapsed: 0.232 sec
Running org.apache.camel.component.vm.VmWaitForTaskIfReplyExpectedTest
Tests run: 2, Failures: 0, Errors: 0, Skipped: 0, Time elapsed: 0.896 sec

Results :

Tests in error: 

Tests run: 2667, Failures: 0, Errors: 1, Skipped: 0

[INFO] ------------------------------------------------------------------------
[ERROR] BUILD FAILURE
[INFO] ------------------------------------------------------------------------
[INFO] There are test failures.

Please refer to /srv/gump/public/workspace/camel/camel-core/target/surefire-reports for the
individual test results.
[INFO] ------------------------------------------------------------------------
[INFO] For more information, run Maven with the -e switch
[INFO] ------------------------------------------------------------------------
[INFO] Total time: 58 minutes 29 seconds
[INFO] Finished at: Fri Jun 18 00:14:47 PDT 2010
[INFO] Final Memory: 18M/33M
[INFO] ------------------------------------------------------------------------
---------------------------------------------

To subscribe to this information via syndicated feeds:
- RSS: http://vmgump.apache.org/gump/public/camel/camel-core-test/rss.xml
- Atom: http://vmgump.apache.org/gump/public/camel/camel-core-test/atom.xml

============================== Gump Tracking Only ===
Produced by Gump version 2.3.
Gump Run 05001617062010, vmgump:vmgump-public:05001617062010
Gump E-mail Identifier (unique within run) #1.

*********************************************************** G U M P
[GUMP@vmgump]: Project apacheds-all (in module apacheds) failed
To whom it may engage...
        
This is an automated request, but not an unsolicited one. For 
more information please visit http://gump.apache.org/nagged.html, 
and/or contact the folk at general@gump.apache.org.

Project apacheds-all has an issue affecting its community integration.
This issue affects 1 projects.
The current state of this project is 'Failed', with reason 'Build Failed'.
For reference only, the following projects are affected by this:
    - apacheds-all :  Apache Directory Server


Full details are available at:
    http://vmgump.apache.org/gump/public/apacheds/apacheds-all/index.html

That said, some information snippets are provided here.

The following annotations (debug/informational/warning/error messages) were provided:
 -DEBUG- Sole output [apacheds-all-*[0-9T].jar] identifier set to project name
 -DEBUG- (Gump generated) Maven2 Settings in: /srv/gump/public/workspace/apacheds/all/gump_mvn_settings.xml
 -INFO- Failed with reason build failed
 -DEBUG- Maven POM in: /srv/gump/public/workspace/apacheds/all/pom.xml
 -INFO- Failed to extract fallback artifacts from Gump Repository



The following work was performed:
http://vmgump.apache.org/gump/public/apacheds/apacheds-all/gump_work/build_apacheds_apacheds-all.html
Work Name: build_apacheds_apacheds-all (Type: Build)
Work ended in a state of : Failed
Elapsed: 13 secs
Command Line: mvn --batch-mode --settings /srv/gump/public/workspace/apacheds/all/gump_mvn_settings.xml
install 
[Working Directory: /srv/gump/public/workspace/apacheds/all]
CLASSPATH: /usr/lib/jvm/java-6-sun/lib/tools.jar:/srv/gump/public/workspace/apacheds/core/target/apacheds-core-1.5.8-SNAPSHOT.jar:/srv/gump/public/workspace/apacheds/core-annotations/target/apacheds-core-annotations-1.5.8-SNAPSHOT.jar:/srv/gump/public/workspace/apacheds/core-api/target/apacheds-core-api-1.5.8-SNAPSHOT.jar:/srv/gump/public/workspace/apacheds/core-avl/target/apacheds-core-avl-1.5.8-SNAPSHOT.jar:/srv/gump/public/workspace/apacheds/core-constants/target/apacheds-core-constants-1.5.8-SNAPSHOT.jar:/srv/gump/public/workspace/apacheds/core-jndi/target/apacheds-core-jndi-1.5.8-SNAPSHOT.jar:/srv/gump/public/workspace/apacheds/interceptor-kerberos/target/apacheds-interceptor-kerberos-1.5.8-SNAPSHOT.jar:/srv/gump/public/workspace/apacheds/jdbm/target/apacheds-jdbm-1.5.8-SNAPSHOT.jar:/srv/gump/public/workspace/apacheds/jdbm-partition/target/apacheds-jdbm-partition-1.5.8-SNAPSHOT.jar:/srv/gump/public/workspace/apacheds/kerberos-shared/target/apacheds-kerberos-shared-1.5.8-
 SNAPSHOT.jar:/srv/gump/public/workspace/apacheds/ldif-partition/target/apacheds-ldif-partition-1.5.8-SNAPSHOT.jar:/srv/gump/public/workspace/apacheds/pom.xml:/srv/gump/public/workspace/apacheds/protocol-changepw/target/apacheds-protocol-changepw-1.5.8-SNAPSHOT.jar:/srv/gump/public/workspace/apacheds/protocol-dhcp/target/apacheds-protocol-dhcp-1.5.8-SNAPSHOT.jar:/srv/gump/public/workspace/apacheds/protocol-dns/target/apacheds-protocol-dns-1.5.8-SNAPSHOT.jar:/srv/gump/public/workspace/apacheds/protocol-kerberos/target/apacheds-protocol-kerberos-1.5.8-SNAPSHOT.jar:/srv/gump/public/workspace/apacheds/protocol-ldap/target/apacheds-protocol-ldap-1.5.8-SNAPSHOT.jar:/srv/gump/public/workspace/apacheds/protocol-ntp/target/apacheds-protocol-ntp-1.5.8-SNAPSHOT.jar:/srv/gump/public/workspace/apacheds/protocol-shared/target/apacheds-protocol-shared-1.5.8-SNAPSHOT.jar:/srv/gump/public/workspace/apacheds/server-annotations/target/apacheds-server-annotations-1.5.8-SNAPSHOT.jar:/srv/gump/pub
 lic/workspace/apacheds/server-jndi/target/apacheds-server-jndi-1.5.8-SNAPSHOT.jar:/srv/gump/public/workspace/apacheds/server-replication/target/apacheds-server-replication-1.5.8-SNAPSHOT.jar:/srv/gump/public/workspace/apacheds/test-framework/target/apacheds-test-framework-1.5.8-SNAPSHOT.jar:/srv/gump/public/workspace/apacheds/xdbm-partition/target/apacheds-xdbm-partition-1.5.8-SNAPSHOT.jar:/srv/gump/public/workspace/apacheds/xdbm-tools/target/apacheds-xdbm-tools-1.5.8-SNAPSHOT.jar
---------------------------------------------
[INFO] ------------------------------------------------------------------------
[INFO] Failed to resolve dependencies for one or more projects in the reactor. Reason: Missing:
----------
1) org.apache.directory.server:apacheds-server-xml:jar:1.5.8-SNAPSHOT

  Try downloading the file manually from the project website.

  Then, install it using the command: 
      mvn install:install-file -DgroupId=org.apache.directory.server -DartifactId=apacheds-server-xml
-Dversion=1.5.8-SNAPSHOT -Dpackaging=jar -Dfile=/path/to/file

  Alternatively, if you host your own repository you can deploy the file there: 
      mvn deploy:deploy-file -DgroupId=org.apache.directory.server -DartifactId=apacheds-server-xml
-Dversion=1.5.8-SNAPSHOT -Dpackaging=jar -Dfile=/path/to/file -Durl=[url] -DrepositoryId=[id]

  Path to dependency: 
  	1) org.apache.directory.server:apacheds-all:jar:1.5.8-SNAPSHOT
  	2) org.apache.directory.server:apacheds-server-xml:jar:1.5.8-SNAPSHOT

2) org.apache.directory.server:apacheds-xbean-spring:jar:1.5.8-SNAPSHOT

  Try downloading the file manually from the project website.

  Then, install it using the command: 
      mvn install:install-file -DgroupId=org.apache.directory.server -DartifactId=apacheds-xbean-spring
-Dversion=1.5.8-SNAPSHOT -Dpackaging=jar -Dfile=/path/to/file

  Alternatively, if you host your own repository you can deploy the file there: 
      mvn deploy:deploy-file -DgroupId=org.apache.directory.server -DartifactId=apacheds-xbean-spring
-Dversion=1.5.8-SNAPSHOT -Dpackaging=jar -Dfile=/path/to/file -Durl=[url] -DrepositoryId=[id]

  Path to dependency: 
  	1) org.apache.directory.server:apacheds-all:jar:1.5.8-SNAPSHOT
  	2) org.apache.directory.server:apacheds-xbean-spring:jar:1.5.8-SNAPSHOT

----------
2 required artifacts are missing.

for artifact: 
  org.apache.directory.server:apacheds-all:jar:1.5.8-SNAPSHOT

from the specified remote repositories:
  gump-central (http://localhost:8192/maven2),
  gump-apache.snapshots (http://localhost:8192/repo/m2-snapshot-repository)



[INFO] ------------------------------------------------------------------------
[INFO] For more information, run Maven with the -e switch
[INFO] ------------------------------------------------------------------------
[INFO] Total time: 12 seconds
[INFO] Finished at: Fri Jun 18 02:37:23 PDT 2010
[INFO] Final Memory: 29M/52M
[INFO] ------------------------------------------------------------------------
---------------------------------------------

To subscribe to this information via syndicated feeds:
- RSS: http://vmgump.apache.org/gump/public/apacheds/apacheds-all/rss.xml
- Atom: http://vmgump.apache.org/gump/public/apacheds/apacheds-all/atom.xml

============================== Gump Tracking Only ===
Produced by Gump version 2.3.
Gump Run 05001617062010, vmgump:vmgump-public:05001617062010
Gump E-mail Identifier (unique within run) #2.

*********************************************************** G U M P
[GUMP@vmgump]: Project apacheds-server-integ-test (in module apacheds) failed
To whom it may engage...
        
This is an automated request, but not an unsolicited one. For 
more information please visit http://gump.apache.org/nagged.html, 
and/or contact the folk at general@gump.apache.org.

Project apacheds-server-integ-test has an issue affecting its community integration.
This issue affects 1 projects.
The current state of this project is 'Failed', with reason 'Build Failed'.
For reference only, the following projects are affected by this:
    - apacheds-server-integ-test :  Apache Directory Server


Full details are available at:
    http://vmgump.apache.org/gump/public/apacheds/apacheds-server-integ-test/index.html

That said, some information snippets are provided here.

The following annotations (debug/informational/warning/error messages) were provided:
 -WARNING- Overriding Maven2 settings: [/srv/gump/public/workspace/apacheds/server-integ/gump_mvn_settings.xml]
 -DEBUG- (Gump generated) Maven2 Settings in: /srv/gump/public/workspace/apacheds/server-integ/gump_mvn_settings.xml
 -INFO- Failed with reason build failed
 -DEBUG- Maven POM in: /srv/gump/public/workspace/apacheds/server-integ/pom.xml



The following work was performed:
http://vmgump.apache.org/gump/public/apacheds/apacheds-server-integ-test/gump_work/build_apacheds_apacheds-server-integ-test.html
Work Name: build_apacheds_apacheds-server-integ-test (Type: Build)
Work ended in a state of : Failed
Elapsed: 2 mins 58 secs
Command Line: mvn --batch-mode --settings /srv/gump/public/workspace/apacheds/server-integ/gump_mvn_settings.xml
package 
[Working Directory: /srv/gump/public/workspace/apacheds/server-integ]
CLASSPATH: /usr/lib/jvm/java-6-sun/lib/tools.jar:/srv/gump/public/workspace/apacheds/server-integ/target/apacheds-server-integ-1.5.8-SNAPSHOT.jar
---------------------------------------------
[INFO] [remote-resources:process {execution: default}]
[INFO] [resources:resources {execution: default-resources}]
[INFO] Using 'UTF-8' encoding to copy filtered resources.
[INFO] Copying 0 resource
[INFO] Copying 3 resources
[INFO] [compiler:compile {execution: default-compile}]
[INFO] Nothing to compile - all classes are up to date
[INFO] [resources:testResources {execution: default-testResources}]
[INFO] Using 'UTF-8' encoding to copy filtered resources.
[INFO] Copying 6 resources
[INFO] Copying 3 resources
[INFO] [compiler:testCompile {execution: default-testCompile}]
[INFO] Nothing to compile - all classes are up to date
[INFO] [surefire:test {execution: default-test}]
[INFO] Surefire report directory: /srv/gump/public/workspace/apacheds/server-integ/target/surefire-reports

-------------------------------------------------------
 T E S T S
-------------------------------------------------------
Running org.apache.directory.server.suites.StockServerISuite
Using partition factory JdbmPartitionFactory
Tests run: 292, Failures: 1, Errors: 5, Skipped: 1, Time elapsed: 165.09 sec <<<
FAILURE!

Results :

Failed tests: 
  testAddPDUExceedingMaxSize(org.apache.directory.server.operations.add.AddIT)

Tests in error: 
  testModifyDerivedKeys(org.apache.directory.server.kerberos.KeyDerivationServiceIT)
  testExecuteProcedureWithReturnValue(org.apache.directory.server.operations.extended.StoredProcedureIT)
  testExecuteProcedureWithParametersAndReturnValue(org.apache.directory.server.operations.extended.StoredProcedureIT)
  testSubentryControl(org.apache.directory.server.operations.search.SearchIT)
  testSearchAttrC_L(org.apache.directory.server.operations.search.SearchIT)

Tests run: 292, Failures: 1, Errors: 5, Skipped: 1

[INFO] ------------------------------------------------------------------------
[ERROR] BUILD FAILURE
[INFO] ------------------------------------------------------------------------
[INFO] There are test failures.

Please refer to /srv/gump/public/workspace/apacheds/server-integ/target/surefire-reports for
the individual test results.
[INFO] ------------------------------------------------------------------------
[INFO] For more information, run Maven with the -e switch
[INFO] ------------------------------------------------------------------------
[INFO] Total time: 2 minutes 55 seconds
[INFO] Finished at: Fri Jun 18 02:49:13 PDT 2010
[INFO] Final Memory: 31M/55M
[INFO] ------------------------------------------------------------------------
---------------------------------------------

To subscribe to this information via syndicated feeds:
- RSS: http://vmgump.apache.org/gump/public/apacheds/apacheds-server-integ-test/rss.xml
- Atom: http://vmgump.apache.org/gump/public/apacheds/apacheds-server-integ-test/atom.xml

============================== Gump Tracking Only ===
Produced by Gump version 2.3.
Gump Run 05001617062010, vmgump:vmgump-public:05001617062010
Gump E-mail Identifier (unique within run) #3.


--
Apache Gump
http://gump.apache.org/ [Instance: vmgump]

---------------------------------------------------------------------
To unsubscribe, e-mail: general-unsubscribe@gump.apache.org
For additional commands, e-mail: general-help@gump.apache.org


Mime
View raw message