gump-general mailing list archives

Site index · List index
Message view « Date » · « Thread »
Top « Date » · « Thread »
From g...@vmgump.apache.org
Subject BATCH: All dressed up, with nowhere to go...
Date Wed, 16 Jun 2010 04:37:16 GMT
Dear Gumpmeisters,
            
The following 4 notifys should have been sent

*********************************************************** G U M P
[GUMP@vmgump]: Project camel-core-test (in module camel) failed
[GUMP@vmgump]: Project apacheds-all (in module apacheds) failed
[GUMP@vmgump]: Project apacheds-server-integ-test (in module apacheds) failed
[GUMP@vmgump]: Project activemq-jaas (in module activemq) failed
*********************************************************** G U M P
[GUMP@vmgump]: Project camel-core-test (in module camel) failed
To whom it may engage...
        
This is an automated request, but not an unsolicited one. For 
more information please visit http://gump.apache.org/nagged.html, 
and/or contact the folk at general@gump.apache.org.

Project camel-core-test has an issue affecting its community integration.
This issue affects 1 projects.
The current state of this project is 'Failed', with reason 'Build Failed'.
For reference only, the following projects are affected by this:
    - camel-core-test :  Integration framework based on known Enterprise Integration
...


Full details are available at:
    http://vmgump.apache.org/gump/public/camel/camel-core-test/index.html

That said, some information snippets are provided here.

The following annotations (debug/informational/warning/error messages) were provided:
 -WARNING- Overriding Maven2 settings: [/srv/gump/public/workspace/camel/camel-core/gump_mvn_settings.xml]
 -DEBUG- (Gump generated) Maven2 Settings in: /srv/gump/public/workspace/camel/camel-core/gump_mvn_settings.xml
 -INFO- Failed with reason build failed
 -DEBUG- Maven POM in: /srv/gump/public/workspace/camel/camel-core/pom.xml



The following work was performed:
http://vmgump.apache.org/gump/public/camel/camel-core-test/gump_work/build_camel_camel-core-test.html
Work Name: build_camel_camel-core-test (Type: Build)
Work ended in a state of : Failed
Elapsed: 57 mins 38 secs
Command Line: mvn --batch-mode --settings /srv/gump/public/workspace/camel/camel-core/gump_mvn_settings.xml
package 
[Working Directory: /srv/gump/public/workspace/camel/camel-core]
CLASSPATH: /usr/lib/jvm/java-6-sun/lib/tools.jar:/srv/gump/public/workspace/camel/camel-core/target/camel-core-2.4-SNAPSHOT.jar
---------------------------------------------
Running org.apache.camel.impl.ShutdownGracefulNoAutoStartedRoutesTest
Tests run: 1, Failures: 0, Errors: 0, Skipped: 0, Time elapsed: 0.728 sec
Running org.apache.camel.converter.jaxp.XmlConverterTest
Tests run: 37, Failures: 0, Errors: 0, Skipped: 0, Time elapsed: 2.522 sec
Running org.apache.camel.processor.aggregator.AggregateSimplePredicateEagerTest
Tests run: 1, Failures: 0, Errors: 0, Skipped: 0, Time elapsed: 0.761 sec
Running org.apache.camel.processor.enricher.EnricherRefTest
Tests run: 1, Failures: 0, Errors: 0, Skipped: 0, Time elapsed: 0.798 sec
Running org.apache.camel.component.file.FileConsumerMoveExpressionTest
Tests run: 5, Failures: 0, Errors: 0, Skipped: 0, Time elapsed: 7.235 sec
Running org.apache.camel.converter.ObjectConverterTest
Tests run: 8, Failures: 0, Errors: 0, Skipped: 0, Time elapsed: 0.185 sec
Running org.apache.camel.impl.DefaultComponentValidateURITest
Tests run: 6, Failures: 0, Errors: 0, Skipped: 0, Time elapsed: 1.433 sec
Running org.apache.camel.component.bean.BeanParameterInfoTest
Tests run: 1, Failures: 0, Errors: 0, Skipped: 0, Time elapsed: 0.599 sec
Running org.apache.camel.component.file.FromFileMulticastToFilesTest
Tests run: 2, Failures: 0, Errors: 0, Skipped: 0, Time elapsed: 3.06 sec
Running org.apache.camel.converter.InstanceFallbackConverterTest
Tests run: 4, Failures: 0, Errors: 0, Skipped: 0, Time elapsed: 0.82 sec
Running org.apache.camel.processor.intercept.InterceptFromWhenWithChoiceTest
Tests run: 3, Failures: 0, Errors: 0, Skipped: 0, Time elapsed: 0.957 sec
Running org.apache.camel.component.file.FileConsumerMoveAndMoveFailureTest
Tests run: 1, Failures: 0, Errors: 0, Skipped: 0, Time elapsed: 2.046 sec
Running org.apache.camel.processor.OnCompletionRouteScopeOverrideGlobalScopeTest
Tests run: 2, Failures: 0, Errors: 0, Skipped: 0, Time elapsed: 0.962 sec
Running org.apache.camel.converter.ObjectHelperTest
Tests run: 9, Failures: 0, Errors: 0, Skipped: 0, Time elapsed: 0.209 sec
Running org.apache.camel.component.vm.VmWaitForTaskIfReplyExpectedTest
Tests run: 2, Failures: 0, Errors: 0, Skipped: 0, Time elapsed: 1.523 sec

Results :

Failed tests: 

Tests run: 2647, Failures: 1, Errors: 0, Skipped: 0

[INFO] ------------------------------------------------------------------------
[ERROR] BUILD FAILURE
[INFO] ------------------------------------------------------------------------
[INFO] There are test failures.

Please refer to /srv/gump/public/workspace/camel/camel-core/target/surefire-reports for the
individual test results.
[INFO] ------------------------------------------------------------------------
[INFO] For more information, run Maven with the -e switch
[INFO] ------------------------------------------------------------------------
[INFO] Total time: 57 minutes 36 seconds
[INFO] Finished at: Wed Jun 16 00:26:38 PDT 2010
[INFO] Final Memory: 18M/33M
[INFO] ------------------------------------------------------------------------
---------------------------------------------

To subscribe to this information via syndicated feeds:
- RSS: http://vmgump.apache.org/gump/public/camel/camel-core-test/rss.xml
- Atom: http://vmgump.apache.org/gump/public/camel/camel-core-test/atom.xml

============================== Gump Tracking Only ===
Produced by Gump version 2.3.
Gump Run 07001615062010, vmgump:vmgump-public:07001615062010
Gump E-mail Identifier (unique within run) #2.

*********************************************************** G U M P
[GUMP@vmgump]: Project apacheds-all (in module apacheds) failed
To whom it may engage...
        
This is an automated request, but not an unsolicited one. For 
more information please visit http://gump.apache.org/nagged.html, 
and/or contact the folk at general@gump.apache.org.

Project apacheds-all has an issue affecting its community integration.
This issue affects 1 projects.
The current state of this project is 'Failed', with reason 'Build Failed'.
For reference only, the following projects are affected by this:
    - apacheds-all :  Apache Directory Server


Full details are available at:
    http://vmgump.apache.org/gump/public/apacheds/apacheds-all/index.html

That said, some information snippets are provided here.

The following annotations (debug/informational/warning/error messages) were provided:
 -DEBUG- Sole output [apacheds-all-*[0-9T].jar] identifier set to project name
 -DEBUG- (Gump generated) Maven2 Settings in: /srv/gump/public/workspace/apacheds/all/gump_mvn_settings.xml
 -INFO- Failed with reason build failed
 -DEBUG- Maven POM in: /srv/gump/public/workspace/apacheds/all/pom.xml
 -INFO- Failed to extract fallback artifacts from Gump Repository



The following work was performed:
http://vmgump.apache.org/gump/public/apacheds/apacheds-all/gump_work/build_apacheds_apacheds-all.html
Work Name: build_apacheds_apacheds-all (Type: Build)
Work ended in a state of : Failed
Elapsed: 10 secs
Command Line: mvn --batch-mode --settings /srv/gump/public/workspace/apacheds/all/gump_mvn_settings.xml
install 
[Working Directory: /srv/gump/public/workspace/apacheds/all]
CLASSPATH: /usr/lib/jvm/java-6-sun/lib/tools.jar:/srv/gump/public/workspace/apacheds/core/target/apacheds-core-1.5.8-SNAPSHOT.jar:/srv/gump/public/workspace/apacheds/core-annotations/target/apacheds-core-annotations-1.5.8-SNAPSHOT.jar:/srv/gump/public/workspace/apacheds/core-api/target/apacheds-core-api-1.5.8-SNAPSHOT.jar:/srv/gump/public/workspace/apacheds/core-avl/target/apacheds-core-avl-1.5.8-SNAPSHOT.jar:/srv/gump/public/workspace/apacheds/core-constants/target/apacheds-core-constants-1.5.8-SNAPSHOT.jar:/srv/gump/public/workspace/apacheds/core-jndi/target/apacheds-core-jndi-1.5.8-SNAPSHOT.jar:/srv/gump/public/workspace/apacheds/interceptor-kerberos/target/apacheds-interceptor-kerberos-1.5.8-SNAPSHOT.jar:/srv/gump/public/workspace/apacheds/jdbm/target/apacheds-jdbm-1.5.8-SNAPSHOT.jar:/srv/gump/public/workspace/apacheds/jdbm-partition/target/apacheds-jdbm-partition-1.5.8-SNAPSHOT.jar:/srv/gump/public/workspace/apacheds/kerberos-shared/target/apacheds-kerberos-shared-1.5.8-
 SNAPSHOT.jar:/srv/gump/public/workspace/apacheds/ldif-partition/target/apacheds-ldif-partition-1.5.8-SNAPSHOT.jar:/srv/gump/public/workspace/apacheds/pom.xml:/srv/gump/public/workspace/apacheds/protocol-changepw/target/apacheds-protocol-changepw-1.5.8-SNAPSHOT.jar:/srv/gump/public/workspace/apacheds/protocol-dhcp/target/apacheds-protocol-dhcp-1.5.8-SNAPSHOT.jar:/srv/gump/public/workspace/apacheds/protocol-dns/target/apacheds-protocol-dns-1.5.8-SNAPSHOT.jar:/srv/gump/public/workspace/apacheds/protocol-kerberos/target/apacheds-protocol-kerberos-1.5.8-SNAPSHOT.jar:/srv/gump/public/workspace/apacheds/protocol-ldap/target/apacheds-protocol-ldap-1.5.8-SNAPSHOT.jar:/srv/gump/public/workspace/apacheds/protocol-ntp/target/apacheds-protocol-ntp-1.5.8-SNAPSHOT.jar:/srv/gump/public/workspace/apacheds/protocol-shared/target/apacheds-protocol-shared-1.5.8-SNAPSHOT.jar:/srv/gump/public/workspace/apacheds/server-annotations/target/apacheds-server-annotations-1.5.8-SNAPSHOT.jar:/srv/gump/pub
 lic/workspace/apacheds/server-jndi/target/apacheds-server-jndi-1.5.8-SNAPSHOT.jar:/srv/gump/public/workspace/apacheds/server-replication/target/apacheds-server-replication-1.5.8-SNAPSHOT.jar:/srv/gump/public/workspace/apacheds/test-framework/target/apacheds-test-framework-1.5.8-SNAPSHOT.jar:/srv/gump/public/workspace/apacheds/xdbm-partition/target/apacheds-xdbm-partition-1.5.8-SNAPSHOT.jar:/srv/gump/public/workspace/apacheds/xdbm-tools/target/apacheds-xdbm-tools-1.5.8-SNAPSHOT.jar
---------------------------------------------
[INFO] ------------------------------------------------------------------------
[INFO] Failed to resolve dependencies for one or more projects in the reactor. Reason: Missing:
----------
1) org.apache.directory.server:apacheds-server-xml:jar:1.5.8-SNAPSHOT

  Try downloading the file manually from the project website.

  Then, install it using the command: 
      mvn install:install-file -DgroupId=org.apache.directory.server -DartifactId=apacheds-server-xml
-Dversion=1.5.8-SNAPSHOT -Dpackaging=jar -Dfile=/path/to/file

  Alternatively, if you host your own repository you can deploy the file there: 
      mvn deploy:deploy-file -DgroupId=org.apache.directory.server -DartifactId=apacheds-server-xml
-Dversion=1.5.8-SNAPSHOT -Dpackaging=jar -Dfile=/path/to/file -Durl=[url] -DrepositoryId=[id]

  Path to dependency: 
  	1) org.apache.directory.server:apacheds-all:jar:1.5.8-SNAPSHOT
  	2) org.apache.directory.server:apacheds-server-xml:jar:1.5.8-SNAPSHOT

2) org.apache.directory.server:apacheds-xbean-spring:jar:1.5.8-SNAPSHOT

  Try downloading the file manually from the project website.

  Then, install it using the command: 
      mvn install:install-file -DgroupId=org.apache.directory.server -DartifactId=apacheds-xbean-spring
-Dversion=1.5.8-SNAPSHOT -Dpackaging=jar -Dfile=/path/to/file

  Alternatively, if you host your own repository you can deploy the file there: 
      mvn deploy:deploy-file -DgroupId=org.apache.directory.server -DartifactId=apacheds-xbean-spring
-Dversion=1.5.8-SNAPSHOT -Dpackaging=jar -Dfile=/path/to/file -Durl=[url] -DrepositoryId=[id]

  Path to dependency: 
  	1) org.apache.directory.server:apacheds-all:jar:1.5.8-SNAPSHOT
  	2) org.apache.directory.server:apacheds-xbean-spring:jar:1.5.8-SNAPSHOT

----------
2 required artifacts are missing.

for artifact: 
  org.apache.directory.server:apacheds-all:jar:1.5.8-SNAPSHOT

from the specified remote repositories:
  gump-central (http://localhost:8192/maven2),
  gump-apache.snapshots (http://localhost:8192/repo/m2-snapshot-repository)



[INFO] ------------------------------------------------------------------------
[INFO] For more information, run Maven with the -e switch
[INFO] ------------------------------------------------------------------------
[INFO] Total time: 9 seconds
[INFO] Finished at: Wed Jun 16 04:05:19 PDT 2010
[INFO] Final Memory: 29M/52M
[INFO] ------------------------------------------------------------------------
---------------------------------------------

To subscribe to this information via syndicated feeds:
- RSS: http://vmgump.apache.org/gump/public/apacheds/apacheds-all/rss.xml
- Atom: http://vmgump.apache.org/gump/public/apacheds/apacheds-all/atom.xml

============================== Gump Tracking Only ===
Produced by Gump version 2.3.
Gump Run 07001615062010, vmgump:vmgump-public:07001615062010
Gump E-mail Identifier (unique within run) #4.

*********************************************************** G U M P
[GUMP@vmgump]: Project apacheds-server-integ-test (in module apacheds) failed
To whom it may engage...
        
This is an automated request, but not an unsolicited one. For 
more information please visit http://gump.apache.org/nagged.html, 
and/or contact the folk at general@gump.apache.org.

Project apacheds-server-integ-test has an issue affecting its community integration.
This issue affects 1 projects.
The current state of this project is 'Failed', with reason 'Build Failed'.
For reference only, the following projects are affected by this:
    - apacheds-server-integ-test :  Apache Directory Server


Full details are available at:
    http://vmgump.apache.org/gump/public/apacheds/apacheds-server-integ-test/index.html

That said, some information snippets are provided here.

The following annotations (debug/informational/warning/error messages) were provided:
 -WARNING- Overriding Maven2 settings: [/srv/gump/public/workspace/apacheds/server-integ/gump_mvn_settings.xml]
 -DEBUG- (Gump generated) Maven2 Settings in: /srv/gump/public/workspace/apacheds/server-integ/gump_mvn_settings.xml
 -INFO- Failed with reason build failed
 -DEBUG- Maven POM in: /srv/gump/public/workspace/apacheds/server-integ/pom.xml



The following work was performed:
http://vmgump.apache.org/gump/public/apacheds/apacheds-server-integ-test/gump_work/build_apacheds_apacheds-server-integ-test.html
Work Name: build_apacheds_apacheds-server-integ-test (Type: Build)
Work ended in a state of : Failed
Elapsed: 3 mins 18 secs
Command Line: mvn --batch-mode --settings /srv/gump/public/workspace/apacheds/server-integ/gump_mvn_settings.xml
package 
[Working Directory: /srv/gump/public/workspace/apacheds/server-integ]
CLASSPATH: /usr/lib/jvm/java-6-sun/lib/tools.jar:/srv/gump/public/workspace/apacheds/server-integ/target/apacheds-server-integ-1.5.8-SNAPSHOT.jar
---------------------------------------------
[INFO] [resources:resources {execution: default-resources}]
[INFO] Using 'UTF-8' encoding to copy filtered resources.
[INFO] Copying 0 resource
[INFO] Copying 3 resources
[INFO] [compiler:compile {execution: default-compile}]
[INFO] Nothing to compile - all classes are up to date
[INFO] [resources:testResources {execution: default-testResources}]
[INFO] Using 'UTF-8' encoding to copy filtered resources.
[INFO] Copying 6 resources
[INFO] Copying 3 resources
[INFO] [compiler:testCompile {execution: default-testCompile}]
[INFO] Nothing to compile - all classes are up to date
[INFO] [surefire:test {execution: default-test}]
[INFO] Surefire report directory: /srv/gump/public/workspace/apacheds/server-integ/target/surefire-reports

-------------------------------------------------------
 T E S T S
-------------------------------------------------------
Running org.apache.directory.server.suites.StockServerISuite
Using partition factory JdbmPartitionFactory
Tests run: 291, Failures: 2, Errors: 5, Skipped: 2, Time elapsed: 186.704 sec <<<
FAILURE!

Results :

Failed tests: 
  testAddPDUExceedingMaxSize(org.apache.directory.server.operations.add.AddIT)
  testPsearchModifyWithEC(org.apache.directory.server.operations.search.PersistentSearchIT)

Tests in error: 
  testModifyDerivedKeys(org.apache.directory.server.kerberos.KeyDerivationServiceIT)
  testExecuteProcedureWithReturnValue(org.apache.directory.server.operations.extended.StoredProcedureIT)
  testExecuteProcedureWithParametersAndReturnValue(org.apache.directory.server.operations.extended.StoredProcedureIT)
  testSubentryControl(org.apache.directory.server.operations.search.SearchIT)
  testSearchAttrC_L(org.apache.directory.server.operations.search.SearchIT)

Tests run: 291, Failures: 2, Errors: 5, Skipped: 2

[INFO] ------------------------------------------------------------------------
[ERROR] BUILD FAILURE
[INFO] ------------------------------------------------------------------------
[INFO] There are test failures.

Please refer to /srv/gump/public/workspace/apacheds/server-integ/target/surefire-reports for
the individual test results.
[INFO] ------------------------------------------------------------------------
[INFO] For more information, run Maven with the -e switch
[INFO] ------------------------------------------------------------------------
[INFO] Total time: 3 minutes 16 seconds
[INFO] Finished at: Wed Jun 16 04:16:20 PDT 2010
[INFO] Final Memory: 31M/55M
[INFO] ------------------------------------------------------------------------
---------------------------------------------

To subscribe to this information via syndicated feeds:
- RSS: http://vmgump.apache.org/gump/public/apacheds/apacheds-server-integ-test/rss.xml
- Atom: http://vmgump.apache.org/gump/public/apacheds/apacheds-server-integ-test/atom.xml

============================== Gump Tracking Only ===
Produced by Gump version 2.3.
Gump Run 07001615062010, vmgump:vmgump-public:07001615062010
Gump E-mail Identifier (unique within run) #5.

*********************************************************** G U M P
[GUMP@vmgump]: Project activemq-jaas (in module activemq) failed
To whom it may engage...
        
This is an automated request, but not an unsolicited one. For 
more information please visit http://gump.apache.org/nagged.html, 
and/or contact the folk at general@gump.apache.org.

Project activemq-jaas has an issue affecting its community integration.
This issue affects 2 projects.
The current state of this project is 'Failed', with reason 'Build Failed'.
For reference only, the following projects are affected by this:
    - activemq-jaas :  ActiveMQ :: JAAS
    - activemq-jaas-test :  ActiveMQ message broker and enterprise integration patterns ...


Full details are available at:
    http://vmgump.apache.org/gump/public/activemq/activemq-jaas/index.html

That said, some information snippets are provided here.

The following annotations (debug/informational/warning/error messages) were provided:
 -DEBUG- Sole output [activemq-jaas-5.4-SNAPSHOT.jar] identifier set to project name
 -DEBUG- (Gump generated) Maven2 Settings in: /srv/gump/public/workspace/activemq/activemq-jaas/gump_mvn_settings.xml
 -INFO- Failed with reason build failed
 -DEBUG- Maven POM in: /srv/gump/public/workspace/activemq/activemq-jaas/pom.xml
 -INFO- Failed to extract fallback artifacts from Gump Repository



The following work was performed:
http://vmgump.apache.org/gump/public/activemq/activemq-jaas/gump_work/build_activemq_activemq-jaas.html
Work Name: build_activemq_activemq-jaas (Type: Build)
Work ended in a state of : Failed
Elapsed: 58 secs
Command Line: mvn --batch-mode -Dmaven.test.skip.exec=true --settings /srv/gump/public/workspace/activemq/activemq-jaas/gump_mvn_settings.xml
install 
[Working Directory: /srv/gump/public/workspace/activemq/activemq-jaas]
CLASSPATH: /usr/lib/jvm/java-6-sun/lib/tools.jar:/srv/gump/public/workspace/apacheds/core-integ/target/apacheds-core-integ-1.5.8-SNAPSHOT.jar:/srv/gump/public/workspace/apacheds/server-integ/target/apacheds-server-integ-1.5.8-SNAPSHOT.jar:/srv/gump/public/workspace/castor/xml/target/castor-xml-1.3.2-SNAPSHOT.jar:/srv/gump/public/workspace/castor/schema/target/castor-xml-schema-1.3.2-SNAPSHOT.jar:/srv/gump/public/workspace/castor/codegen/target/castor-codegen-1.3.2-SNAPSHOT.jar:/srv/gump/public/workspace/castor/core/target/castor-core-1.3.2-SNAPSHOT.jar:/srv/gump/public/workspace/commons-collections-3.x/target/commons-collections-3.3-SNAPSHOT.jar:/srv/gump/public/workspace/apache-commons/logging/target/commons-logging-15062010.jar:/srv/gump/public/workspace/apache-commons/logging/target/commons-logging-api-15062010.jar:/srv/gump/public/workspace/junit/dist/junit-15062010.jar:/srv/gump/public/workspace/slf4j/slf4j-migrator/target/slf4j-migrator-1.5.9-SNAPSHOT.jar:/srv/gump/publ
 ic/workspace/slf4j/slf4j-nop/target/slf4j-nop-1.5.9-SNAPSHOT.jar:/srv/gump/public/workspace/slf4j/log4j-over-slf4j/target/log4j-over-slf4j-1.5.9-SNAPSHOT.jar:/srv/gump/public/workspace/slf4j/slf4j-log4j12/target/slf4j-log4j12-1.5.9-SNAPSHOT.jar:/srv/gump/public/workspace/slf4j/slf4j-jcl/target/slf4j-jcl-1.5.9-SNAPSHOT.jar:/srv/gump/public/workspace/slf4j/slf4j-api/target/slf4j-api-1.5.9-SNAPSHOT.jar:/srv/gump/public/workspace/slf4j/jcl104-over-slf4j/target/jcl104-over-slf4j-1.5.9-SNAPSHOT.jar:/srv/gump/public/workspace/slf4j/slf4j-jdk14/target/slf4j-jdk14-1.5.9-SNAPSHOT.jar:/srv/gump/public/workspace/slf4j/slf4j-simple/target/slf4j-simple-1.5.9-SNAPSHOT.jar:/srv/gump/public/workspace/slf4j/slf4j-ext/target/slf4j-ext-1.5.9-SNAPSHOT.jar:/srv/gump/public/workspace/slf4j/jcl-over-slf4j/target/jcl-over-slf4j-1.5.9-SNAPSHOT.jar:/srv/gump/public/workspace/slf4j/jul-to-slf4j/target/jul-to-slf4j-1.5.9-SNAPSHOT.jar:/srv/gump/public/workspace/velocity-engine/bin/velocity-15062010.jar:/
 srv/gump/public/workspace/velocity-engine/bin/velocity-15062010-dep.jar
---------------------------------------------
[INFO] [remote-resources:process {execution: default}]
[INFO] [resources:resources {execution: default-resources}]
[INFO] Using 'UTF-8' encoding to copy filtered resources.
[INFO] skip non existing resourceDirectory /srv/gump/public/workspace/activemq/activemq-jaas/src/main/resources
[INFO] Copying 3 resources
[INFO] [compiler:compile {execution: default-compile}]
[INFO] Compiling 11 source files to /srv/gump/public/workspace/activemq/activemq-jaas/target/classes
[INFO] [resources:testResources {execution: default-testResources}]
[INFO] Using 'UTF-8' encoding to copy filtered resources.
[INFO] Copying 4 resources
[INFO] Copying 3 resources
[INFO] [compiler:testCompile {execution: default-testCompile}]
[INFO] Compiling 7 source files to /srv/gump/public/workspace/activemq/activemq-jaas/target/test-classes
[INFO] ------------------------------------------------------------------------
[ERROR] BUILD FAILURE
[INFO] ------------------------------------------------------------------------
[INFO] Compilation failure

/srv/gump/public/workspace/activemq/activemq-jaas/src/test/java/org/apache/activemq/jaas/LDAPLoginModuleTest.java:[39,45]
cannot find symbol
symbol  : class Level
location: package org.apache.directory.server.core.integ

/srv/gump/public/workspace/activemq/activemq-jaas/src/test/java/org/apache/activemq/jaas/LDAPLoginModuleTest.java:[40,57]
package org.apache.directory.server.core.integ.annotations does not exist

/srv/gump/public/workspace/activemq/activemq-jaas/src/test/java/org/apache/activemq/jaas/LDAPLoginModuleTest.java:[41,57]
package org.apache.directory.server.core.integ.annotations does not exist

/srv/gump/public/workspace/activemq/activemq-jaas/src/test/java/org/apache/activemq/jaas/LDAPLoginModuleTest.java:[42,40]
cannot find symbol
symbol  : class SiRunner
location: package org.apache.directory.server.integ

/srv/gump/public/workspace/activemq/activemq-jaas/src/test/java/org/apache/activemq/jaas/LDAPLoginModuleTest.java:[49,1]
cannot find symbol
symbol: class CleanupLevel
@CleanupLevel ( Level.CLASS )

/srv/gump/public/workspace/activemq/activemq-jaas/src/test/java/org/apache/activemq/jaas/LDAPLoginModuleTest.java:[50,1]
cannot find symbol
symbol: class ApplyLdifs
@ApplyLdifs( {

/srv/gump/public/workspace/activemq/activemq-jaas/src/test/java/org/apache/activemq/jaas/LDAPLoginModuleTest.java:[48,11]
cannot find symbol
symbol: class SiRunner
@RunWith ( SiRunner.class ) 


[INFO] ------------------------------------------------------------------------
[INFO] For more information, run Maven with the -e switch
[INFO] ------------------------------------------------------------------------
[INFO] Total time: 56 seconds
[INFO] Finished at: Wed Jun 16 04:17:19 PDT 2010
[INFO] Final Memory: 35M/63M
[INFO] ------------------------------------------------------------------------
---------------------------------------------

To subscribe to this information via syndicated feeds:
- RSS: http://vmgump.apache.org/gump/public/activemq/activemq-jaas/rss.xml
- Atom: http://vmgump.apache.org/gump/public/activemq/activemq-jaas/atom.xml

============================== Gump Tracking Only ===
Produced by Gump version 2.3.
Gump Run 07001615062010, vmgump:vmgump-public:07001615062010
Gump E-mail Identifier (unique within run) #6.


--
Apache Gump
http://gump.apache.org/ [Instance: vmgump]

---------------------------------------------------------------------
To unsubscribe, e-mail: general-unsubscribe@gump.apache.org
For additional commands, e-mail: general-help@gump.apache.org


Mime
View raw message