gump-general mailing list archives

Site index · List index
Message view « Date » · « Thread »
Top « Date » · « Thread »
From g...@vmgump.apache.org
Subject BATCH: All dressed up, with nowhere to go...
Date Fri, 28 May 2010 03:03:41 GMT
Dear Gumpmeisters,
            
The following 15 notifys should have been sent

*********************************************************** G U M P
[GUMP@vmgump]: Project gsbase (in module gsbase) failed
[GUMP@vmgump]: Project gsbase-test (in module gsbase) failed
[GUMP@vmgump]: Project jmock2 (in module jmock2) failed
[GUMP@vmgump]: Project derby (in module db-derby) failed
[GUMP@vmgump]: Project emma (in module emma) failed
[GUMP@vmgump]: Project dotnet-antlib-test (in module ant-antlibs) failed
[GUMP@vmgump]: Project lucene-java (in module lucene-java) failed
[GUMP@vmgump]: Project slf4j-test (in module slf4j) failed
[GUMP@vmgump]: Project xml-security-tests (in module xml-security) failed
[GUMP@vmgump]: Project muse (in module muse) failed
[GUMP@vmgump]: Project JacORB-idllib (in module JacORB) failed
[GUMP@vmgump]: Project portals-pluto-portal-1.0 (in module portals-pluto-1.0) failed
[GUMP@vmgump]: Project portals-bridges-velocity (in module portals-bridges) failed
[GUMP@vmgump]: Project maven-bootstrap (in module maven) failed
[GUMP@vmgump]: Project maven (in module maven) failed
*********************************************************** G U M P
[GUMP@vmgump]: Project gsbase (in module gsbase) failed
To whom it may engage...
        
This is an automated request, but not an unsolicited one. For 
more information please visit http://gump.apache.org/nagged.html, 
and/or contact the folk at general@gump.apache.org.

Project gsbase has an issue affecting its community integration.
This issue affects 2 projects.
The current state of this project is 'Failed', with reason 'Build Failed'.
For reference only, the following projects are affected by this:
    - gsbase :  A collection of java utility classes
    - htmlunit :  A tool for testing web based applications


Full details are available at:
    http://vmgump.apache.org/gump/public/gsbase/gsbase/index.html

That said, some information snippets are provided here.

The following annotations (debug/informational/warning/error messages) were provided:
 -DEBUG- Sole output [gsbase-27052010.jar] identifier set to project name
 -DEBUG- (Gump generated) Maven Properties in: /srv/gump/public/workspace/gsbase/build.properties
 -INFO- Failed with reason build failed
 -DEBUG- Maven POM in: /srv/gump/public/workspace/gsbase/project.xml
 -DEBUG- Maven project properties in: /srv/gump/public/workspace/gsbase/project.properties
 -INFO- Failed to extract fallback artifacts from Gump Repository



The following work was performed:
http://vmgump.apache.org/gump/public/gsbase/gsbase/gump_work/build_gsbase_gsbase.html
Work Name: build_gsbase_gsbase (Type: Build)
Work ended in a state of : Failed
Elapsed: 7 secs
Command Line: maven --offline jar 
[Working Directory: /srv/gump/public/workspace/gsbase]
CLASSPATH: /usr/lib/jvm/java-6-sun/lib/tools.jar:/srv/gump/public/workspace/gsbase/target/classes:/srv/gump/public/workspace/junit/dist/junit-27052010.jar:/srv/gump/packages/junitperf-1.8/lib/junitperf.jar
---------------------------------------------
| |\/| / _` \ V / -_) ' \  ~ intelligent projects ~
|_|  |_\__,_|\_/\___|_||_|  v. 1.0.2

build:start:

java:prepare-filesystem:
    [mkdir] Created dir: /srv/gump/public/workspace/gsbase/target/classes

java:compile:
    [echo] Compiling to /srv/gump/public/workspace/gsbase/target/classes
    [echo] 
==========================================================

  NOTE: Targetting JVM 1.6, classes
  will not run on earlier JVMs

==========================================================
          
    [javac] Compiling 66 source files to /srv/gump/public/workspace/gsbase/target/classes
/srv/gump/public/workspace/gsbase/src/java/com/gargoylesoftware/base/resource/jdbc/StatementWrapper.java:65: com.gargoylesoftware.base.resource.jdbc.StatementWrapper is not abstract and does not override abstract method isPoolable() in java.sql.Statement
public class StatementWrapper implements Statement {
       ^
/srv/gump/public/workspace/gsbase/src/java/com/gargoylesoftware/base/resource/jdbc/PreparedStatementWrapper.java:64: com.gargoylesoftware.base.resource.jdbc.PreparedStatementWrapper is not abstract and does not override abstract method setNClob(int,java.io.Reader) in java.sql.PreparedStatement
public class PreparedStatementWrapper
       ^
/srv/gump/public/workspace/gsbase/src/java/com/gargoylesoftware/base/resource/jdbc/ConnectionWrapper.java:77: com.gargoylesoftware.base.resource.jdbc.ConnectionWrapper is not abstract and does not override abstract method createStruct(java.lang.String,java.lang.Object[]) in java.sql.Connection
public final class ConnectionWrapper implements Connection, ManagedResource {
             ^
/srv/gump/public/workspace/gsbase/src/java/com/gargoylesoftware/base/resource/jdbc/CallableStatementWrapper.java:81: com.gargoylesoftware.base.resource.jdbc.CallableStatementWrapper is not abstract and does not override abstract method setNClob(java.lang.String,java.io.Reader) in java.sql.CallableStatement
public final class CallableStatementWrapper
             ^
/srv/gump/public/workspace/gsbase/src/java/com/gargoylesoftware/base/resource/jdbc/DatabaseMetaDataWrapper.java:54: com.gargoylesoftware.base.resource.jdbc.DatabaseMetaDataWrapper is not abstract and does not override abstract method getFunctionColumns(java.lang.String,java.lang.String,java.lang.String,java.lang.String) in java.sql.DatabaseMetaData
public final class DatabaseMetaDataWrapper implements DatabaseMetaData {
             ^
/srv/gump/public/workspace/gsbase/src/java/com/gargoylesoftware/base/resource/jdbc/ResultSetWrapper.java:150: com.gargoylesoftware.base.resource.jdbc.ResultSetWrapper is not abstract and does not override abstract method updateNClob(java.lang.String,java.io.Reader) in java.sql.ResultSet
public final class ResultSetWrapper implements ResultSet {
             ^
Note: Some input files use unchecked or unsafe operations.
Note: Recompile with -Xlint:unchecked for details.
6 errors

BUILD FAILED
File...... /home/gump/.maven/cache/maven-java-plugin-1.5/plugin.jelly
Element... ant:javac
Line...... 63
Column.... 48
Compile failed; see the compiler error output for details.
Total time: 6 seconds
Finished at: Thu May 27 16:32:54 PDT 2010

---------------------------------------------

To subscribe to this information via syndicated feeds:
- RSS: http://vmgump.apache.org/gump/public/gsbase/gsbase/rss.xml
- Atom: http://vmgump.apache.org/gump/public/gsbase/gsbase/atom.xml

============================== Gump Tracking Only ===
Produced by Gump version 2.3.
Gump Run 05001627052010, vmgump:vmgump-public:05001627052010
Gump E-mail Identifier (unique within run) #1.

*********************************************************** G U M P
[GUMP@vmgump]: Project gsbase-test (in module gsbase) failed
To whom it may engage...
        
This is an automated request, but not an unsolicited one. For 
more information please visit http://gump.apache.org/nagged.html, 
and/or contact the folk at general@gump.apache.org.

Project gsbase-test has an issue affecting its community integration.
This issue affects 1 projects.
The current state of this project is 'Failed', with reason 'Build Failed'.
For reference only, the following projects are affected by this:
    - gsbase-test :  A collection of java utility classes


Full details are available at:
    http://vmgump.apache.org/gump/public/gsbase/gsbase-test/index.html

That said, some information snippets are provided here.

The following annotations (debug/informational/warning/error messages) were provided:
 -WARNING- Overriding Maven properties: [/srv/gump/public/workspace/gsbase/build.properties]
 -DEBUG- (Gump generated) Maven Properties in: /srv/gump/public/workspace/gsbase/build.properties
 -INFO- Failed with reason build failed
 -DEBUG- Maven POM in: /srv/gump/public/workspace/gsbase/project.xml
 -DEBUG- Maven project properties in: /srv/gump/public/workspace/gsbase/project.properties



The following work was performed:
http://vmgump.apache.org/gump/public/gsbase/gsbase-test/gump_work/build_gsbase_gsbase-test.html
Work Name: build_gsbase_gsbase-test (Type: Build)
Work ended in a state of : Failed
Elapsed: 4 secs
Command Line: maven --offline jar 
[Working Directory: /srv/gump/public/workspace/gsbase]
CLASSPATH: /usr/lib/jvm/java-6-sun/lib/tools.jar:/srv/gump/public/workspace/gsbase/target/classes:/srv/gump/public/workspace/junit/dist/junit-27052010.jar:/srv/gump/packages/junitperf-1.8/lib/junitperf.jar
---------------------------------------------
|  \/  |__ _Apache__ ___
| |\/| / _` \ V / -_) ' \  ~ intelligent projects ~
|_|  |_\__,_|\_/\___|_||_|  v. 1.0.2

build:start:

java:prepare-filesystem:

java:compile:
    [echo] Compiling to /srv/gump/public/workspace/gsbase/target/classes
    [echo] 
==========================================================

  NOTE: Targetting JVM 1.6, classes
  will not run on earlier JVMs

==========================================================
          
    [javac] Compiling 60 source files to /srv/gump/public/workspace/gsbase/target/classes
/srv/gump/public/workspace/gsbase/src/java/com/gargoylesoftware/base/resource/jdbc/StatementWrapper.java:65: com.gargoylesoftware.base.resource.jdbc.StatementWrapper is not abstract and does not override abstract method isPoolable() in java.sql.Statement
public class StatementWrapper implements Statement {
       ^
/srv/gump/public/workspace/gsbase/src/java/com/gargoylesoftware/base/resource/jdbc/PreparedStatementWrapper.java:64: com.gargoylesoftware.base.resource.jdbc.PreparedStatementWrapper is not abstract and does not override abstract method setNClob(int,java.io.Reader) in java.sql.PreparedStatement
public class PreparedStatementWrapper
       ^
/srv/gump/public/workspace/gsbase/src/java/com/gargoylesoftware/base/resource/jdbc/ConnectionWrapper.java:77: com.gargoylesoftware.base.resource.jdbc.ConnectionWrapper is not abstract and does not override abstract method createStruct(java.lang.String,java.lang.Object[]) in java.sql.Connection
public final class ConnectionWrapper implements Connection, ManagedResource {
             ^
/srv/gump/public/workspace/gsbase/src/java/com/gargoylesoftware/base/resource/jdbc/CallableStatementWrapper.java:81: com.gargoylesoftware.base.resource.jdbc.CallableStatementWrapper is not abstract and does not override abstract method setNClob(java.lang.String,java.io.Reader) in java.sql.CallableStatement
public final class CallableStatementWrapper
             ^
/srv/gump/public/workspace/gsbase/src/java/com/gargoylesoftware/base/resource/jdbc/DatabaseMetaDataWrapper.java:54: com.gargoylesoftware.base.resource.jdbc.DatabaseMetaDataWrapper is not abstract and does not override abstract method getFunctionColumns(java.lang.String,java.lang.String,java.lang.String,java.lang.String) in java.sql.DatabaseMetaData
public final class DatabaseMetaDataWrapper implements DatabaseMetaData {
             ^
/srv/gump/public/workspace/gsbase/src/java/com/gargoylesoftware/base/resource/jdbc/ResultSetWrapper.java:150: com.gargoylesoftware.base.resource.jdbc.ResultSetWrapper is not abstract and does not override abstract method updateNClob(java.lang.String,java.io.Reader) in java.sql.ResultSet
public final class ResultSetWrapper implements ResultSet {
             ^
Note: Some input files use unchecked or unsafe operations.
Note: Recompile with -Xlint:unchecked for details.
6 errors

BUILD FAILED
File...... /home/gump/.maven/cache/maven-java-plugin-1.5/plugin.jelly
Element... ant:javac
Line...... 63
Column.... 48
Compile failed; see the compiler error output for details.
Total time: 4 seconds
Finished at: Thu May 27 16:33:16 PDT 2010

---------------------------------------------

To subscribe to this information via syndicated feeds:
- RSS: http://vmgump.apache.org/gump/public/gsbase/gsbase-test/rss.xml
- Atom: http://vmgump.apache.org/gump/public/gsbase/gsbase-test/atom.xml

============================== Gump Tracking Only ===
Produced by Gump version 2.3.
Gump Run 05001627052010, vmgump:vmgump-public:05001627052010
Gump E-mail Identifier (unique within run) #2.

*********************************************************** G U M P
[GUMP@vmgump]: Project jmock2 (in module jmock2) failed
To whom it may engage...
        
This is an automated request, but not an unsolicited one. For 
more information please visit http://gump.apache.org/nagged.html, 
and/or contact the folk at general@gump.apache.org.

Project jmock2 has an issue affecting its community integration.
This issue affects 1 projects.
The current state of this project is 'Failed', with reason 'Build Failed'.
For reference only, the following projects are affected by this:
    - jmock2 :  jMock is a library for testing Java code using mock objects.


Full details are available at:
    http://vmgump.apache.org/gump/public/jmock2/jmock2/index.html

That said, some information snippets are provided here.

The following annotations (debug/informational/warning/error messages) were provided:
 -INFO- Failed with reason build failed
 -INFO- Failed to extract fallback artifacts from Gump Repository



The following work was performed:
http://vmgump.apache.org/gump/public/jmock2/jmock2/gump_work/build_jmock2_jmock2.html
Work Name: build_jmock2_jmock2 (Type: Build)
Work ended in a state of : Failed
Elapsed: 4 secs
Command Line: /usr/lib/jvm/java-6-sun/bin/java -Djava.awt.headless=true -Xbootclasspath/p:/srv/gump/public/workspace/xml-xerces2/build/xercesImpl.jar:/srv/gump/public/workspace/xml-commons/java/external/build/xml-apis.jar org.apache.tools.ant.Main -Dgump.merge=/srv/gump/public/gump/work/merge.xml -Dbuild.sysclasspath=only -Dversion=27052010 
[Working Directory: /srv/gump/public/workspace/jmock2]
CLASSPATH: /usr/lib/jvm/java-6-sun/lib/tools.jar:/srv/gump/public/workspace/jmock2/build/classes:/srv/gump/public/workspace/jmock2/lib/objenesis-1.0.jar:/srv/gump/public/workspace/ant/dist/lib/ant-jmf.jar:/srv/gump/public/workspace/ant/dist/lib/ant-swing.jar:/srv/gump/public/workspace/ant/dist/lib/ant-apache-resolver.jar:/srv/gump/public/workspace/ant/dist/lib/ant-apache-xalan2.jar:/srv/gump/public/workspace/ant/dist/lib/ant-junit.jar:/srv/gump/public/workspace/ant/dist/lib/ant-launcher.jar:/srv/gump/public/workspace/ant/dist/lib/ant.jar:/srv/gump/packages/bsh-2.0b4/bsh-commands-2.0b4.jar:/srv/gump/packages/bsh-2.0b4/bsh-classpath-2.0b4.jar:/srv/gump/packages/bsh-2.0b4/bsh-core-2.0b4.jar:/srv/gump/packages/bsh-2.0b4/bsh-bsf-2.0b4.jar:/srv/gump/packages/bsh-2.0b4/bsh-2.0b4.jar:/srv/gump/packages/bsh-2.0b4/bsh-reflect-2.0b4.jar:/srv/gump/packages/bsh-2.0b4/bsh-util-2.0b4.jar:/srv/gump/packages/cglib/cglib-nodep-2.1_3.jar:/srv/gump/public/workspace/hamcrest/hamcrest-java/build/h
 amcrest-core-27052010.jar:/srv/gump/public/workspace/hamcrest/hamcrest-java/build/hamcrest-library-27052010.jar:/srv/gump/public/workspace/junit/dist/junit-27052010.jar:/srv/gump/packages/junit3.8.1/junit.jar:/srv/gump/public/workspace/xml-commons/java/external/build/xml-apis-ext.jar
---------------------------------------------
    [javac] location: class org.jmock.test.unit.lib.CurrentStateMatcherTests
    [javac]         assertTrue("should match", isNotCurrently("S").matches(stateMachine));
    [javac]         ^
    [javac] /srv/gump/public/workspace/jmock2/test/org/jmock/test/unit/lib/CurrentStateMatcherTests.java:38: cannot find symbol
    [javac] symbol  : method assertTrue(java.lang.String,boolean)
    [javac] location: class org.jmock.test.unit.lib.CurrentStateMatcherTests
    [javac]         assertTrue("should not match", !isCurrentlyS.matches(null));
    [javac]         ^
    [javac] /srv/gump/public/workspace/jmock2/test/org/jmock/test/unit/lib/CurrentStateMatcherTests.java:42: cannot find symbol
    [javac] symbol  : method assertTrue(java.lang.String,boolean)
    [javac] location: class org.jmock.test.unit.lib.CurrentStateMatcherTests
    [javac]         assertTrue("should not match", !isCurrentlyS.matches("something else"));
    [javac]         ^
    [javac] /srv/gump/public/workspace/jmock2/test/org/jmock/test/unit/lib/CurrentStateMatcherTests.java:46: cannot find symbol
    [javac] symbol  : method assertEquals(java.lang.String,java.lang.String)
    [javac] location: class org.jmock.test.unit.lib.CurrentStateMatcherTests
    [javac]         assertEquals("a state machine that is S", asString(isCurrently("S")));
    [javac]         ^
    [javac] /srv/gump/public/workspace/jmock2/test/org/jmock/test/unit/lib/CurrentStateMatcherTests.java:47: cannot find symbol
    [javac] symbol  : method assertEquals(java.lang.String,java.lang.String)
    [javac] location: class org.jmock.test.unit.lib.CurrentStateMatcherTests
    [javac]         assertEquals("a state machine that is not S", asString(isNotCurrently("S")));
    [javac]         ^
    [javac] /srv/gump/public/workspace/jmock2/test/org/jmock/test/unit/lib/CurrentStateMatcherTests.java:53: cannot find symbol
    [javac] symbol  : method assertMismatchDescription(java.lang.String,org.hamcrest.Matcher<org.jmock.States>,org.jmock.States)
    [javac] location: class org.jmock.test.unit.lib.CurrentStateMatcherTests
    [javac]         assertMismatchDescription("was not S", isCurrently("S"), stateMachine);
    [javac]         ^
    [javac] /srv/gump/public/workspace/jmock2/test/org/jmock/test/unit/lib/CurrentStateMatcherTests.java:56: method does not override or implement a method from a supertype
    [javac]     @Override
    [javac]     ^
    [javac] /srv/gump/public/workspace/jmock2/test/org/jmock/test/unit/support/SyntheticEmptyInterfaceClassLoader.java:35: cannot find symbol
    [javac] symbol  : variable COMPUTE_MAXS
    [javac] location: class net.sf.cglib.asm.ClassWriter
    [javac]         ClassWriter writer = new ClassWriter(ClassWriter.COMPUTE_MAXS);
    [javac]                                                         ^
    [javac] /srv/gump/public/workspace/jmock2/test/org/jmock/test/unit/support/SyntheticEmptyInterfaceClassLoader.java:35: internal error; cannot instantiate ClassWriter(boolean) at net.sf.cglib.asm.ClassWriter to ()
    [javac]         ClassWriter writer = new ClassWriter(ClassWriter.COMPUTE_MAXS);
    [javac]                              ^
    [javac] /srv/gump/public/workspace/jmock2/test/org/jmock/test/unit/support/SyntheticEmptyInterfaceClassLoader.java:36: visit(int,int,java.lang.String,java.lang.String,java.lang.String[],java.lang.String) in net.sf.cglib.asm.ClassWriter cannot be applied to (int,int,java.lang.String,<nulltype>,java.lang.String,<nulltype>)
    [javac]                 writer.visit(CLASS_FORMAT_VERSION,
    [javac]                       ^
    [javac] Note: /srv/gump/public/workspace/jmock2/src/org/jmock/integration/junit4/JMock.java uses or overrides a deprecated API.
    [javac] Note: Recompile with -Xlint:deprecation for details.
    [javac] 23 errors

BUILD FAILED
/srv/gump/public/workspace/jmock2/build.xml:61: Compile failed; see the compiler error output for details.

Total time: 3 seconds
---------------------------------------------

To subscribe to this information via syndicated feeds:
- RSS: http://vmgump.apache.org/gump/public/jmock2/jmock2/rss.xml
- Atom: http://vmgump.apache.org/gump/public/jmock2/jmock2/atom.xml

============================== Gump Tracking Only ===
Produced by Gump version 2.3.
Gump Run 05001627052010, vmgump:vmgump-public:05001627052010
Gump E-mail Identifier (unique within run) #3.

*********************************************************** G U M P
[GUMP@vmgump]: Project derby (in module db-derby) failed
To whom it may engage...
        
This is an automated request, but not an unsolicited one. For 
more information please visit http://gump.apache.org/nagged.html, 
and/or contact the folk at general@gump.apache.org.

Project derby has an issue affecting its community integration.
This issue affects 1 projects.
The current state of this project is 'Failed', with reason 'Build Failed'.
For reference only, the following projects are affected by this:
    - derby :  Apache Derby, 100% Java relational database.


Full details are available at:
    http://vmgump.apache.org/gump/public/db-derby/derby/index.html

That said, some information snippets are provided here.

The following annotations (debug/informational/warning/error messages) were provided:
 -INFO- Failed with reason build failed
 -INFO- Failed to extract fallback artifacts from Gump Repository



The following work was performed:
http://vmgump.apache.org/gump/public/db-derby/derby/gump_work/build_db-derby_derby.html
Work Name: build_db-derby_derby (Type: Build)
Work ended in a state of : Failed
Elapsed: 37 secs
Command Line: /usr/lib/jvm/java-6-sun/bin/java -Djava.awt.headless=true -Xbootclasspath/p:/srv/gump/public/workspace/xml-commons/java/external/build/xml-apis.jar:/srv/gump/public/workspace/xml-xerces2/build/xercesImpl.jar:/srv/gump/public/workspace/xml-xalan/build/serializer.jar:/srv/gump/public/workspace/xml-xalan/build/xalan-unbundled.jar org.apache.tools.ant.Main -Dgump.merge=/srv/gump/public/gump/work/merge.xml -Dbuild.sysclasspath=only -Dsane=false gump_all 
[Working Directory: /srv/gump/public/workspace/db-derby]
CLASSPATH: /usr/lib/jvm/java-6-sun/lib/tools.jar:/srv/gump/public/workspace/db-derby/classes:/srv/gump/public/workspace/ant/dist/lib/ant-jmf.jar:/srv/gump/public/workspace/ant/dist/lib/ant-swing.jar:/srv/gump/public/workspace/ant/dist/lib/ant-apache-resolver.jar:/srv/gump/public/workspace/ant/dist/lib/ant-apache-xalan2.jar:/srv/gump/public/workspace/ant/dist/lib/ant-junit.jar:/srv/gump/public/workspace/ant/dist/lib/ant-launcher.jar:/srv/gump/public/workspace/ant/dist/lib/ant.jar:/srv/gump/public/workspace/xml-commons/java/external/build/xml-apis-ext.jar:/srv/gump/public/workspace/jakarta-servletapi-5/jsr154/dist/lib/servlet-api.jar:/srv/gump/public/workspace/jakarta-oro/jakarta-oro-27052010.jar:/srv/gump/packages/javacc-3.1/bin/lib/javacc.jar:/srv/gump/public/workspace/junit/dist/junit-27052010.jar
---------------------------------------------
engine_169:

compile_reference:
    [javac] Compiling 11 source files to /srv/gump/public/workspace/db-derby/classes
    [javac] Compiling 1 source file to /srv/gump/public/workspace/db-derby/classes

compile_authentication:
    [javac] Compiling 2 source files to /srv/gump/public/workspace/db-derby/classes

authentication:

compile_security:
    [javac] Compiling 2 source files to /srv/gump/public/workspace/db-derby/classes

security:

compile_mbeans:
    [javac] Compiling 4 source files to /srv/gump/public/workspace/db-derby/classes

compile_io:

storage:

compile_iapi_error_jsr169:

compile_reference:
    [javac] Compiling 2 source files to /srv/gump/public/workspace/db-derby/classes

compile_util:

compile_types:
    [javac] Compiling 1 source file to /srv/gump/public/workspace/db-derby/classes
    [javac] /srv/gump/public/workspace/db-derby/java/engine/org/apache/derby/impl/jdbc/EmbedStatement.java:60: org.apache.derby.impl.jdbc.EmbedStatement is not abstract and does not override abstract method isWrapperFor(java.lang.Class) in java.sql.Wrapper
    [javac] public class EmbedStatement extends ConnectionChild
    [javac]        ^
    [javac] /srv/gump/public/workspace/db-derby/java/engine/org/apache/derby/impl/jdbc/EmbedResultSetMetaData.java:59: org.apache.derby.impl.jdbc.EmbedResultSetMetaData is not abstract and does not override abstract method isWrapperFor(java.lang.Class) in java.sql.Wrapper
    [javac] public class EmbedResultSetMetaData
    [javac]        ^
    [javac] /srv/gump/public/workspace/db-derby/java/engine/org/apache/derby/impl/jdbc/EmbedDatabaseMetaData.java:88: org.apache.derby.impl.jdbc.EmbedDatabaseMetaData is not abstract and does not override abstract method autoCommitFailureClosesAllResultSets() in java.sql.DatabaseMetaData
    [javac] public class EmbedDatabaseMetaData extends ConnectionChild 
    [javac]        ^
    [javac] 3 errors

BUILD FAILED
/srv/gump/public/workspace/db-derby/build.xml:453: The following error occurred while executing this line:
/srv/gump/public/workspace/db-derby/java/engine/build.xml:79: The following error occurred while executing this line:
/srv/gump/public/workspace/db-derby/java/engine/org/apache/derby/iapi/build.xml:65: The following error occurred while executing this line:
/srv/gump/public/workspace/db-derby/java/engine/org/apache/derby/iapi/types/build.xml:53: Compile failed; see the compiler error output for details.

Total time: 36 seconds
---------------------------------------------

To subscribe to this information via syndicated feeds:
- RSS: http://vmgump.apache.org/gump/public/db-derby/derby/rss.xml
- Atom: http://vmgump.apache.org/gump/public/db-derby/derby/atom.xml

============================== Gump Tracking Only ===
Produced by Gump version 2.3.
Gump Run 05001627052010, vmgump:vmgump-public:05001627052010
Gump E-mail Identifier (unique within run) #4.

*********************************************************** G U M P
[GUMP@vmgump]: Project emma (in module emma) failed
To whom it may engage...
        
This is an automated request, but not an unsolicited one. For 
more information please visit http://gump.apache.org/nagged.html, 
and/or contact the folk at general@gump.apache.org.

Project emma has an issue affecting its community integration.
This issue affects 1 projects.
The current state of this project is 'Failed', with reason 'Build Failed'.
For reference only, the following projects are affected by this:
    - emma :  code coverage tool


Full details are available at:
    http://vmgump.apache.org/gump/public/emma/emma/index.html

That said, some information snippets are provided here.

The following annotations (debug/informational/warning/error messages) were provided:
 -INFO- Failed with reason build failed
 -INFO- Failed to extract fallback artifacts from Gump Repository



The following work was performed:
http://vmgump.apache.org/gump/public/emma/emma/gump_work/build_emma_emma.html
Work Name: build_emma_emma (Type: Build)
Work ended in a state of : Failed
Elapsed: 5 secs
Command Line: /usr/lib/jvm/java-6-sun/bin/java -Djava.awt.headless=true -Xbootclasspath/p:/srv/gump/public/workspace/xml-commons/java/external/build/xml-apis.jar:/srv/gump/public/workspace/xml-xerces2/build/xercesImpl.jar org.apache.tools.ant.Main -Dgump.merge=/srv/gump/public/gump/work/merge.xml -Dbuild.sysclasspath=only -Dapp.short.name=emma-27052010 
[Working Directory: /srv/gump/public/workspace/emma]
CLASSPATH: /usr/lib/jvm/java-6-sun/lib/tools.jar:/srv/gump/public/workspace/emma/out/core/classes:/srv/gump/public/workspace/emma/out/ant/classes:/srv/gump/public/workspace/emma/lib/internal/stamptool.jar:/srv/gump/public/workspace/ant/dist/lib/ant-jmf.jar:/srv/gump/public/workspace/ant/dist/lib/ant-swing.jar:/srv/gump/public/workspace/ant/dist/lib/ant-apache-resolver.jar:/srv/gump/public/workspace/ant/dist/lib/ant-apache-xalan2.jar:/srv/gump/public/workspace/ant/dist/lib/ant-junit.jar:/srv/gump/public/workspace/ant/dist/lib/ant-launcher.jar:/srv/gump/public/workspace/ant/dist/lib/ant.jar:/srv/gump/public/workspace/xml-commons/java/external/build/xml-apis-ext.jar
---------------------------------------------
timestamp:

-pre-compile:

core.bootstrap.compile:
    [javac] Compiling 2 source files to /srv/gump/public/workspace/emma/out/core/classes
    [javac] 
    [javac]           WARNING
    [javac] 
    [javac] The -source switch defaults to 1.5 in JDK 1.5 and 1.6.
    [javac] If you specify -target 1.2 you now must also specify -source 1.2.
    [javac] Ant will implicitly add -source 1.2 for you.  Please change your build file.

core.java14.compile:
    [javac] Compiling 1 source file to /srv/gump/public/workspace/emma/out/core/classes
    [javac] 
    [javac]           WARNING
    [javac] 
    [javac] The -source switch defaults to 1.5 in JDK 1.5 and 1.6.
    [javac] If you specify -target 1.2 you now must also specify -source 1.2.
    [javac] Ant will implicitly add -source 1.2 for you.  Please change your build file.

core.java13.compile:
    [javac] Compiling 1 source file to /srv/gump/public/workspace/emma/out/core/classes
    [javac] 
    [javac]           WARNING
    [javac] 
    [javac] The -source switch defaults to 1.5 in JDK 1.5 and 1.6.
    [javac] If you specify -target 1.2 you now must also specify -source 1.2.
    [javac] Ant will implicitly add -source 1.2 for you.  Please change your build file.

core.compile:
    [javac] Compiling 175 source files to /srv/gump/public/workspace/emma/out/core/classes
    [javac] 
    [javac]           WARNING
    [javac] 
    [javac] The -source switch defaults to 1.5 in JDK 1.5 and 1.6.
    [javac] If you specify -target 1.2 you now must also specify -source 1.2.
    [javac] Ant will implicitly add -source 1.2 for you.  Please change your build file.
    [javac] /srv/gump/public/workspace/emma/core/java12/com/vladium/emma/run/InstrClassLoader.java:346: reference to CodeSource is ambiguous, both method CodeSource(java.net.URL,java.security.cert.Certificate[]) in java.security.CodeSource and method CodeSource(java.net.URL,java.security.CodeSigner[]) in java.security.CodeSource match
    [javac]         final CodeSource csrc = new CodeSource (srcURL, null);
    [javac]                                 ^
    [javac] Note: Some input files use or override a deprecated API.
    [javac] Note: Recompile with -Xlint:deprecation for details.
    [javac] 1 error

BUILD FAILED
/srv/gump/public/workspace/emma/build.xml:297: Compile failed; see the compiler error output for details.

Total time: 4 seconds
---------------------------------------------

To subscribe to this information via syndicated feeds:
- RSS: http://vmgump.apache.org/gump/public/emma/emma/rss.xml
- Atom: http://vmgump.apache.org/gump/public/emma/emma/atom.xml

============================== Gump Tracking Only ===
Produced by Gump version 2.3.
Gump Run 05001627052010, vmgump:vmgump-public:05001627052010
Gump E-mail Identifier (unique within run) #7.

*********************************************************** G U M P
[GUMP@vmgump]: Project dotnet-antlib-test (in module ant-antlibs) failed
To whom it may engage...
        
This is an automated request, but not an unsolicited one. For 
more information please visit http://gump.apache.org/nagged.html, 
and/or contact the folk at general@gump.apache.org.

Project dotnet-antlib-test has an issue affecting its community integration.
This issue affects 1 projects.
The current state of this project is 'Failed', with reason 'Build Failed'.
For reference only, the following projects are affected by this:
    - dotnet-antlib-test :  Task and Type Libraries for Apache Ant


Full details are available at:
    http://vmgump.apache.org/gump/public/ant-antlibs/dotnet-antlib-test/index.html

That said, some information snippets are provided here.

The following annotations (debug/informational/warning/error messages) were provided:
 -INFO- Failed with reason build failed



The following work was performed:
http://vmgump.apache.org/gump/public/ant-antlibs/dotnet-antlib-test/gump_work/build_ant-antlibs_dotnet-antlib-test.html
Work Name: build_ant-antlibs_dotnet-antlib-test (Type: Build)
Work ended in a state of : Failed
Elapsed: 26 secs
Command Line: /usr/lib/jvm/java-6-sun/bin/java -Djava.awt.headless=true -Xbootclasspath/p:/srv/gump/public/workspace/xml-xerces2/build/xercesImpl.jar:/srv/gump/public/workspace/xml-commons/java/external/build/xml-apis.jar org.apache.tools.ant.Main -Dgump.merge=/srv/gump/public/gump/work/merge.xml -Dbuild.sysclasspath=only -Dant-testutil.jar=/srv/gump/public/workspace/ant/build/lib/ant-testutil.jar test 
[Working Directory: /srv/gump/public/workspace/ant-antlibs/dotnet]
CLASSPATH: /usr/lib/jvm/java-6-sun/lib/tools.jar:/srv/gump/public/workspace/ant-antlibs/dotnet/build/test-classes:/srv/gump/public/workspace/ant/dist/lib/ant-jmf.jar:/srv/gump/public/workspace/ant/dist/lib/ant-swing.jar:/srv/gump/public/workspace/ant/dist/lib/ant-apache-resolver.jar:/srv/gump/public/workspace/ant/dist/lib/ant-apache-xalan2.jar:/srv/gump/public/workspace/ant/dist/lib/ant-junit.jar:/srv/gump/public/workspace/ant/dist/lib/ant-launcher.jar:/srv/gump/public/workspace/ant/dist/lib/ant.jar:/srv/gump/public/workspace/ant-antlibs/antunit/build/ant-antunit-27052010.jar:/srv/gump/public/workspace/ant-antlibs/dotnet/build/ant-dotnet-27052010.jar:/srv/gump/public/workspace/xml-commons/java/external/build/xml-apis-ext.jar
---------------------------------------------
[au:antunit] 	at line 96, column 37
[au:antunit] 	Message: Needed .net apps are missing
[au:antunit] 	took 0.015 sec
[au:antunit] Target: testBothSrc  caused an ERROR
[au:antunit] 	at line 96, column 37
[au:antunit] 	Message: Needed .net apps are missing
[au:antunit] 	took 0.016 sec
[au:antunit] Target: testSchemaFileMustHaveOneOptionOnly  caused an ERROR
[au:antunit] 	at line 96, column 37
[au:antunit] 	Message: Needed .net apps are missing
[au:antunit] 	took 0.007 sec
[au:antunit] Target: testLocalWsdl  caused an ERROR
[au:antunit] 	at line 96, column 37
[au:antunit] 	Message: Needed .net apps are missing
[au:antunit] 	took 0.011 sec
[au:antunit] Target: testSrcIsDir  caused an ERROR
[au:antunit] 	at line 96, column 37
[au:antunit] 	Message: Needed .net apps are missing
[au:antunit] 	took 0.007 sec
[au:antunit] Target: testLocalWsdlServerVB  caused an ERROR
[au:antunit] 	at line 96, column 37
[au:antunit] 	Message: Needed .net apps are missing
[au:antunit] 	took 0.088 sec
[au:antunit] Target: testLocalWsdlServer  caused an ERROR
[au:antunit] 	at line 96, column 37
[au:antunit] 	Message: Needed .net apps are missing
[au:antunit] 	took 0.016 sec
[au:antunit] Target: testNoSrc  caused an ERROR
[au:antunit] 	at line 96, column 37
[au:antunit] 	Message: Needed .net apps are missing
[au:antunit] 	took 0.01 sec
[au:antunit] Target: testSchemaFileMustExist  caused an ERROR
[au:antunit] 	at line 96, column 37
[au:antunit] 	Message: Needed .net apps are missing
[au:antunit] 	took 0.007 sec
[au:antunit] Target: testInvalidExtraOpsVB  caused an ERROR
[au:antunit] 	at line 96, column 37
[au:antunit] 	Message: Needed .net apps are missing
[au:antunit] 	took 0.01 sec
[au:antunit] Target: testDestIsDir  caused an ERROR
[au:antunit] 	at line 96, column 37
[au:antunit] 	Message: Needed .net apps are missing
[au:antunit] 	took 0.006 sec

test:

BUILD FAILED
/srv/gump/public/workspace/ant-antlibs/dotnet/common/build.xml:223: At least one AntUnit test has failed.

Total time: 25 seconds
---------------------------------------------

To subscribe to this information via syndicated feeds:
- RSS: http://vmgump.apache.org/gump/public/ant-antlibs/dotnet-antlib-test/rss.xml
- Atom: http://vmgump.apache.org/gump/public/ant-antlibs/dotnet-antlib-test/atom.xml

============================== Gump Tracking Only ===
Produced by Gump version 2.3.
Gump Run 05001627052010, vmgump:vmgump-public:05001627052010
Gump E-mail Identifier (unique within run) #10.

*********************************************************** G U M P
[GUMP@vmgump]: Project lucene-java (in module lucene-java) failed
To whom it may engage...
        
This is an automated request, but not an unsolicited one. For 
more information please visit http://gump.apache.org/nagged.html, 
and/or contact the folk at general@gump.apache.org.

Project lucene-java has an issue affecting its community integration.
This issue affects 4 projects.
The current state of this project is 'Failed', with reason 'Build Failed'.
For reference only, the following projects are affected by this:
    - jakarta-lucene :  Java Based Search Engine
    - lenya :  Content Management System
    - lucene-java :  Java Based Search Engine
    - xml-xindice :  native XML database


Full details are available at:
    http://vmgump.apache.org/gump/public/lucene-java/lucene-java/index.html

That said, some information snippets are provided here.

The following annotations (debug/informational/warning/error messages) were provided:
 -DEBUG- Sole output [lucene-core-27052010.jar] identifier set to project name
 -DEBUG- Dependency on javacc exists, no need to add for property javacc.home.
 -INFO- Failed with reason build failed
 -INFO- Failed to extract fallback artifacts from Gump Repository



The following work was performed:
http://vmgump.apache.org/gump/public/lucene-java/lucene-java/gump_work/build_lucene-java_lucene-java.html
Work Name: build_lucene-java_lucene-java (Type: Build)
Work ended in a state of : Failed
Elapsed: 16 secs
Command Line: /usr/lib/jvm/java-6-sun/bin/java -Djava.awt.headless=true -Xbootclasspath/p:/srv/gump/public/workspace/xml-commons/java/external/build/xml-apis.jar:/srv/gump/public/workspace/xml-xerces2/build/xercesImpl.jar org.apache.tools.ant.Main -Dgump.merge=/srv/gump/public/gump/work/merge.xml -Dbuild.sysclasspath=only -Dversion=27052010 -Djavacc.home=/srv/gump/packages/javacc-3.1 package 
[Working Directory: /srv/gump/public/workspace/lucene-java]
CLASSPATH: /usr/lib/jvm/java-6-sun/lib/tools.jar:/srv/gump/public/workspace/lucene-java/build/classes/java:/srv/gump/public/workspace/lucene-java/build/classes/demo:/srv/gump/public/workspace/lucene-java/build/classes/test:/srv/gump/public/workspace/lucene-java/contrib/db/bdb/lib/db-4.7.25.jar:/srv/gump/public/workspace/lucene-java/contrib/gdata-server/lib/gdata-client-1.0.jar:/srv/gump/public/workspace/lucene-java/build/contrib/analyzers/common/classes/java:/srv/gump/public/workspace/lucene-java/build/contrib/analyzers/smartcn/classes/java:/srv/gump/public/workspace/lucene-java/build/contrib/analyzers/stempel/classes/java:/srv/gump/public/workspace/lucene-java/build/contrib/ant/classes/java:/srv/gump/public/workspace/lucene-java/build/contrib/benchmark/classes/java:/srv/gump/public/workspace/lucene-java/build/contrib/collation/classes/java:/srv/gump/public/workspace/lucene-java/build/contrib/db/bdb-je/classes/java:/srv/gump/public/workspace/lucene-java/build/contrib/db/bdb/c
 lasses/java:/srv/gump/public/workspace/lucene-java/build/contrib/fast-vector-highlighter/classes/java:/srv/gump/public/workspace/lucene-java/build/contrib/gdata-server/classes/java:/srv/gump/public/workspace/lucene-java/build/contrib/highlighter/classes/java:/srv/gump/public/workspace/lucene-java/build/contrib/icu/classes/java:/srv/gump/public/workspace/lucene-java/build/contrib/instantiated/classes/java:/srv/gump/public/workspace/lucene-java/build/contrib/javascript/classes/java:/srv/gump/public/workspace/lucene-java/build/contrib/lucli/classes/java:/srv/gump/public/workspace/lucene-java/build/contrib/memory/classes/java:/srv/gump/public/workspace/lucene-java/build/contrib/misc/classes/java:/srv/gump/public/workspace/lucene-java/build/contrib/queries/classes/java:/srv/gump/public/workspace/lucene-java/build/contrib/queryparser/classes/java:/srv/gump/public/workspace/lucene-java/build/contrib/regex/classes/java:/srv/gump/public/workspace/lucene-java/build/contrib/remote/clas
 ses/java:/srv/gump/public/workspace/lucene-java/build/contrib/similarity/classes/java:/srv/gump/public/workspace/lucene-java/build/contrib/snowball/classes/java:/srv/gump/public/workspace/lucene-java/build/contrib/spatial/classes/java:/srv/gump/public/workspace/lucene-java/build/contrib/spellchecker/classes/java:/srv/gump/public/workspace/lucene-java/build/contrib/surround/classes/java:/srv/gump/public/workspace/lucene-java/build/contrib/swing/classes/java:/srv/gump/public/workspace/lucene-java/build/contrib/wikipedia/classes/java:/srv/gump/public/workspace/lucene-java/build/contrib/wordnet/classes/java:/srv/gump/public/workspace/lucene-java/build/contrib/xml-query-parser/classes/java:/srv/gump/public/workspace/ant/dist/lib/ant-jmf.jar:/srv/gump/public/workspace/ant/dist/lib/ant-swing.jar:/srv/gump/public/workspace/ant/dist/lib/ant-apache-resolver.jar:/srv/gump/public/workspace/ant/dist/lib/ant-apache-xalan2.jar:/srv/gump/public/workspace/ant/dist/lib/ant-junit.jar:/srv/gump
 /public/workspace/ant/dist/lib/ant-launcher.jar:/srv/gump/public/workspace/ant/dist/lib/ant.jar:/srv/gump/packages/junit3.8.1/junit.jar:/srv/gump/public/workspace/xml-commons/java/build/resolver.jar:/srv/gump/packages/je-1.7.1/lib/je.jar:/srv/gump/public/workspace/apache-commons/digester/dist/commons-digester.jar:/srv/gump/public/workspace/icu4j/main/classes/core/out/lib/icu4j-core.jar:/srv/gump/public/workspace/icu4j/main/classes/charset/out/lib/icu4j-charsets.jar:/srv/gump/public/workspace/icu4j/main/classes/collate/out/lib/icu4j-collate.jar:/srv/gump/public/workspace/icu4j/main/classes/translit/out/lib/icu4j-translit.jar:/srv/gump/public/workspace/jakarta-regexp/build/jakarta-regexp-27052010.jar:/srv/gump/packages/javacc-3.1/bin/lib/javacc.jar:/srv/gump/public/workspace/jline/target/jline-0.9.95-SNAPSHOT.jar:/srv/gump/packages/jtidy/jtidy-r938.jar:/srv/gump/public/workspace/junit/dist/junit-27052010.jar:/srv/gump/public/workspace/xml-commons/java/external/build/xml-apis-e
 xt.jar:/srv/gump/packages/caucho-libs/hessian-3.0.8.jar:/srv/gump/public/workspace/apache-commons/compress/target/commons-compress-1.1-SNAPSHOT.jar:/srv/gump/public/workspace/apache-commons/logging/target/commons-logging-27052010.jar:/srv/gump/public/workspace/apache-commons/logging/target/commons-logging-api-27052010.jar:/srv/gump/public/workspace/jakarta-servletapi-5/jsr154/dist/lib/servlet-api.jar:/srv/gump/packages/nekohtml-0.9.5/nekohtml.jar
---------------------------------------------
Buildfile: /srv/gump/public/workspace/lucene-java/build.xml

jflex-uptodate-check:

jflex-notice:

javacc-uptodate-check:

javacc-notice:

init:

clover.setup:

clover.info:
     [echo] 
     [echo]       Clover not found. Code coverage reports disabled.
     [echo]   	

clover:

common.compile-core:
    [mkdir] Created dir: /srv/gump/public/workspace/lucene-java/build/classes/java
    [javac] Compiling 478 source files to /srv/gump/public/workspace/lucene-java/build/classes/java
    [javac] Note: Some input files use or override a deprecated API.
    [javac] Note: Recompile with -Xlint:deprecation for details.

compile-core:

jar-core:
      [jar] Building jar: /srv/gump/public/workspace/lucene-java/build/lucene-core-27052010.jar

compile-test:
    [mkdir] Created dir: /srv/gump/public/workspace/lucene-java/build/classes/test
    [javac] Compiling 237 source files to /srv/gump/public/workspace/lucene-java/build/classes/test
    [javac] Note: Some input files use or override a deprecated API.
    [javac] Note: Recompile with -Xlint:deprecation for details.
     [copy] Copying 23 files to /srv/gump/public/workspace/lucene-java/build/classes/test

build-contrib:
     [echo] Building ant...

compile-analyzers-common:

BUILD FAILED
/srv/gump/public/workspace/lucene-java/build.xml:586: The following error occurred while executing this line:
/srv/gump/public/workspace/lucene-java/build.xml:575: The following error occurred while executing this line:
/srv/gump/public/workspace/lucene-java/contrib/ant/build.xml:49: /srv/gump/public/workspace/modules/analysis/common does not exist.

Total time: 15 seconds
---------------------------------------------

To subscribe to this information via syndicated feeds:
- RSS: http://vmgump.apache.org/gump/public/lucene-java/lucene-java/rss.xml
- Atom: http://vmgump.apache.org/gump/public/lucene-java/lucene-java/atom.xml

============================== Gump Tracking Only ===
Produced by Gump version 2.3.
Gump Run 05001627052010, vmgump:vmgump-public:05001627052010
Gump E-mail Identifier (unique within run) #11.

*********************************************************** G U M P
[GUMP@vmgump]: Project slf4j-test (in module slf4j) failed
To whom it may engage...
        
This is an automated request, but not an unsolicited one. For 
more information please visit http://gump.apache.org/nagged.html, 
and/or contact the folk at general@gump.apache.org.

Project slf4j-test has an issue affecting its community integration.
This issue affects 1 projects.
The current state of this project is 'Failed', with reason 'Build Failed'.
For reference only, the following projects are affected by this:
    - slf4j-test :  Simple Logging Facade for Java


Full details are available at:
    http://vmgump.apache.org/gump/public/slf4j/slf4j-test/index.html

That said, some information snippets are provided here.

The following annotations (debug/informational/warning/error messages) were provided:
 -WARNING- Overriding Maven2 settings: [/srv/gump/public/workspace/slf4j/gump_mvn_settings.xml]
 -DEBUG- (Gump generated) Maven2 Settings in: /srv/gump/public/workspace/slf4j/gump_mvn_settings.xml
 -INFO- Failed with reason build failed
 -DEBUG- Maven POM in: /srv/gump/public/workspace/slf4j/pom.xml



The following work was performed:
http://vmgump.apache.org/gump/public/slf4j/slf4j-test/gump_work/build_slf4j_slf4j-test.html
Work Name: build_slf4j_slf4j-test (Type: Build)
Work ended in a state of : Failed
Elapsed: 35 secs
Command Line: mvn --batch-mode --settings /srv/gump/public/workspace/slf4j/gump_mvn_settings.xml package 
[Working Directory: /srv/gump/public/workspace/slf4j]
CLASSPATH: /usr/lib/jvm/java-6-sun/lib/tools.jar:/srv/gump/public/workspace/slf4j/slf4j-migrator/target/slf4j-migrator-1.5.9-SNAPSHOT.jar:/srv/gump/public/workspace/slf4j/slf4j-nop/target/slf4j-nop-1.5.9-SNAPSHOT.jar:/srv/gump/public/workspace/slf4j/log4j-over-slf4j/target/log4j-over-slf4j-1.5.9-SNAPSHOT.jar:/srv/gump/public/workspace/slf4j/slf4j-log4j12/target/slf4j-log4j12-1.5.9-SNAPSHOT.jar:/srv/gump/public/workspace/slf4j/slf4j-jcl/target/slf4j-jcl-1.5.9-SNAPSHOT.jar:/srv/gump/public/workspace/slf4j/slf4j-api/target/slf4j-api-1.5.9-SNAPSHOT.jar:/srv/gump/public/workspace/slf4j/jcl104-over-slf4j/target/jcl104-over-slf4j-1.5.9-SNAPSHOT.jar:/srv/gump/public/workspace/slf4j/slf4j-jdk14/target/slf4j-jdk14-1.5.9-SNAPSHOT.jar:/srv/gump/public/workspace/slf4j/slf4j-simple/target/slf4j-simple-1.5.9-SNAPSHOT.jar:/srv/gump/public/workspace/slf4j/slf4j-ext/target/slf4j-ext-1.5.9-SNAPSHOT.jar:/srv/gump/public/workspace/slf4j/jcl-over-slf4j/target/jcl-over-slf4j-1.5.9-SNAPSHOT.jar:/srv
 /gump/public/workspace/slf4j/jul-to-slf4j/target/jul-to-slf4j-1.5.9-SNAPSHOT.jar
---------------------------------------------
[INFO] [resources:resources {execution: default-resources}]
[WARNING] File encoding has not been set, using platform encoding UTF-8, i.e. build is platform dependent!
[WARNING] Using platform encoding (UTF-8 actually) to copy filtered resources, i.e. build is platform dependent!
[INFO] skip non existing resourceDirectory /srv/gump/public/workspace/slf4j/integration/src/main/resources
[INFO] [compiler:compile {execution: default-compile}]
[INFO] Nothing to compile - all classes are up to date
[INFO] [resources:testResources {execution: default-testResources}]
[WARNING] Using platform encoding (UTF-8 actually) to copy filtered resources, i.e. build is platform dependent!
[INFO] skip non existing resourceDirectory /srv/gump/public/workspace/slf4j/integration/src/test/resources
[INFO] [compiler:testCompile {execution: default-testCompile}]
[INFO] Nothing to compile - all classes are up to date
[INFO] [surefire:test {execution: default-test}]
[INFO] Surefire report directory: /srv/gump/public/workspace/slf4j/integration/target/surefire-reports

-------------------------------------------------------
 T E S T S
-------------------------------------------------------
There are no tests to run.

Results :

Tests run: 0, Failures: 0, Errors: 0, Skipped: 0

[INFO] [jar:jar {execution: default-jar}]
[WARNING] JAR will be empty - no content was marked for inclusion!
[INFO] [antrun:run {execution: ant-test}]
[INFO] Executing tasks
     [echo] compile classpath: /srv/gump/public/workspace/slf4j/integration/target/classes:/srv/gump/public/workspace/slf4j/slf4j-api/target/slf4j-api-1.5.9-SNAPSHOT.jar:/srv/gump/public/workspace/mvnlocalrepo/shared/junit/junit/3.8.1/junit-3.8.1.jar:/srv/gump/public/workspace/mvnlocalrepo/shared/ant/ant-junit/1.6.5/ant-junit-1.6.5.jar
     [echo] runtime classpath: /srv/gump/public/workspace/slf4j/integration/target/classes:/srv/gump/public/workspace/slf4j/slf4j-api/target/slf4j-api-1.5.9-SNAPSHOT.jar:/srv/gump/public/workspace/mvnlocalrepo/shared/junit/junit/3.8.1/junit-3.8.1.jar:/srv/gump/public/workspace/mvnlocalrepo/shared/ant/ant-junit/1.6.5/ant-junit-1.6.5.jar
     [echo] test classpath:    /srv/gump/public/workspace/slf4j/integration/target/test-classes:/srv/gump/public/workspace/slf4j/integration/target/classes:/srv/gump/public/workspace/slf4j/slf4j-api/target/slf4j-api-1.5.9-SNAPSHOT.jar:/srv/gump/public/workspace/mvnlocalrepo/shared/junit/junit/3.8.1/junit-3.8.1.jar:/srv/gump/public/workspace/mvnlocalrepo/shared/ant/ant-junit/1.6.5/ant-junit-1.6.5.jar
     [echo] plugin classpath:  /srv/gump/public/workspace/mvnlocalrepo/shared/junit/junit/3.8.1/junit-3.8.1.jar:/srv/gump/public/workspace/mvnlocalrepo/shared/ant/ant-junit/1.6.5/ant-junit-1.6.5.jar:/srv/gump/public/workspace/mvnlocalrepo/shared/org/codehaus/plexus/plexus-utils/1.1/plexus-utils-1.1.jar:/srv/gump/public/workspace/mvnlocalrepo/shared/ant/ant-launcher/1.6.5/ant-launcher-1.6.5.jar:/srv/gump/public/workspace/mvnlocalrepo/shared/ant/ant/1.6.5/ant-1.6.5.jar:/opt/maven2/lib/maven-2.2.1-uber.jar

init:

testMismatch:
    [junit] Running org.slf4j.VersionMismatchTest
    [junit] Tests run: 1, Failures: 1, Errors: 0, Time elapsed: 0.047 sec
[INFO] ------------------------------------------------------------------------
[ERROR] BUILD ERROR
[INFO] ------------------------------------------------------------------------
[INFO] An Ant BuildException has occured: The following error occurred while executing this line:
/srv/gump/public/workspace/slf4j/integration/build.xml:64: Test org.slf4j.VersionMismatchTest failed

[INFO] ------------------------------------------------------------------------
[INFO] For more information, run Maven with the -e switch
[INFO] ------------------------------------------------------------------------
[INFO] Total time: 33 seconds
[INFO] Finished at: Thu May 27 19:50:58 PDT 2010
[INFO] Final Memory: 21M/39M
[INFO] ------------------------------------------------------------------------
---------------------------------------------

To subscribe to this information via syndicated feeds:
- RSS: http://vmgump.apache.org/gump/public/slf4j/slf4j-test/rss.xml
- Atom: http://vmgump.apache.org/gump/public/slf4j/slf4j-test/atom.xml

============================== Gump Tracking Only ===
Produced by Gump version 2.3.
Gump Run 05001627052010, vmgump:vmgump-public:05001627052010
Gump E-mail Identifier (unique within run) #12.

*********************************************************** G U M P
[GUMP@vmgump]: Project xml-security-tests (in module xml-security) failed
To whom it may engage...
        
This is an automated request, but not an unsolicited one. For 
more information please visit http://gump.apache.org/nagged.html, 
and/or contact the folk at general@gump.apache.org.

Project xml-security-tests has an issue affecting its community integration.
This issue affects 1 projects.
The current state of this project is 'Failed', with reason 'Build Failed'.
For reference only, the following projects are affected by this:
    - xml-security-tests :  XML-Signature Syntax and Processing


Full details are available at:
    http://vmgump.apache.org/gump/public/xml-security/xml-security-tests/index.html

That said, some information snippets are provided here.

The following annotations (debug/informational/warning/error messages) were provided:
 -DEBUG- Dependency on jce exists, no need to add for property lib.jce.
 -INFO- Failed with reason build failed



The following work was performed:
http://vmgump.apache.org/gump/public/xml-security/xml-security-tests/gump_work/build_xml-security_xml-security-tests.html
Work Name: build_xml-security_xml-security-tests (Type: Build)
Work ended in a state of : Failed
Elapsed: 2 mins 18 secs
Command Line: /usr/lib/jvm/java-6-sun/bin/java -Djava.awt.headless=true -Dant.build.clonevm=true -Xbootclasspath/p:/srv/gump/public/workspace/xml-commons/java/external/build/xml-apis.jar:/srv/gump/public/workspace/xml-xerces2/build/xercesImpl.jar:/srv/gump/public/workspace/xml-xalan/build/serializer.jar:/srv/gump/public/workspace/xml-xalan/build/xalan-unbundled.jar org.apache.tools.ant.Main -Dgump.merge=/srv/gump/public/gump/work/merge.xml -Dbuild.sysclasspath=only -Djce.download.sha1=c1f0e975e8c8e0a0105787b249a50615b485d109 -Dlib.jce=/srv/gump/packages/jce/jce-jdk13-116.jar -Djce.download.md5=85c64cd754719a4bc8da7e9aa0e113fd test 
[Working Directory: /srv/gump/public/workspace/xml-security]
CLASSPATH: /usr/lib/jvm/java-6-sun/lib/tools.jar:/srv/gump/public/workspace/xml-security/build/test:/srv/gump/public/workspace/xml-security:/srv/gump/public/workspace/xml-security/build/xmlsec-27052010.jar:/srv/gump/public/workspace/ant/dist/lib/ant-jmf.jar:/srv/gump/public/workspace/ant/dist/lib/ant-swing.jar:/srv/gump/public/workspace/ant/dist/lib/ant-apache-resolver.jar:/srv/gump/public/workspace/ant/dist/lib/ant-apache-xalan2.jar:/srv/gump/public/workspace/ant/dist/lib/ant-junit.jar:/srv/gump/public/workspace/ant/dist/lib/ant-launcher.jar:/srv/gump/public/workspace/ant/dist/lib/ant.jar:/srv/gump/packages/junit3.8.1/junit.jar:/srv/gump/public/workspace/xml-commons/java/build/resolver.jar:/srv/gump/public/workspace/xml-commons/java/external/build/xml-apis-ext.jar:/srv/gump/packages/jce/jce-jdk13-116.jar:/srv/gump/public/workspace/apache-commons/logging/target/commons-logging-27052010.jar:/srv/gump/public/workspace/apache-commons/logging/target/commons-logging-api-27052010.j
 ar:/srv/gump/public/workspace/junit/dist/junit-27052010.jar
---------------------------------------------
    [junit] 	at org.apache.xml.security.encryption.XMLCipher.decryptElement(Unknown Source)
    [junit] 	at org.apache.xml.security.encryption.XMLCipher.doFinal(Unknown Source)
    [junit] 	at org.apache.xml.security.test.encryption.BaltimoreEncTest.decryptElement(Unknown Source)
    [junit] 	at org.apache.xml.security.test.encryption.BaltimoreEncTest.test_five_element_aes192_cbc_ref(Unknown Source)
    [junit] 
    [junit] Testcase: test_five_data_aes128_cbc took 0.027 sec
    [junit] Testcase: test_five_data_aes256_cbc_3des took 0.037 sec
    [junit] 	Caused an ERROR
    [junit] Illegal key size
    [junit] org.apache.xml.security.encryption.XMLEncryptionException: Illegal key size
    [junit] Original Exception was java.security.InvalidKeyException: Illegal key size
    [junit] 	at org.apache.xml.security.encryption.XMLCipher.decryptToByteArray(Unknown Source)
    [junit] 	at org.apache.xml.security.test.encryption.BaltimoreEncTest.decryptData(Unknown Source)
    [junit] 	at org.apache.xml.security.test.encryption.BaltimoreEncTest.test_five_data_aes256_cbc_3des(Unknown Source)
    [junit] java.security.InvalidKeyException: Illegal key size
    [junit] 	at javax.crypto.Cipher.a(DashoA13*..)
    [junit] 	at javax.crypto.Cipher.init(DashoA13*..)
    [junit] 	at javax.crypto.Cipher.init(DashoA13*..)
    [junit] 	at org.apache.xml.security.encryption.XMLCipher.decryptToByteArray(Unknown Source)
    [junit] 	at org.apache.xml.security.test.encryption.BaltimoreEncTest.decryptData(Unknown Source)
    [junit] 	at org.apache.xml.security.test.encryption.BaltimoreEncTest.test_five_data_aes256_cbc_3des(Unknown Source)
    [junit] 
    [junit] Testcase: test_five_data_aes192_cbc_aes256 took 0.035 sec
    [junit] 	Caused an ERROR
    [junit] Illegal key size
    [junit] org.apache.xml.security.encryption.XMLEncryptionException: Illegal key size
    [junit] Original Exception was java.security.InvalidKeyException: Illegal key size
    [junit] 	at org.apache.xml.security.encryption.XMLCipher.decryptToByteArray(Unknown Source)
    [junit] 	at org.apache.xml.security.test.encryption.BaltimoreEncTest.decryptData(Unknown Source)
    [junit] 	at org.apache.xml.security.test.encryption.BaltimoreEncTest.test_five_data_aes192_cbc_aes256(Unknown Source)
    [junit] java.security.InvalidKeyException: Illegal key size
    [junit] 	at javax.crypto.Cipher.a(DashoA13*..)
    [junit] 	at javax.crypto.Cipher.init(DashoA13*..)
    [junit] 	at javax.crypto.Cipher.init(DashoA13*..)
    [junit] 	at org.apache.xml.security.encryption.XMLCipher.decryptToByteArray(Unknown Source)
    [junit] 	at org.apache.xml.security.test.encryption.BaltimoreEncTest.decryptData(Unknown Source)
    [junit] 	at org.apache.xml.security.test.encryption.BaltimoreEncTest.test_five_data_aes192_cbc_aes256(Unknown Source)
    [junit] 
    [junit] Testcase: test_five_data_3des_cbc_rsa_oaep took 0.249 sec
    [junit] Testcase: testContentRemoved took 0.011 sec
    [junit] Test org.apache.xml.security.test.AllTests FAILED
[junitreport] Processing /srv/gump/public/workspace/xml-security/build/docs/xml/junit/TESTS-TestSuites.xml to /tmp/null1731473783
[junitreport] Loading stylesheet jar:file:/srv/gump/public/workspace/ant/dist/lib/ant-junit.jar!/org/apache/tools/ant/taskdefs/optional/junit/xsl/junit-frames.xsl
[junitreport] Transform time: 3989ms
[junitreport] Deleting: /tmp/null1731473783

BUILD FAILED
/srv/gump/public/workspace/xml-security/build.xml:377: Unit Tests Failed

Total time: 2 minutes 17 seconds
---------------------------------------------

To subscribe to this information via syndicated feeds:
- RSS: http://vmgump.apache.org/gump/public/xml-security/xml-security-tests/rss.xml
- Atom: http://vmgump.apache.org/gump/public/xml-security/xml-security-tests/atom.xml

============================== Gump Tracking Only ===
Produced by Gump version 2.3.
Gump Run 05001627052010, vmgump:vmgump-public:05001627052010
Gump E-mail Identifier (unique within run) #13.

*********************************************************** G U M P
[GUMP@vmgump]: Project muse (in module muse) failed
To whom it may engage...
        
This is an automated request, but not an unsolicited one. For 
more information please visit http://gump.apache.org/nagged.html, 
and/or contact the folk at general@gump.apache.org.

Project muse has an issue affecting its community integration.
This issue affects 1 projects.
The current state of this project is 'Failed', with reason 'Build Failed'.
For reference only, the following projects are affected by this:
    - muse :  Java-based implementation of the WS-ResourceFramework
  (WSR...


Full details are available at:
    http://vmgump.apache.org/gump/public/muse/muse/index.html

That said, some information snippets are provided here.

The following annotations (debug/informational/warning/error messages) were provided:
 -DEBUG- Sole output [muse-27052010.jar] identifier set to project name
 -DEBUG- Dependency on commonj exists, no need to add for property maven.jar.commonj-twm-api.
 -DEBUG- Dependency on xml-xmlbeans-v1 exists, no need to add for property maven.jar.xmlbeans-jsr173-api.
 -DEBUG- Dependency on velocity-engine exists, no need to add for property maven.jar.velocity.
 -DEBUG- (Gump generated) Maven Properties in: /srv/gump/public/workspace/muse/build.properties
 -INFO- Failed with reason build failed
 -INFO- Failed to extract fallback artifacts from Gump Repository



The following work was performed:
http://vmgump.apache.org/gump/public/muse/muse/gump_work/build_muse_muse.html
Work Name: build_muse_muse (Type: Build)
Work ended in a state of : Failed
Elapsed: 3 secs
Command Line: maven --offline jar 
[Working Directory: /srv/gump/public/workspace/muse]
CLASSPATH: /usr/lib/jvm/java-6-sun/lib/tools.jar:/srv/gump/public/workspace/muse/target/classes:/srv/gump/public/workspace/ws-addressing/target/addressing-27052010.jar:/srv/gump/public/workspace/ant/dist/lib/ant-jmf.jar:/srv/gump/public/workspace/ant/dist/lib/ant-swing.jar:/srv/gump/public/workspace/ant/dist/lib/ant-apache-resolver.jar:/srv/gump/public/workspace/ant/dist/lib/ant-apache-xalan2.jar:/srv/gump/public/workspace/ant/dist/lib/ant-junit.jar:/srv/gump/public/workspace/ant/dist/lib/ant-launcher.jar:/srv/gump/public/workspace/ant/dist/lib/ant.jar:/srv/gump/packages/commonj/commonj-twm.jar:/srv/gump/public/workspace/apache-commons/cli/target/commons-cli-27052010.jar:/srv/gump/public/workspace/apache-commons/discovery/dist/commons-discovery.jar:/srv/gump/public/workspace/apache-commons/digester/dist/commons-digester.jar:/srv/gump/public/workspace/httpcomponents/oac.hc3x/dist/commons-httpclient.jar:/srv/gump/public/workspace/apache-commons/io/target/commons-io-2.0-SNAPSHOT
 .jar:/srv/gump/public/workspace/apache-commons/lang/target/commons-lang-3.0-SNAPSHOT.jar:/srv/gump/public/workspace/apache-commons/logging/target/commons-logging-27052010.jar:/srv/gump/public/workspace/apache-commons/logging/target/commons-logging-api-27052010.jar:/srv/gump/packages/dougLea/concurrent.jar:/srv/gump/public/workspace/jakarta-servletapi/dist/lib/servlet.jar:/srv/gump/public/workspace/jaxen/target/jaxen-27052010.jar:/srv/gump/public/workspace/velocity-engine/bin/velocity-27052010.jar:/srv/gump/public/workspace/ws-axis/build/lib/axis.jar:/srv/gump/public/workspace/ws-axis/build/lib/saaj.jar:/srv/gump/public/workspace/ws-axis/build/lib/axis-ant.jar:/srv/gump/public/workspace/ws-axis/build/lib/jaxrpc.jar:/srv/gump/public/workspace/wsdl4j/build/lib/qname.jar:/srv/gump/public/workspace/wsdl4j/build/lib/wsdl4j.jar:/srv/gump/public/workspace/xml-xmlbeans/build/lib/xbean_xpath.jar:/srv/gump/public/workspace/xml-xmlbeans/build/lib/xmlpublic.jar:/srv/gump/public/workspace
 /xml-xmlbeans/build/lib/xbean.jar
---------------------------------------------
 __  __
|  \/  |__ _Apache__ ___
| |\/| / _` \ V / -_) ' \  ~ intelligent projects ~
|_|  |_\__,_|\_/\___|_||_|  v. 1.0.2

build:start:

java:prepare-filesystem:
    [mkdir] Created dir: /srv/gump/public/workspace/muse/target/classes

java:compile:
    [echo] Compiling to /srv/gump/public/workspace/muse/target/classes
    [echo] No java source files to compile.
resources or todir was null

java:jar-resources:

test:prepare-filesystem:
    [mkdir] Created dir: /srv/gump/public/workspace/muse/target/test-classes
    [mkdir] Created dir: /srv/gump/public/workspace/muse/target/test-reports

test:test-resources:

test:compile:
    [echo] No test source files to compile.

test:test:
    [echo] No tests to run.

BUILD FAILED
File...... /home/gump/.maven/cache/maven-jar-plugin-1.6.1/plugin.jelly
Element... ant:fail
Line...... 53
Column.... 19
You must define currentVersion in your POM.
Total time: 2 seconds
Finished at: Thu May 27 20:13:41 PDT 2010

---------------------------------------------

To subscribe to this information via syndicated feeds:
- RSS: http://vmgump.apache.org/gump/public/muse/muse/rss.xml
- Atom: http://vmgump.apache.org/gump/public/muse/muse/atom.xml

============================== Gump Tracking Only ===
Produced by Gump version 2.3.
Gump Run 05001627052010, vmgump:vmgump-public:05001627052010
Gump E-mail Identifier (unique within run) #15.

*********************************************************** G U M P
[GUMP@vmgump]: Project JacORB-idllib (in module JacORB) failed
To whom it may engage...
        
This is an automated request, but not an unsolicited one. For 
more information please visit http://gump.apache.org/nagged.html, 
and/or contact the folk at general@gump.apache.org.

Project JacORB-idllib has an issue affecting its community integration.
This issue affects 2 projects.
The current state of this project is 'Failed', with reason 'Build Failed'.
For reference only, the following projects are affected by this:
    - JacORB :  The free Java implementation of the OMG's CORBA standard.
    - JacORB-idllib :  The free Java implementation of the OMG's CORBA standard.


Full details are available at:
    http://vmgump.apache.org/gump/public/JacORB/JacORB-idllib/index.html

That said, some information snippets are provided here.

The following annotations (debug/informational/warning/error messages) were provided:
 -DEBUG- Sole output [idl.jar] identifier set to project name
 -INFO- Failed with reason build failed
 -INFO- Failed to extract fallback artifacts from Gump Repository



The following work was performed:
http://vmgump.apache.org/gump/public/JacORB/JacORB-idllib/gump_work/build_JacORB_JacORB-idllib.html
Work Name: build_JacORB_JacORB-idllib (Type: Build)
Work ended in a state of : Failed
Elapsed: 6 secs
Command Line: /usr/lib/jvm/java-6-sun/bin/java -Djava.awt.headless=true -Xbootclasspath/p:/srv/gump/public/workspace/xml-commons/java/external/build/xml-apis.jar:/srv/gump/public/workspace/xml-xerces2/build/xercesImpl.jar org.apache.tools.ant.Main -Dgump.merge=/srv/gump/public/gump/work/merge.xml -Dbuild.sysclasspath=only init idllib 
[Working Directory: /srv/gump/public/workspace/JacORB]
CLASSPATH: /usr/lib/jvm/java-6-sun/lib/tools.jar:/srv/gump/public/workspace/ant/build/lib/ant-apache-xalan2.jar:/srv/gump/public/workspace/ant/build/lib/ant-swing.jar:/srv/gump/public/workspace/ant/build/lib/ant-junit.jar:/srv/gump/public/workspace/ant/build/lib/ant-jmf.jar:/srv/gump/public/workspace/ant/build/lib/ant-apache-resolver.jar:/srv/gump/public/workspace/ant/build/lib/ant-javamail.jar:/srv/gump/public/workspace/ant/build/lib/ant-apache-bcel.jar:/srv/gump/public/workspace/ant/build/lib/ant-apache-regexp.jar:/srv/gump/public/workspace/ant/build/lib/ant-commons-net.jar:/srv/gump/public/workspace/ant/build/lib/ant-jsch.jar:/srv/gump/public/workspace/ant/build/lib/ant-apache-log4j.jar:/srv/gump/public/workspace/ant/build/lib/ant-antlr.jar:/srv/gump/public/workspace/ant/build/lib/ant-commons-logging.jar:/srv/gump/public/workspace/ant/build/lib/ant-jdepend.jar:/srv/gump/public/workspace/ant/build/lib/ant-apache-bsf.jar:/srv/gump/public/workspace/ant/build/lib/ant-launcher.
 jar:/srv/gump/public/workspace/ant/build/lib/ant-apache-oro.jar:/srv/gump/public/workspace/ant/build/lib/ant.jar:/srv/gump/public/workspace/ant/build/lib/ant-jai.jar:/srv/gump/public/workspace/xml-commons/java/external/build/xml-apis-ext.jar:/srv/gump/packages/antlr/antlr-3.1.3.jar:/srv/gump/public/workspace/excalibur/framework/api/target/avalon-framework-api-4.3.2-SNAPSHOT.jar:/srv/gump/packages/dougLea/concurrent.jar:/srv/gump/packages/avalon/avalon-logkit-2.1.jar:/srv/gump/public/workspace/xml-xalan/tools/java_cup.jar:/srv/gump/public/workspace/xml-xalan/lib/runtime.jar
---------------------------------------------
    [javac] location: package org.jacorb.idl.runtime
    [javac]               CUP$parser$result = new org.jacorb.idl.runtime.Symbol(89/*param_dcls*/, ((org.jacorb.idl.runtime.Symbol)CUP$parser$stack.elementAt(CUP$parser$top-2)).left, ((org.jacorb.idl.runtime.Symbol)CUP$parser$stack.elementAt(CUP$parser$top-0)).right, RESULT);
    [javac]                                                                                                                                                                                                   ^
    [javac] /srv/gump/public/workspace/JacORB/src/org/jacorb/idl/parser.java:2099: cannot find symbol
    [javac] symbol  : class Symbol
    [javac] location: package org.jacorb.idl.runtime
    [javac]               CUP$parser$result = new org.jacorb.idl.runtime.Symbol(91/*parameter_dcls*/, ((org.jacorb.idl.runtime.Symbol)CUP$parser$stack.elementAt(CUP$parser$top-1)).left, ((org.jacorb.idl.runtime.Symbol)CUP$parser$stack.elementAt(CUP$parser$top-0)).right, RESULT);
    [javac]                                                             ^
    [javac] /srv/gump/public/workspace/JacORB/src/org/jacorb/idl/parser.java:2099: cannot find symbol
    [javac] symbol  : class Symbol
    [javac] location: package org.jacorb.idl.runtime
    [javac]               CUP$parser$result = new org.jacorb.idl.runtime.Symbol(91/*parameter_dcls*/, ((org.jacorb.idl.runtime.Symbol)CUP$parser$stack.elementAt(CUP$parser$top-1)).left, ((org.jacorb.idl.runtime.Symbol)CUP$parser$stack.elementAt(CUP$parser$top-0)).right, RESULT);
    [javac]                                                                                                                   ^
    [javac] /srv/gump/public/workspace/JacORB/src/org/jacorb/idl/parser.java:2099: cannot find symbol
    [javac] symbol  : class Symbol
    [javac] location: package org.jacorb.idl.runtime
    [javac]               CUP$parser$result = new org.jacorb.idl.runtime.Symbol(91/*parameter_dcls*/, ((org.jacorb.idl.runtime.Symbol)CUP$parser$stack.elementAt(CUP$parser$top-1)).left, ((org.jacorb.idl.runtime.Symbol)CUP$parser$stack.elementAt(CUP$parser$top-0)).right, RESULT);
    [javac]                                                                                                                                                                                                       ^
    [javac] /srv/gump/public/workspace/JacORB/src/org/jacorb/idl/parser.java:2107: cannot find symbol
    [javac] symbol  : class Symbol
    [javac] location: package org.jacorb.idl.runtime
    [javac] 		int pdsleft = ((org.jacorb.idl.runtime.Symbol)CUP$parser$stack.elementAt(CUP$parser$top-1)).left;
    [javac] 		                                      ^
    [javac] /srv/gump/public/workspace/JacORB/src/org/jacorb/idl/parser.java:2108: cannot find symbol
    [javac] symbol  : class Symbol
    [javac] location: package org.jacorb.idl.runtime
    [javac] 		int pdsright = ((org.jacorb.idl.runtime.Symbol)CUP$parser$stack.elementAt(CUP$parser$top-1)).right;
    [javac] 		                                       ^
    [javac] /srv/gump/public/workspace/JacORB/src/org/jacorb/idl/parser.java:2109: cannot find symbol
    [javac] symbol  : class Symbol
    [javac] location: package org.jacorb.idl.runtime
    [javac] 		SymbolList pds = (SymbolList)((org.jacorb.idl.runtime.Symbol) CUP$parser$stack.elementAt(CUP$parser$top-1)).value;
    [javac] 		                                                     ^
    [javac] /srv/gump/public/workspace/JacORB/src/org/jacorb/idl/parser.java:2113: cannot find symbol
    [javac] symbol  : class Symbol
    [javac] location: package org.jacorb.idl.runtime
    [javac]               CUP$parser$result = new org.jacorb.idl.runtime.Symbol(91/*parameter_dcls*/, ((org.jacorb.idl.runtime.Symbol)CUP$parser$stack.elementAt(CUP$parser$top-2)).left, ((org.jacorb.idl.runtime.Symbol)CUP$parser$stack.elementAt(CUP$parser$top-0)).right, RESULT);
    [javac]                                                             ^
    [javac] Note: Some input files use or override a deprecated API.
    [javac] Note: Recompile with -Xlint:deprecation for details.
    [javac] Note: Some input files use unchecked or unsafe operations.
    [javac] Note: Recompile with -Xlint:unchecked for details.
    [javac] 100 errors

BUILD FAILED
/srv/gump/public/workspace/JacORB/build.xml:110: The following error occurred while executing this line:
/srv/gump/public/workspace/JacORB/src/org/jacorb/idl/build.xml:18: The following error occurred while executing this line:
/srv/gump/public/workspace/JacORB/etc/common.xml:83: Compile failed; see the compiler error output for details.

Total time: 5 seconds
---------------------------------------------

To subscribe to this information via syndicated feeds:
- RSS: http://vmgump.apache.org/gump/public/JacORB/JacORB-idllib/rss.xml
- Atom: http://vmgump.apache.org/gump/public/JacORB/JacORB-idllib/atom.xml

============================== Gump Tracking Only ===
Produced by Gump version 2.3.
Gump Run 05001627052010, vmgump:vmgump-public:05001627052010
Gump E-mail Identifier (unique within run) #16.

*********************************************************** G U M P
[GUMP@vmgump]: Project portals-pluto-portal-1.0 (in module portals-pluto-1.0) failed
To whom it may engage...
        
This is an automated request, but not an unsolicited one. For 
more information please visit http://gump.apache.org/nagged.html, 
and/or contact the folk at general@gump.apache.org.

Project portals-pluto-portal-1.0 has an issue affecting its community integration.
This issue affects 1 projects.
The current state of this project is 'Failed', with reason 'Build Failed'.
For reference only, the following projects are affected by this:
    - portals-pluto-portal-1.0 :  JSR168 Container


Full details are available at:
    http://vmgump.apache.org/gump/public/portals-pluto-1.0/portals-pluto-portal-1.0/index.html

That said, some information snippets are provided here.

The following annotations (debug/informational/warning/error messages) were provided:
 -DEBUG- Dependency on ant exists, no need to add for property env.ANT_HOME.
 -INFO- Failed with reason build failed
 -INFO- Failed to extract fallback artifacts from Gump Repository



The following work was performed:
http://vmgump.apache.org/gump/public/portals-pluto-1.0/portals-pluto-portal-1.0/gump_work/build_portals-pluto-1.0_portals-pluto-portal-1.0.html
Work Name: build_portals-pluto-1.0_portals-pluto-portal-1.0 (Type: Build)
Work ended in a state of : Failed
Elapsed: 4 secs
Command Line: /usr/lib/jvm/java-6-sun/bin/java -Djava.awt.headless=true -Xbootclasspath/p:/srv/gump/public/workspace/xml-commons/java/external/build/xml-apis.jar:/srv/gump/public/workspace/xml-xerces2/build/xercesImpl.jar org.apache.tools.ant.Main -Dgump.merge=/srv/gump/public/gump/work/merge.xml -Dbuild.sysclasspath=only -Denv.ANT_HOME=/srv/gump/public/workspace/ant/dist -Dversion=27052010 -Dfinal.portal.name=pluto-portal-impl-27052010 all 
[Working Directory: /srv/gump/public/workspace/portals-pluto-1.0]
CLASSPATH: /usr/lib/jvm/java-6-sun/lib/tools.jar:/srv/gump/public/workspace/portals-pluto-1.0/build/ant/lib/ForeachTask.jar:/srv/gump/public/workspace/ant/dist/lib/ant-jmf.jar:/srv/gump/public/workspace/ant/dist/lib/ant-swing.jar:/srv/gump/public/workspace/ant/dist/lib/ant-apache-resolver.jar:/srv/gump/public/workspace/ant/dist/lib/ant-apache-xalan2.jar:/srv/gump/public/workspace/ant/dist/lib/ant-junit.jar:/srv/gump/public/workspace/ant/dist/lib/ant-launcher.jar:/srv/gump/public/workspace/ant/dist/lib/ant.jar:/srv/gump/packages/junit3.8.1/junit.jar:/srv/gump/public/workspace/xml-commons/java/build/resolver.jar:/srv/gump/public/workspace/castor/xml/target/castor-xml-1.3.2-SNAPSHOT.jar:/srv/gump/public/workspace/castor/schema/target/castor-xml-schema-1.3.2-SNAPSHOT.jar:/srv/gump/public/workspace/castor/codegen/target/castor-codegen-1.3.2-SNAPSHOT.jar:/srv/gump/public/workspace/castor/core/target/castor-core-1.3.2-SNAPSHOT.jar:/srv/gump/public/workspace/apache-commons/fileupload
 /target/commons-fileupload-27052010.jar:/srv/gump/public/workspace/apache-commons/logging/target/commons-logging-27052010.jar:/srv/gump/public/workspace/apache-commons/logging/target/commons-logging-api-27052010.jar:/srv/gump/public/workspace/junit/dist/junit-27052010.jar:/srv/gump/public/workspace/jakarta-regexp/build/jakarta-regexp-27052010.jar:/srv/gump/public/workspace/jakarta-servletapi-5/jsr154/dist/lib/servlet-api.jar:/srv/gump/public/workspace/jakarta-servletapi-5/jsr152/dist/lib/jsp-api.jar:/srv/gump/public/workspace/portals-pluto-1.0/api/target/portlet-api-1.0.jar:/srv/gump/public/workspace/portals-pluto-1.0/container/target/pluto-1.0.jar:/srv/gump/public/workspace/portals-pluto-1.0/descriptors/target/pluto-descriptors-1.0.jar:/srv/gump/public/workspace/xml-commons/java/external/build/xml-apis-ext.jar
---------------------------------------------

compile-tests:

internal-test:

test:

jar:

portal:

init:
    [mkdir] Created dir: /srv/gump/public/workspace/portals-pluto-1.0/portal/target/lib

get-deps:

compile:
    [mkdir] Created dir: /srv/gump/public/workspace/portals-pluto-1.0/portal/target/classes
    [javac] Compiling 149 source files to /srv/gump/public/workspace/portals-pluto-1.0/portal/target/classes
    [javac] /srv/gump/public/workspace/portals-pluto-1.0/portal/src/java/org/apache/pluto/portalImpl/Deploy.java:62: warning: [deprecation] org.apache.xml.serialize.OutputFormat in org.apache.xml.serialize has been deprecated
    [javac] import org.apache.xml.serialize.OutputFormat;
    [javac]                                ^
    [javac] /srv/gump/public/workspace/portals-pluto-1.0/portal/src/java/org/apache/pluto/portalImpl/Deploy.java:63: warning: [deprecation] org.apache.xml.serialize.XMLSerializer in org.apache.xml.serialize has been deprecated
    [javac] import org.apache.xml.serialize.XMLSerializer;
    [javac]                                ^
    [javac] /srv/gump/public/workspace/portals-pluto-1.0/portal/src/java/org/apache/pluto/portalImpl/core/PortalURL.java:179: warning: [deprecation] encode(java.lang.String) in java.net.URLEncoder has been deprecated
    [javac]         value = URLEncoder.encode(value);
    [javac]                           ^
    [javac] /srv/gump/public/workspace/portals-pluto-1.0/portal/src/java/org/apache/pluto/portalImpl/services/portletdefinitionregistry/PortletDefinitionRegistryServiceContextImpl.java:113: exception java.io.IOException is never thrown in body of corresponding try statement
    [javac]         } catch (IOException e) {
    [javac]           ^
    [javac] /srv/gump/public/workspace/portals-pluto-1.0/portal/src/java/org/apache/pluto/portalImpl/services/portletdefinitionregistry/PortletDefinitionRegistryServiceContextImpl.java:115: exception org.exolab.castor.mapping.MappingException is never thrown in body of corresponding try statement
    [javac]         } catch (MappingException e) {
    [javac]           ^
    [javac] /srv/gump/public/workspace/portals-pluto-1.0/portal/src/java/org/apache/pluto/portalImpl/services/portletdefinitionregistry/PortletDefinitionRegistryServiceFileImpl.java:233: warning: [deprecation] toURL() in java.io.File has been deprecated
    [javac]             source.setSystemId(portletXml.toURL().toExternalForm());
    [javac]                                          ^
    [javac] /srv/gump/public/workspace/portals-pluto-1.0/portal/src/java/org/apache/pluto/portlet/admin/services/DeployWarService.java:165: warning: [deprecation] org.apache.pluto.portalImpl.Deploy in org.apache.pluto.portalImpl has been deprecated
    [javac] 		            org.apache.pluto.portalImpl.Deploy.main(args);
    [javac] 		                                       ^
    [javac] Note: Some input files use unchecked or unsafe operations.
    [javac] Note: Recompile with -Xlint:unchecked for details.
    [javac] 2 errors
    [javac] 5 warnings

BUILD FAILED
/srv/gump/public/workspace/portals-pluto-1.0/build.xml:51: The following error occurred while executing this line:
/srv/gump/public/workspace/portals-pluto-1.0/portal/build.xml:50: Compile failed; see the compiler error output for details.

Total time: 3 seconds
---------------------------------------------

To subscribe to this information via syndicated feeds:
- RSS: http://vmgump.apache.org/gump/public/portals-pluto-1.0/portals-pluto-portal-1.0/rss.xml
- Atom: http://vmgump.apache.org/gump/public/portals-pluto-1.0/portals-pluto-portal-1.0/atom.xml

============================== Gump Tracking Only ===
Produced by Gump version 2.3.
Gump Run 05001627052010, vmgump:vmgump-public:05001627052010
Gump E-mail Identifier (unique within run) #25.

*********************************************************** G U M P
[GUMP@vmgump]: Project portals-bridges-velocity (in module portals-bridges) failed
To whom it may engage...
        
This is an automated request, but not an unsolicited one. For 
more information please visit http://gump.apache.org/nagged.html, 
and/or contact the folk at general@gump.apache.org.

Project portals-bridges-velocity has an issue affecting its community integration.
This issue affects 1 projects.
The current state of this project is 'Failed', with reason 'Build Failed'.
For reference only, the following projects are affected by this:
    - portals-bridges-velocity :  Support for JSR168 compliant Portlet development


Full details are available at:
    http://vmgump.apache.org/gump/public/portals-bridges/portals-bridges-velocity/index.html

That said, some information snippets are provided here.

The following annotations (debug/informational/warning/error messages) were provided:
 -DEBUG- Sole output [portals-bridges-velocity-*[0-9T].jar] identifier set to project name
 -DEBUG- (Gump generated) Maven2 Settings in: /srv/gump/public/workspace/portals-bridges/bridges-velocity/trunk/gump_mvn_settings.xml
 -INFO- Failed with reason build failed
 -DEBUG- Maven POM in: /srv/gump/public/workspace/portals-bridges/bridges-velocity/trunk/pom.xml
 -INFO- Failed to extract fallback artifacts from Gump Repository



The following work was performed:
http://vmgump.apache.org/gump/public/portals-bridges/portals-bridges-velocity/gump_work/build_portals-bridges_portals-bridges-velocity.html
Work Name: build_portals-bridges_portals-bridges-velocity (Type: Build)
Work ended in a state of : Failed
Elapsed: 11 secs
Command Line: mvn --batch-mode --settings /srv/gump/public/workspace/portals-bridges/bridges-velocity/trunk/gump_mvn_settings.xml install 
[Working Directory: /srv/gump/public/workspace/portals-bridges/bridges-velocity/trunk]
CLASSPATH: /usr/lib/jvm/java-6-sun/lib/tools.jar:/srv/gump/public/workspace/portals-bridges/bridges-pom/trunk/pom.xml:/srv/gump/public/workspace/tomcat-tc6/output/build/lib/servlet-api.jar:/srv/gump/public/workspace/portals-bridges/bridges-common/trunk/target/portals-bridges-common-2.1-SNAPSHOT.jar:/srv/gump/public/workspace/velocity-engine/bin/velocity-27052010.jar:/srv/gump/public/workspace/velocity-engine/bin/velocity-27052010-dep.jar:/srv/gump/public/workspace/velocity-tools/dist/velocity-tools-27052010.jar:/srv/gump/public/workspace/velocity-tools/dist/velocity-tools-view-27052010.jar
---------------------------------------------
[INFO] Scanning for projects...
[INFO] ------------------------------------------------------------------------
[INFO] Building Apache Portals Bridges Velocity Bridge
[INFO]    task-segment: [install]
[INFO] ------------------------------------------------------------------------
[INFO] Setting property: classpath.resource.loader.class => 'org.codehaus.plexus.velocity.ContextClassLoaderResourceLoader'.
[INFO] Setting property: velocimacro.messages.on => 'false'.
[INFO] Setting property: resource.loader => 'classpath'.
[INFO] Setting property: resource.manager.logwhenfound => 'false'.
[INFO] [remote-resources:process {execution: default}]
Downloading: http://localhost:8192/maven2/velocity-tools/velocity-tools/1.3/velocity-tools-1.3.pom
[INFO] Unable to find resource 'velocity-tools:velocity-tools:pom:1.3' in repository central (http://repo1.maven.org/maven2)
Downloading: http://localhost:8192/maven2/org/apache/portals/bridges/portals-bridges-common/2.0/portals-bridges-common-2.0.pom

Downloading: http://localhost:8192/maven2/org/apache/portals/bridges/portals-bridges-common/2.0/portals-bridges-common-2.0.jar
Downloading: http://localhost:8192/maven2/velocity-tools/velocity-tools/1.3/velocity-tools-1.3.jar
338K downloaded  (velocity-tools-1.3.jar)
21K downloaded  (portals-bridges-common-2.0.jar)
[INFO] [resources:resources {execution: default-resources}]
[INFO] Using 'UTF-8' encoding to copy filtered resources.
[INFO] skip non existing resourceDirectory /srv/gump/public/workspace/portals-bridges/bridges-velocity/trunk/src/main/resources
[INFO] Copying 3 resources
[INFO] [compiler:compile {execution: default-compile}]
[INFO] Compiling 3 source files to /srv/gump/public/workspace/portals-bridges/bridges-velocity/trunk/target/classes
[INFO] ------------------------------------------------------------------------
[ERROR] BUILD FAILURE
[INFO] ------------------------------------------------------------------------
[INFO] Compilation failure

/srv/gump/public/workspace/portals-bridges/bridges-velocity/trunk/src/main/java/org/apache/portals/bridges/velocity/BridgesVelocityViewServlet.java:[58,23] handleRequest(javax.servlet.http.HttpServletRequest,javax.servlet.http.HttpServletResponse,org.apache.velocity.context.Context) in org.apache.portals.bridges.velocity.BridgesVelocityViewServlet cannot override handleRequest(javax.servlet.http.HttpServletRequest,javax.servlet.http.HttpServletResponse,org.apache.velocity.context.Context) in org.apache.velocity.tools.view.VelocityViewServlet; overridden method does not throw java.lang.Exception

/srv/gump/public/workspace/portals-bridges/bridges-velocity/trunk/src/main/java/org/apache/portals/bridges/velocity/BridgesVelocityViewServlet.java:[92,19] mergeTemplate(org.apache.velocity.Template,org.apache.velocity.context.Context,javax.servlet.http.HttpServletResponse) in org.apache.portals.bridges.velocity.BridgesVelocityViewServlet cannot override mergeTemplate(org.apache.velocity.Template,org.apache.velocity.context.Context,javax.servlet.http.HttpServletResponse) in org.apache.velocity.tools.view.VelocityViewServlet; overridden method does not throw java.lang.Exception


[INFO] ------------------------------------------------------------------------
[INFO] For more information, run Maven with the -e switch
[INFO] ------------------------------------------------------------------------
[INFO] Total time: 10 seconds
[INFO] Finished at: Fri May 28 00:31:53 PDT 2010
[INFO] Final Memory: 17M/31M
[INFO] ------------------------------------------------------------------------
---------------------------------------------

To subscribe to this information via syndicated feeds:
- RSS: http://vmgump.apache.org/gump/public/portals-bridges/portals-bridges-velocity/rss.xml
- Atom: http://vmgump.apache.org/gump/public/portals-bridges/portals-bridges-velocity/atom.xml

============================== Gump Tracking Only ===
Produced by Gump version 2.3.
Gump Run 05001627052010, vmgump:vmgump-public:05001627052010
Gump E-mail Identifier (unique within run) #27.

*********************************************************** G U M P
[GUMP@vmgump]: Project maven-bootstrap (in module maven) failed
To whom it may engage...
        
This is an automated request, but not an unsolicited one. For 
more information please visit http://gump.apache.org/nagged.html, 
and/or contact the folk at general@gump.apache.org.

Project maven-bootstrap has an issue affecting its community integration.
This issue affects 1 projects.
The current state of this project is 'Failed', with reason 'Build Failed'.
For reference only, the following projects are affected by this:
    - maven-bootstrap :  Project Management Tools


Full details are available at:
    http://vmgump.apache.org/gump/public/maven/maven-bootstrap/index.html

That said, some information snippets are provided here.

The following annotations (debug/informational/warning/error messages) were provided:
 -DEBUG- Dependency on ant exists, no need to add for property maven.jar.ant.
 -DEBUG- Dependency on xml-commons-which exists, no need to add for property maven.jar.which.
 -INFO- Failed with reason build failed



The following work was performed:
http://vmgump.apache.org/gump/public/maven/maven-bootstrap/gump_work/build_maven_maven-bootstrap.html
Work Name: build_maven_maven-bootstrap (Type: Build)
Work ended in a state of : Failed
Elapsed: 13 secs
Command Line: /usr/lib/jvm/java-6-sun/bin/java -Djava.awt.headless=true -Xbootclasspath/p:/srv/gump/public/workspace/xml-commons/java/external/build/xml-apis.jar:/srv/gump/public/workspace/xml-xerces2/build/xercesImpl.jar org.apache.tools.ant.Main -Dgump.merge=/srv/gump/public/gump/work/merge.xml -Dbuild.sysclasspath=only -Dmaven.jar.ant=/srv/gump/public/workspace/ant/dist/lib/ant.jar -Dmaven.bootstrap.dir=/srv/gump/public/workspace/maven/bootstrap -Dmaven.repo.local=/srv/gump/public/workspace/maven/bootstrap/maven.local.repo -Dmaven.bootstrap.classes=/srv/gump/public/workspace/maven/bootstrap/bootstrap-classes -Dmaven.jar.commons-logging=/srv/gump/public/workspace/apache-commons/logging/target/commons-logging-27052010.jar -Dmaven.home=/srv/gump/public/workspace/maven/bootstrap/maven.home -Dmaven.home.local=/srv/gump/public/workspace/maven/bootstrap/maven.home -Dmaven.jar.commons-cli=/srv/gump/public/workspace/apache-commons/cli/target/commons-cli-27052010.jar -Dmaven.jar.ove
 rride=true -Dmaven.jar.commons-lang=/srv/gump/public/workspace/apache-commons/lang/target/commons-lang-3.0-SNAPSHOT.jar -Dmaven.jar.commons-httpclient=/srv/gump/public/workspace/httpcomponents/oac.hc3x/dist/commons-httpclient.jar -Dmaven.bootstrap.online=-o -Dmaven.bootstrap.phase1.classes=/srv/gump/public/workspace/maven/bootstrap/phase1-classes -Dmaven.jar.velocity=/srv/gump/public/workspace/velocity-engine/bin/velocity-27052010.jar -Dmaven.jar.which=/srv/gump/public/workspace/xml-commons/java/build/which.jar -Dmaven.jar.dom4j=/srv/gump/public/workspace/dom4j/build/dom4j.jar -f build-bootstrap.xml 
[Working Directory: /srv/gump/public/workspace/maven]
CLASSPATH: /usr/lib/jvm/java-6-sun/lib/tools.jar:/srv/gump/public/workspace/maven/bootstrap/bootstrap-classes:/srv/gump/public/workspace/ant/dist/lib/ant-jmf.jar:/srv/gump/public/workspace/ant/dist/lib/ant-swing.jar:/srv/gump/public/workspace/ant/dist/lib/ant-apache-resolver.jar:/srv/gump/public/workspace/ant/dist/lib/ant-apache-xalan2.jar:/srv/gump/public/workspace/ant/dist/lib/ant-junit.jar:/srv/gump/public/workspace/ant/dist/lib/ant-launcher.jar:/srv/gump/public/workspace/ant/dist/lib/ant.jar:/srv/gump/packages/junit3.8.1/junit.jar:/srv/gump/public/workspace/xml-commons/java/build/resolver.jar:/srv/gump/public/workspace/xml-commons/java/external/build/xml-apis-ext.jar:/srv/gump/public/workspace/apache-commons/betwixt/target/commons-betwixt-27052010.jar:/srv/gump/public/workspace/apache-commons/beanutils/dist/commons-beanutils-27052010.jar:/srv/gump/public/workspace/commons-collections-3.x/target/commons-collections-3.3-SNAPSHOT.jar:/srv/gump/public/workspace/apache-commons
 /digester/dist/commons-digester.jar:/srv/gump/public/workspace/apache-commons/jexl/target/commons-jexl-2.1-SNAPSHOT.jar:/srv/gump/public/workspace/commons-jelly/target/commons-jelly-27052010.jar:/srv/gump/public/workspace/commons-jelly/jelly-tags/ant/target/commons-jelly-tags-ant-27052010.jar:/srv/gump/public/workspace/commons-jelly/jelly-tags/define/target/commons-jelly-tags-define-27052010.jar:/srv/gump/public/workspace/commons-jelly/jelly-tags/util/target/commons-jelly-tags-util-27052010.jar:/srv/gump/public/workspace/commons-jelly/jelly-tags/xml/target/commons-jelly-tags-xml-27052010.jar:/srv/gump/public/workspace/commons-dormant/graph2/target/commons-graph-27052010.jar:/srv/gump/public/workspace/apache-commons/io/target/commons-io-2.0-SNAPSHOT.jar:/srv/gump/packages/jdepend-2.6/lib/jdepend.jar:/srv/gump/public/workspace/logging-log4j-12/dist/lib/log4j-27052010.jar:/srv/gump/public/workspace/xml-commons/java/build/which.jar:/srv/gump/public/workspace/xpp/build/xpp3_xpath
 -27052010.jar:/srv/gump/public/workspace/xpp/build/xpp3-27052010.jar:/srv/gump/public/workspace/xpp/build/xpp3_min-27052010.jar:/srv/gump/public/workspace/apache-commons/cli/target/commons-cli-27052010.jar:/srv/gump/public/workspace/apache-commons/lang/target/commons-lang-3.0-SNAPSHOT.jar:/srv/gump/public/workspace/apache-commons/logging/target/commons-logging-27052010.jar:/srv/gump/public/workspace/httpcomponents/oac.hc3x/dist/commons-httpclient.jar:/srv/gump/public/workspace/dom4j/build/dom4j.jar:/srv/gump/public/workspace/velocity-engine/bin/velocity-27052010.jar
---------------------------------------------
    [javac] symbol  : class TransferEvent
    [javac] location: class org.apache.maven.util.ConsoleDownloadMeter
    [javac]     public void transferStarted( TransferEvent transferEvent )
    [javac]                                  ^
    [javac] /srv/gump/public/workspace/maven/src/java/org/apache/maven/util/ConsoleDownloadMeter.java:50: cannot find symbol
    [javac] symbol  : class TransferEvent
    [javac] location: class org.apache.maven.util.ConsoleDownloadMeter
    [javac]     public void transferProgress( TransferEvent transferEvent, byte[] buffer, int length )
    [javac]                                   ^
    [javac] /srv/gump/public/workspace/maven/src/java/org/apache/maven/util/ConsoleDownloadMeter.java:57: cannot find symbol
    [javac] symbol  : class TransferEvent
    [javac] location: class org.apache.maven.util.ConsoleDownloadMeter
    [javac]     public void transferCompleted( TransferEvent transferEvent )
    [javac]                                    ^
    [javac] /srv/gump/public/workspace/maven/src/java/org/apache/maven/util/ConsoleDownloadMeter.java:63: cannot find symbol
    [javac] symbol  : class TransferEvent
    [javac] location: class org.apache.maven.util.ConsoleDownloadMeter
    [javac]     public void transferError( TransferEvent transferEvent )
    [javac]                                ^
    [javac] /srv/gump/public/workspace/maven/src/java/org/apache/maven/util/DVSLPathTool.java:21: package org.codehaus.plexus.util does not exist
    [javac] import org.codehaus.plexus.util.StringUtils;
    [javac]                                ^
    [javac] /srv/gump/public/workspace/maven/src/java/org/apache/maven/util/HttpUtils.java:28: package org.apache.maven.wagon does not exist
    [javac] import org.apache.maven.wagon.ConnectionException;
    [javac]                              ^
    [javac] /srv/gump/public/workspace/maven/src/java/org/apache/maven/util/HttpUtils.java:29: package org.apache.maven.wagon does not exist
    [javac] import org.apache.maven.wagon.Wagon;
    [javac]                              ^
    [javac] /srv/gump/public/workspace/maven/src/java/org/apache/maven/util/HttpUtils.java:30: package org.apache.maven.wagon.providers.file does not exist
    [javac] import org.apache.maven.wagon.providers.file.FileWagon;
    [javac]                                             ^
    [javac] /srv/gump/public/workspace/maven/src/java/org/apache/maven/util/HttpUtils.java:31: package org.apache.maven.wagon.providers.http does not exist
    [javac] import org.apache.maven.wagon.providers.http.HttpWagon;
    [javac]                                             ^
    [javac] /srv/gump/public/workspace/maven/src/java/org/apache/maven/util/HttpUtils.java:32: package org.apache.maven.wagon.proxy does not exist
    [javac] import org.apache.maven.wagon.proxy.ProxyInfo;
    [javac]                                    ^
    [javac] /srv/gump/public/workspace/maven/src/java/org/apache/maven/util/HttpUtils.java:33: package org.apache.maven.wagon.repository does not exist
    [javac] import org.apache.maven.wagon.repository.Repository;
    [javac]                                         ^
    [javac] Note: Some input files use or override a deprecated API.
    [javac] Note: Recompile with -Xlint:deprecation for details.
    [javac] Note: Some input files use unchecked or unsafe operations.
    [javac] Note: Recompile with -Xlint:unchecked for details.
    [javac] 100 errors

BUILD FAILED
/srv/gump/public/workspace/maven/build-bootstrap.xml:234: Compile failed; see the compiler error output for details.

Total time: 12 seconds
---------------------------------------------

To subscribe to this information via syndicated feeds:
- RSS: http://vmgump.apache.org/gump/public/maven/maven-bootstrap/rss.xml
- Atom: http://vmgump.apache.org/gump/public/maven/maven-bootstrap/atom.xml

============================== Gump Tracking Only ===
Produced by Gump version 2.3.
Gump Run 05001627052010, vmgump:vmgump-public:05001627052010
Gump E-mail Identifier (unique within run) #30.

*********************************************************** G U M P
[GUMP@vmgump]: Project maven (in module maven) failed
To whom it may engage...
        
This is an automated request, but not an unsolicited one. For 
more information please visit http://gump.apache.org/nagged.html, 
and/or contact the folk at general@gump.apache.org.

Project maven has an issue affecting its community integration.
This issue affects 1 projects.
The current state of this project is 'Failed', with reason 'Build Failed'.
For reference only, the following projects are affected by this:
    - maven :  Project Management Tools


Full details are available at:
    http://vmgump.apache.org/gump/public/maven/maven/index.html

That said, some information snippets are provided here.

The following annotations (debug/informational/warning/error messages) were provided:
 -DEBUG- Sole output [maven-27052010.jar] identifier set to project name
 -INFO- Made directory [/srv/gump/public/workspace/maven/target/classes]
 -INFO- Made directory [/srv/gump/public/workspace/maven/target/test-classes]
 -DEBUG- (Gump generated) Maven Properties in: /srv/gump/public/workspace/maven/build.properties
 -INFO- Failed with reason build failed
 -DEBUG- Maven POM in: /srv/gump/public/workspace/maven/project.xml
 -DEBUG- Maven project properties in: /srv/gump/public/workspace/maven/project.properties
 -INFO- Failed to extract fallback artifacts from Gump Repository



The following work was performed:
http://vmgump.apache.org/gump/public/maven/maven/gump_work/build_maven_maven.html
Work Name: build_maven_maven (Type: Build)
Work ended in a state of : Failed
Elapsed: 3 secs
Command Line: maven --offline jar 
[Working Directory: /srv/gump/public/workspace/maven]
CLASSPATH: /usr/lib/jvm/java-6-sun/lib/tools.jar:/srv/gump/public/workspace/maven/target/classes:/srv/gump/public/workspace/maven/target/test-classes:/srv/gump/public/workspace/ant/dist/lib/ant-jmf.jar:/srv/gump/public/workspace/ant/dist/lib/ant-swing.jar:/srv/gump/public/workspace/ant/dist/lib/ant-apache-resolver.jar:/srv/gump/public/workspace/ant/dist/lib/ant-apache-xalan2.jar:/srv/gump/public/workspace/ant/dist/lib/ant-junit.jar:/srv/gump/public/workspace/ant/dist/lib/ant-launcher.jar:/srv/gump/public/workspace/ant/dist/lib/ant.jar:/srv/gump/public/workspace/apache-commons/beanutils/dist/commons-beanutils-27052010.jar:/srv/gump/public/workspace/apache-commons/cli/target/commons-cli-27052010.jar:/srv/gump/public/workspace/commons-collections-3.x/target/commons-collections-3.3-SNAPSHOT.jar:/srv/gump/public/workspace/apache-commons/digester/dist/commons-digester.jar:/srv/gump/public/workspace/commons-dormant/graph2/target/commons-graph-27052010.jar:/srv/gump/public/workspace/
 httpcomponents/oac.hc3x/dist/commons-httpclient.jar:/srv/gump/public/workspace/apache-commons/io/target/commons-io-2.0-SNAPSHOT.jar:/srv/gump/public/workspace/commons-jelly/target/commons-jelly-27052010.jar:/srv/gump/public/workspace/commons-jelly/jelly-tags/ant/target/commons-jelly-tags-ant-27052010.jar:/srv/gump/public/workspace/commons-jelly/jelly-tags/define/target/commons-jelly-tags-define-27052010.jar:/srv/gump/public/workspace/commons-jelly/jelly-tags/util/target/commons-jelly-tags-util-27052010.jar:/srv/gump/public/workspace/commons-jelly/jelly-tags/xml/target/commons-jelly-tags-xml-27052010.jar:/srv/gump/public/workspace/apache-commons/jexl/target/commons-jexl-2.1-SNAPSHOT.jar:/srv/gump/public/workspace/apache-commons/lang/target/commons-lang-3.0-SNAPSHOT.jar:/srv/gump/public/workspace/apache-commons/logging/target/commons-logging-27052010.jar:/srv/gump/public/workspace/apache-commons/logging/target/commons-logging-api-27052010.jar:/srv/gump/public/workspace/dom4j/b
 uild/dom4j.jar:/srv/gump/public/workspace/logging-log4j-12/dist/lib/log4j-27052010.jar:/srv/gump/public/workspace/xml-commons/java/external/build/xml-apis-ext.jar:/srv/gump/public/workspace/xml-commons/java/build/which.jar:/srv/gump/public/workspace/xml-commons/java/build/resolver.jar:/srv/gump/public/workspace/xpp/build/xpp3-27052010.jar
---------------------------------------------
 __  __
|  \/  |__ _Apache__ ___
| |\/| / _` \ V / -_) ' \  ~ intelligent projects ~
|_|  |_\__,_|\_/\___|_||_|  v. 1.0.2

The build cannot continue because of the following unsatisfied dependencies:

jaxen-1.1-beta-9.jar
ant-nodeps-1.6.5.jar (try downloading from http://ant.apache.org/)
ant-trax-1.6.5.jar (try downloading from http://ant.apache.org/)
commons-codec-1.2.jar (try downloading from http://commons.apache.org/codec/)
xercesImpl-2.8.0.jar (try downloading from http://xerces.apache.org/xerces2-j/)
plexus-utils-1.0.5.jar
maven-model-3.0.2.jar
stax-1.2.0.jar
stax-api-1.0.1.jar
stax-utils-20060502.jar
wagon-provider-api-1.0-beta-2.jar
wagon-http-1.0-beta-2.jar
wagon-file-1.0-beta-2.jar
wagon-ssh-common-1.0-beta-2.jar
wagon-ssh-1.0-beta-2.jar
jsch-0.1.27.jar

Total time: 2 seconds
Finished at: Fri May 28 02:17:36 PDT 2010

---------------------------------------------

To subscribe to this information via syndicated feeds:
- RSS: http://vmgump.apache.org/gump/public/maven/maven/rss.xml
- Atom: http://vmgump.apache.org/gump/public/maven/maven/atom.xml

============================== Gump Tracking Only ===
Produced by Gump version 2.3.
Gump Run 05001627052010, vmgump:vmgump-public:05001627052010
Gump E-mail Identifier (unique within run) #33.


--
Apache Gump
http://gump.apache.org/ [Instance: vmgump]

---------------------------------------------------------------------
To unsubscribe, e-mail: general-unsubscribe@gump.apache.org
For additional commands, e-mail: general-help@gump.apache.org


Mime
View raw message