gump-general mailing list archives

Site index · List index
Message view « Date » · « Thread »
Top « Date » · « Thread »
From g...@vmgump.apache.org
Subject BATCH: All dressed up, with nowhere to go...
Date Sun, 28 Feb 2010 15:00:44 GMT
Dear Gumpmeisters,
            
The following 2 notifys should have been sent

*********************************************************** G U M P
[GUMP@vmgump]: Project portals-pluto-trunk (in module portals-pluto-trunk) failed
[GUMP@vmgump]: Project mina (in module mina) failed
*********************************************************** G U M P
[GUMP@vmgump]: Project portals-pluto-trunk (in module portals-pluto-trunk) failed
To whom it may engage...
        
This is an automated request, but not an unsolicited one. For 
more information please visit http://gump.apache.org/nagged.html, 
and/or contact the folk at general@gump.apache.org.

Project portals-pluto-trunk has an issue affecting its community integration.
This issue affects 2 projects.
The current state of this project is 'Failed', with reason 'Build Failed'.
For reference only, the following projects are affected by this:
    - portals-pluto-trunk :  JSR168 Container
    - portals-pluto-trunk-test :  JSR168 Container


Full details are available at:
    http://vmgump.apache.org/gump/public/portals-pluto-trunk/portals-pluto-trunk/index.html

That said, some information snippets are provided here.

The following annotations (debug/informational/warning/error messages) were provided:
 -INFO- Optional dependency jakarta-taglibs-standard prerequisite failed with reason build
failed
 -INFO- Optional dependency javax.servlet prerequisite failed with reason build failed
 -INFO- Optional dependency javax.servlet.jsp-in-servlet prerequisite failed with reason build
failed
 -DEBUG- (Gump generated) Maven2 Settings in: /srv/gump/public/workspace/portals-pluto-trunk/gump_mvn_settings.xml
 -INFO- Failed with reason build failed
 -DEBUG- Maven POM in: /srv/gump/public/workspace/portals-pluto-trunk/pom.xml



The following work was performed:
http://vmgump.apache.org/gump/public/portals-pluto-trunk/portals-pluto-trunk/gump_work/build_portals-pluto-trunk_portals-pluto-trunk.html
Work Name: build_portals-pluto-trunk_portals-pluto-trunk (Type: Build)
Work ended in a state of : Failed
Elapsed: 2 secs
Command Line: mvn --batch-mode -Dmaven.test.skip.exec=true --settings /srv/gump/public/workspace/portals-pluto-trunk/gump_mvn_settings.xml
package 
[Working Directory: /srv/gump/public/workspace/portals-pluto-trunk]
CLASSPATH: /usr/lib/jvm/java-6-sun/lib/tools.jar:servlet-api-gump-27022010.jar:/srv/gump/public/workspace/slf4j/slf4j-migrator/target/slf4j-migrator-1.5.9-SNAPSHOT.jar:/srv/gump/public/workspace/slf4j/slf4j-nop/target/slf4j-nop-1.5.9-SNAPSHOT.jar:/srv/gump/public/workspace/slf4j/log4j-over-slf4j/target/log4j-over-slf4j-1.5.9-SNAPSHOT.jar:/srv/gump/public/workspace/slf4j/slf4j-log4j12/target/slf4j-log4j12-1.5.9-SNAPSHOT.jar:/srv/gump/public/workspace/slf4j/slf4j-jcl/target/slf4j-jcl-1.5.9-SNAPSHOT.jar:/srv/gump/public/workspace/slf4j/slf4j-api/target/slf4j-api-1.5.9-SNAPSHOT.jar:/srv/gump/public/workspace/slf4j/jcl104-over-slf4j/target/jcl104-over-slf4j-1.5.9-SNAPSHOT.jar:/srv/gump/public/workspace/slf4j/slf4j-jdk14/target/slf4j-jdk14-1.5.9-SNAPSHOT.jar:/srv/gump/public/workspace/slf4j/slf4j-simple/target/slf4j-simple-1.5.9-SNAPSHOT.jar:/srv/gump/public/workspace/slf4j/slf4j-ext/target/slf4j-ext-1.5.9-SNAPSHOT.jar:/srv/gump/public/workspace/slf4j/jcl-over-slf4j/target/jcl-over
 -slf4j-1.5.9-SNAPSHOT.jar:/srv/gump/public/workspace/slf4j/jul-to-slf4j/target/jul-to-slf4j-1.5.9-SNAPSHOT.jar:/srv/gump/packages/ws-jaxme-0.5/lib/jaxme2-0.5.jar:/srv/gump/packages/ws-jaxme-0.5/lib/jaxmeapi-0.5.jar:/srv/gump/packages/ws-jaxme-0.5/lib/jaxme2-rt-0.5.jar:/srv/gump/packages/ws-jaxme-0.5/lib/jaxmepm-0.5.jar:/srv/gump/packages/ws-jaxme-0.5/lib/jaxmejs-0.5.jar:/srv/gump/packages/ws-jaxme-0.5/lib/jaxmexs-0.5.jar:jsp-api-gump-27022010.jar:/srv/gump/public/workspace/ant/dist/lib/ant-jmf.jar:/srv/gump/public/workspace/ant/dist/lib/ant-swing.jar:/srv/gump/public/workspace/ant/dist/lib/ant-apache-resolver.jar:/srv/gump/public/workspace/ant/dist/lib/ant-apache-xalan2.jar:/srv/gump/public/workspace/ant/dist/lib/ant-junit.jar:/srv/gump/public/workspace/ant/dist/lib/ant-launcher.jar:/srv/gump/public/workspace/ant/dist/lib/ant-nodeps.jar:/srv/gump/public/workspace/ant/dist/lib/ant.jar:/srv/gump/public/workspace/junit/dist/junit-28022010.jar:/srv/gump/packages/stax/jsr173_1.0_
 api.jar:/srv/gump/packages/stax/jsr173_1.0_ri.jar:jstl-gump-27022010.jar:standard-gump-27022010.jar
---------------------------------------------
	at org.apache.maven.cli.compat.CompatibleMain.main(CompatibleMain.java:60)
	at sun.reflect.NativeMethodAccessorImpl.invoke0(Native Method)
	at sun.reflect.NativeMethodAccessorImpl.invoke(NativeMethodAccessorImpl.java:39)
	at sun.reflect.DelegatingMethodAccessorImpl.invoke(DelegatingMethodAccessorImpl.java:25)
	at java.lang.reflect.Method.invoke(Method.java:597)
	at org.codehaus.classworlds.Launcher.launchEnhanced(Launcher.java:315)
	at org.codehaus.classworlds.Launcher.launch(Launcher.java:255)
	at org.codehaus.classworlds.Launcher.mainWithExitCode(Launcher.java:430)
	at org.codehaus.classworlds.Launcher.main(Launcher.java:375)
Caused by: org.apache.maven.project.ProjectBuildingException: Cannot find parent: org.apache.portals:portals-pom
for project: org.apache.portals.pluto:pluto:pom:2.0.1-SNAPSHOT for project org.apache.portals.pluto:pluto:pom:2.0.1-SNAPSHOT
	at org.apache.maven.project.DefaultMavenProjectBuilder.assembleLineage(DefaultMavenProjectBuilder.java:1396)
	at org.apache.maven.project.DefaultMavenProjectBuilder.buildInternal(DefaultMavenProjectBuilder.java:823)
	at org.apache.maven.project.DefaultMavenProjectBuilder.buildFromSourceFileInternal(DefaultMavenProjectBuilder.java:508)
	at org.apache.maven.project.DefaultMavenProjectBuilder.build(DefaultMavenProjectBuilder.java:200)
	at org.apache.maven.DefaultMaven.getProject(DefaultMaven.java:604)
	at org.apache.maven.DefaultMaven.collectProjects(DefaultMaven.java:487)
	at org.apache.maven.DefaultMaven.getProjects(DefaultMaven.java:391)
	... 12 more
Caused by: org.apache.maven.project.ProjectBuildingException: POM 'org.apache.portals:portals-pom'
not found in repository: Unable to download the artifact from any repository

  org.apache.portals:portals-pom:pom:1.3-SNAPSHOT

from the specified remote repositories:
  gump-central (http://localhost:8192/maven2)

 for project org.apache.portals:portals-pom
	at org.apache.maven.project.DefaultMavenProjectBuilder.findModelFromRepository(DefaultMavenProjectBuilder.java:605)
	at org.apache.maven.project.DefaultMavenProjectBuilder.assembleLineage(DefaultMavenProjectBuilder.java:1392)
	... 18 more
Caused by: org.apache.maven.artifact.resolver.ArtifactNotFoundException: Unable to download
the artifact from any repository

  org.apache.portals:portals-pom:pom:1.3-SNAPSHOT

from the specified remote repositories:
  gump-central (http://localhost:8192/maven2)


	at org.apache.maven.artifact.resolver.DefaultArtifactResolver.resolve(DefaultArtifactResolver.java:228)
	at org.apache.maven.artifact.resolver.DefaultArtifactResolver.resolve(DefaultArtifactResolver.java:90)
	at org.apache.maven.project.DefaultMavenProjectBuilder.findModelFromRepository(DefaultMavenProjectBuilder.java:558)
	... 19 more
Caused by: org.apache.maven.wagon.ResourceDoesNotExistException: Unable to download the artifact
from any repository
	at org.apache.maven.artifact.manager.DefaultWagonManager.getArtifact(DefaultWagonManager.java:404)
	at org.apache.maven.artifact.resolver.DefaultArtifactResolver.resolve(DefaultArtifactResolver.java:216)
	... 21 more
[INFO] ------------------------------------------------------------------------
[INFO] Total time: < 1 second
[INFO] Finished at: Sun Feb 28 11:48:22 PST 2010
[INFO] Final Memory: 1M/4M
[INFO] ------------------------------------------------------------------------
---------------------------------------------

To subscribe to this information via syndicated feeds:
- RSS: http://vmgump.apache.org/gump/public/portals-pluto-trunk/portals-pluto-trunk/rss.xml
- Atom: http://vmgump.apache.org/gump/public/portals-pluto-trunk/portals-pluto-trunk/atom.xml

============================== Gump Tracking Only ===
Produced by Gump version 2.3.
Gump Run 08000828022010, vmgump:vmgump-public:08000828022010
Gump E-mail Identifier (unique within run) #2.

*********************************************************** G U M P
[GUMP@vmgump]: Project mina (in module mina) failed
To whom it may engage...
        
This is an automated request, but not an unsolicited one. For 
more information please visit http://gump.apache.org/nagged.html, 
and/or contact the folk at general@gump.apache.org.

Project mina has an issue affecting its community integration.
This issue affects 3 projects.
The current state of this project is 'Failed', with reason 'Build Failed'.
For reference only, the following projects are affected by this:
    - kerberos-protocol :  Apache Kerberos Server
    - mina :  A Multipurpose Infrastrusture for Network Applications
    - mina-test :  A Multipurpose Infrastrusture for Network Applications


Full details are available at:
    http://vmgump.apache.org/gump/public/mina/mina/index.html

That said, some information snippets are provided here.

The following annotations (debug/informational/warning/error messages) were provided:
 -INFO- Optional dependency ant-contrib prerequisite failed with reason build failed
 -INFO- Optional dependency jakarta-tomcat-jni prerequisite failed with reason build failed
 -DEBUG- (Gump generated) Maven2 Settings in: /srv/gump/public/workspace/mina/gump_mvn_settings.xml
 -INFO- Failed with reason build failed
 -DEBUG- Maven POM in: /srv/gump/public/workspace/mina/pom.xml
 -INFO- Failed to extract fallback artifacts from Gump Repository



The following work was performed:
http://vmgump.apache.org/gump/public/mina/mina/gump_work/build_mina_mina.html
Work Name: build_mina_mina (Type: Build)
Work ended in a state of : Failed
Elapsed: 49 secs
Command Line: mvn --batch-mode -Dmaven.test.skip.exec=true --settings /srv/gump/public/workspace/mina/gump_mvn_settings.xml
install 
[Working Directory: /srv/gump/public/workspace/mina]
CLASSPATH: /usr/lib/jvm/java-6-sun/lib/tools.jar:/srv/gump/public/workspace/mina/legal/target/mina-legal-2.0.0-RC2-SNAPSHOT.jar:/srv/gump/public/workspace/ant/dist/lib/ant-jmf.jar:/srv/gump/public/workspace/ant/dist/lib/ant-swing.jar:/srv/gump/public/workspace/ant/dist/lib/ant-apache-resolver.jar:/srv/gump/public/workspace/ant/dist/lib/ant-apache-xalan2.jar:/srv/gump/public/workspace/ant/dist/lib/ant-junit.jar:/srv/gump/public/workspace/ant/dist/lib/ant-launcher.jar:/srv/gump/public/workspace/ant/dist/lib/ant-nodeps.jar:/srv/gump/public/workspace/ant/dist/lib/ant.jar:/srv/gump/packages/cglib/cglib-nodep-2.1_3.jar:/srv/gump/public/workspace/apache-commons/net/dist/commons-net-28022010.jar:/srv/gump/packages/emma-2.0.5312/lib/emma.jar:/srv/gump/packages/emma-2.0.5312/lib/emma_ant.jar:/srv/gump/public/workspace/junit/dist/junit-28022010.jar:/srv/gump/public/workspace/maven-emma-plugin/target/maven-emma-plugin-28022010.jar:/srv/gump/packages/maven-site-plugin/maven-site-plugin-1.
 6.1.jar:/srv/gump/public/workspace/slf4j/slf4j-simple/target/slf4j-simple-1.5.9-SNAPSHOT.jar:/srv/gump/packages/spring-framework-1.2.6/dist/spring-beans.jar:/srv/gump/packages/spring-framework-1.2.6/dist/spring-core.jar:/srv/gump/packages/jsse1.0.3/lib/jcert.jar:/srv/gump/packages/jsse1.0.3/lib/jnet.jar:/srv/gump/packages/jsse1.0.3/lib/jsse.jar:/srv/gump/public/workspace/ant-contrib/target/ant-contrib-28022010.jar:tomcat-apr-gump-27022010.jar
---------------------------------------------
[WARNING] Removing: jar from forked lifecycle, to prevent recursive invocation.
[INFO] No goals needed for project - skipping
[INFO] [source:jar {execution: attach-source}]
[INFO] Building jar: /srv/gump/public/workspace/mina/core/target/mina-core-2.0.0-RC2-SNAPSHOT-sources.jar
[INFO] [install:install {execution: default-install}]
[INFO] Installing /srv/gump/public/workspace/mina/core/target/mina-core-2.0.0-RC2-SNAPSHOT.jar
to /srv/gump/public/workspace/mvnlocalrepo/org/apache/mina/mina-core/2.0.0-RC2-SNAPSHOT/mina-core-2.0.0-RC2-SNAPSHOT.jar
[INFO] Installing /srv/gump/public/workspace/mina/core/target/mina-core-2.0.0-RC2-SNAPSHOT-sources.jar
to /srv/gump/public/workspace/mvnlocalrepo/org/apache/mina/mina-core/2.0.0-RC2-SNAPSHOT/mina-core-2.0.0-RC2-SNAPSHOT-sources.jar
[INFO] [bundle:install {execution: default-install}]
[INFO] Parsing file:/srv/gump/public/workspace/mvnlocalrepo/repository.xml
[INFO] Installing org/apache/mina/mina-core/2.0.0-RC2-SNAPSHOT/mina-core-2.0.0-RC2-SNAPSHOT.jar
[INFO] Writing OBR metadata
[INFO] ------------------------------------------------------------------------
[INFO] Building Apache MINA APR Transport
[INFO]    task-segment: [install]
[INFO] ------------------------------------------------------------------------
Downloading: http://localhost:8192/maven2/tomcat/tomcat-apr/5.5.23/tomcat-apr-5.5.23.pom

Downloading: http://localhost:8192/maven2/tomcat/tomcat-parent/5.5.23/tomcat-parent-5.5.23.pom

[INFO] snapshot org.apache.mina:mina-core:2.0.0-RC2-SNAPSHOT: checking for updates from apache.snapshots
Downloading: http://localhost:8192/maven2/tomcat/tomcat-apr/5.5.23/tomcat-apr-5.5.23.jar
[WARNING] *** CHECKSUM FAILED - Checksum failed on download: local = '6145a85f3b83e0628e15c6e4edd9a76147fd61f2';
remote = '<html>
<head>
' - RETRYING
[WARNING] *** CHECKSUM FAILED - Checksum failed on download: local = '6145a85f3b83e0628e15c6e4edd9a76147fd61f2';
remote = '<html>
<head>
' - IGNORING

[INFO] ------------------------------------------------------------------------
[ERROR] BUILD ERROR
[INFO] ------------------------------------------------------------------------
[INFO] Failed to resolve artifact.

Unable to read local copy of metadata: Cannot read metadata from '/srv/gump/public/workspace/mvnlocalrepo/org/apache/mina/mina-core/2.0.0-RC2-SNAPSHOT/maven-metadata-apache.snapshots.xml':
end tag name </p> must match start tag name <br> from line 6 (position: TEXT seen
...<a href="/">home page</a>.\n</p>... @8:5) 
  org.apache.mina:mina-core:jar:2.0.0-RC2-SNAPSHOT


Path to dependency: 
	1) org.apache.mina:mina-transport-apr:bundle:2.0.0-RC2-SNAPSHOT
	2) org.apache.mina:mina-core:jar:2.0.0-RC2-SNAPSHOT



[INFO] ------------------------------------------------------------------------
[INFO] For more information, run Maven with the -e switch
[INFO] ------------------------------------------------------------------------
[INFO] Total time: 48 seconds
[INFO] Finished at: Sun Feb 28 12:04:39 PST 2010
[INFO] Final Memory: 39M/76M
[INFO] ------------------------------------------------------------------------
---------------------------------------------

To subscribe to this information via syndicated feeds:
- RSS: http://vmgump.apache.org/gump/public/mina/mina/rss.xml
- Atom: http://vmgump.apache.org/gump/public/mina/mina/atom.xml

============================== Gump Tracking Only ===
Produced by Gump version 2.3.
Gump Run 08000828022010, vmgump:vmgump-public:08000828022010
Gump E-mail Identifier (unique within run) #3.


--
Apache Gump
http://gump.apache.org/ [Instance: vmgump]

---------------------------------------------------------------------
To unsubscribe, e-mail: general-unsubscribe@gump.apache.org
For additional commands, e-mail: general-help@gump.apache.org


Mime
View raw message